%YAML 1.1
%TAG !u! tag:unity3d.com,2011:
--- !u!134 &13400000
PhysicMaterial:
  m_ObjectHideFlags: 0
  m_PrefabParentObject: {fileID: 0}
  m_PrefabInternal: {fileID: 0}
  m_Name: default_physx
  dynamicFriction: 0.4
  staticFriction: 0.4
  bounciness: 1
  frictionCombine: 0
  bounceCombine: 0
