%YAML 1.1
%TAG !u! tag:unity3d.com,2011:
--- !u!21 &2100000
Material:
  serializedVersion: 6
  m_ObjectHideFlags: 0
  m_CorrespondingSourceObject: {fileID: 0}
  m_PrefabInternal: {fileID: 0}
  m_Name: WoodenCrate_01
  m_Shader: {fileID: 4800000, guid: b9f531c13fb5567489d789786c63432c, type: 3}
  m_ShaderKeywords: SILHOUETTE_CURVATURE_BASIC _METALLICGLOSSMAP _NORMALMAP _SNOW
    _SPECGLOSSMAP _WETNESS_FULL
  m_LightmapFlags: 4
  m_EnableInstancingVariants: 0
  m_DoubleSidedGI: 0
  m_CustomRenderQueue: -1
  stringTagMap: {}
  disabledShaderPasses: []
  m_SavedProperties:
    serializedVersion: 3
    m_TexEnvs:
    - _BumpMap:
        m_Texture: {fileID: 2800000, guid: 768cb1792f5101744a792e7359b1dcf9, type: 3}
        m_Scale: {x: 1, y: 1}
        m_Offset: {x: 0, y: 0}
    - _BumpMap2:
        m_Texture: {fileID: 0}
        m_Scale: {x: 1, y: 1}
        m_Offset: {x: 0, y: 0}
    - _DetailAlbedoMap:
        m_Texture: {fileID: 0}
        m_Scale: {x: 1, y: 1}
        m_Offset: {x: 0, y: 0}
    - _DetailMask:
        m_Texture: {fileID: 0}
        m_Scale: {x: 1, y: 1}
        m_Offset: {x: 0, y: 0}
    - _DetailNormalMap:
        m_Texture: {fileID: 0}
        m_Scale: {x: 1, y: 1}
        m_Offset: {x: 0, y: 0}
    - _DropletsMap:
        m_Texture: {fileID: 2800000, guid: 471631afc291fae4087fd072b5dbe4f3, type: 3}
        m_Scale: {x: 1, y: 1}
        m_Offset: {x: 0, y: 0}
    - _EmissionMap:
        m_Texture: {fileID: 0}
        m_Scale: {x: 1, y: 1}
        m_Offset: {x: 0, y: 0}
    - _MainTex:
        m_Texture: {fileID: 2800000, guid: cf8241eae7a294943a043a7e4bf8f29c, type: 3}
        m_Scale: {x: 1, y: 1}
        m_Offset: {x: 0, y: 0}
    - _MainTex2:
        m_Texture: {fileID: 0}
        m_Scale: {x: 1, y: 1}
        m_Offset: {x: 0, y: 0}
    - _MetallicGlossMap:
        m_Texture: {fileID: 2800000, guid: cf8241eae7a294943a043a7e4bf8f29c, type: 3}
        m_Scale: {x: 1, y: 1}
        m_Offset: {x: 0, y: 0}
    - _MetallicGlossMapDetail:
        m_Texture: {fileID: 0}
        m_Scale: {x: 1, y: 1}
        m_Offset: {x: 0, y: 0}
    - _ObjectNormalsTex:
        m_Texture: {fileID: 0}
        m_Scale: {x: 1, y: 1}
        m_Offset: {x: 0, y: 0}
    - _ObjectTangentsTex:
        m_Texture: {fileID: 0}
        m_Scale: {x: 1, y: 1}
        m_Offset: {x: 0, y: 0}
    - _OcclusionMap:
        m_Texture: {fileID: 2800000, guid: 6e1ed51b4041f744da4be259a6ba3fea, type: 3}
        m_Scale: {x: 1, y: 1}
        m_Offset: {x: 0, y: 0}
    - _ParallaxMap:
        m_Texture: {fileID: 0}
        m_Scale: {x: 1, y: 1}
        m_Offset: {x: 0, y: 0}
    - _ParallaxMap2:
        m_Texture: {fileID: 0}
        m_Scale: {x: 1, y: 1}
        m_Offset: {x: 0, y: 0}
    - _RippleMap:
        m_Texture: {fileID: 2800000, guid: 4d78c388d122b294d9dad82d13d2d3bc, type: 3}
        m_Scale: {x: 1, y: 1}
        m_Offset: {x: 0, y: 0}
    - _RippleMapSnow:
        m_Texture: {fileID: 2800000, guid: 4d78c388d122b294d9dad82d13d2d3bc, type: 3}
        m_Scale: {x: 1, y: 1}
        m_Offset: {x: 0, y: 0}
    - _RippleMapWet:
        m_Texture: {fileID: 2800000, guid: 4d78c388d122b294d9dad82d13d2d3bc, type: 3}
        m_Scale: {x: 1, y: 1}
        m_Offset: {x: 0, y: 0}
    - _SparkleMap:
        m_Texture: {fileID: 2800000, guid: 8311693489c9728459f451148124b4ae, type: 3}
        m_Scale: {x: 1, y: 1}
        m_Offset: {x: 0, y: 0}
    - _SparkleMapGlitter:
        m_Texture: {fileID: 2800000, guid: 8311693489c9728459f451148124b4ae, type: 3}
        m_Scale: {x: 1, y: 1}
        m_Offset: {x: 0, y: 0}
    - _SparkleMapSnow:
        m_Texture: {fileID: 2800000, guid: 8311693489c9728459f451148124b4ae, type: 3}
        m_Scale: {x: 1, y: 1}
        m_Offset: {x: 0, y: 0}
    - _SpecGlossMap:
        m_Texture: {fileID: 2800000, guid: 4184efd6d192833438680957be663f6d, type: 3}
        m_Scale: {x: 1, y: 1}
        m_Offset: {x: 0, y: 0}
    - _SpecGlossMap2:
        m_Texture: {fileID: 0}
        m_Scale: {x: 1, y: 1}
        m_Offset: {x: 0, y: 0}
    - _SpecularRGBGlossADetail:
        m_Texture: {fileID: 0}
        m_Scale: {x: 1, y: 1}
        m_Offset: {x: 0, y: 0}
    m_Floats:
    - _BendNormalsFreq: 4
    - _BendNormalsStrength: 0.05
    - _BumpScale: 1
    - _BumpScale2: 1
    - _CurvatureCustomU: 0
    - _CurvatureCustomV: 0
    - _CurvatureMultU: 1
    - _CurvatureMultV: 1
    - _Cutoff: 0.5
    - _DecalMask: 1
    - _DecalMaskGUI: 3
    - _Depth: 0.1
    - _DepthReductionDistance: 20
    - _DepthWrite: 0
    - _DetailEmissiveness: 0
    - _DetailGloss: 1
    - _DetailMetalness: 1
    - _DetailNormalLerp: 0
    - _DetailNormalMapScale: 1
    - _DetailSpecLerp: 1
    - _DetailUVMult: 1
    - _DiffuseScatter: 1
    - _DiffuseScatteringExponent: 8
    - _DiffuseScatteringOffset: 0
    - _DistSteps: 64
    - _DistStepsShadows: 64
    - _DropletsAnimSpeed: 10
    - _DropletsTiling: 1
    - _DstBlend: 0
    - _EmissionPulsateSpeed: 0
    - _FlowCycleScale: 2
    - _Frost: 0
    - _FrostFromGlobal: 0
    - _Glitter: 0
    - _GlitterAnimationFrequency: 0.02
    - _GlitterColorization: 0.2
    - _GlitterDensity: 0.2
    - _GlitterFilter: -1
    - _GlitterMask: 0
    - _GlitterShown: 1
    - _GlitterTiling: 1
    - _GlossMapScale: 1
    - _GlossMax: 1
    - _GlossMin: 0.75
    - _Glossiness: 0.1
    - _Glossiness2: 1
    - _GlossyReflections: 1
    - _MainShown: 1
    - _Metallic: 0
    - _MinPulseBrightness: 0
    - _Mode: 0
    - _OcclusionStrength: 1
    - _OcclusionStrength2: 0
    - _Occlusion_from_albedo_alpha: 0
    - _POM: 0
    - _POMCurvatureType: 0
    - _POMPrecomputedFlag: 0
    - _POMShadows: 0
    - _POMShown: 1
    - _POM_BottomCut: 0
    - _POM_ExtrudeVolume: 0
    - _POM_MeshIsVolume: 0
    - _PanEmissionMask: 0
    - _PanUSpeed: 0
    - _PanVSpeed: 0
    - _Parallax: 0.02
    - _Parallax2: 0.04
    - _Phong: 0
    - _Pierceable: 0
    - _PresetsShown: 0
    - _PulsateEmission: 0
    - _RainIntensity: 1
    - _RainIntensityFromGlobal: 0
    - _Refraction: 0.02
    - _RefractionBumpScale: 0.5
    - _RefractionChromaticAberration: 0
    - _ReliefMIPbias: 0
    - _RippleAnimSpeed: 0.5
    - _RippleRefraction: 0.3
    - _RippleSpecFilter: 0.02
    - _RippleStrength: 0.5
    - _RippleStrengthFromGlobal: 0
    - _RippleTiling: 1
    - _SecOcclusionStrength: 0
    - _SecondaryShown: 1
    - _ShadowCull: 2
    - _ShadowMIPbias: 0
    - _ShadowStrength: 1
    - _SmoothnessTextureChannel: 0
    - _Smoothness_from_albedo_alpha: 0
    - _Snow: 1
    - _SnowBumpMacro: 0.1
    - _SnowBumpMicro: 0.08
    - _SnowBumpMicroFromGlobal: 0
    - _SnowDeepSmoothen: 4
    - _SnowDiffuseScatteringExponent: 6
    - _SnowDiffuseScatteringOffset: 0.4
    - _SnowDissolve: 2
    - _SnowDissolveFromGlobal: 0
    - _SnowDissolveMaskOcclusion: 0
    - _SnowGlitterColorFromGlobal: 0
    - _SnowHeightThreshold: -10000
    - _SnowHeightThresholdTransition: 1000
    - _SnowLevelFromGlobal: 1
    - _SnowMacroTiling: 1
    - _SnowMicroTiling: 4
    - _SnowShown: 1
    - _SnowSlopeDamp: 2
    - _SnowSpecGlossFromGlobal: 0
    - _SnowWorldMapping: 0
    - _Softness: 2
    - _SoftnessFade: 0.4
    - _SpecularHighlights: 1
    - _SrcBlend: 1
    - _Tan2ObjCustomU: 1
    - _Tan2ObjCustomV: 1
    - _Tan2ObjMultU: 1
    - _Tan2ObjMultV: 1
    - _Tess: 9
    - _TessDepth: 0.05
    - _TessEdgeLengthLimit: 5
    - _TessOffset: 0.1
    - _Translucency: 0
    - _TranslucencyConstant: 0.1
    - _TranslucencyDeferredLightIndex: 0
    - _TranslucencyExponent: 30
    - _TranslucencyNDotL: 0
    - _TranslucencyNormalOffset: 0.05
    - _TranslucencyOcclusion: 0
    - _TranslucencyPointLightDirectionality: 0.7
    - _TranslucencyShown: 1
    - _TranslucencyStrength: 4
    - _TranslucencySuppressRealtimeShadows: 0.5
    - _UVSec: 0
    - _UVSecOcclusion: 0
    - _UVSecOcclusionLightmapPacked: 0
    - _UV_Clip: 0
    - _WetDroplets: 1
    - _WetRipples: 1
    - _Wetness: 1
    - _WetnessConst: 0
    - _WetnessConstFromGlobal: 0
    - _WetnessDarkening: 2
    - _WetnessEmissiveness: 0
    - _WetnessEmissivenessWrap: 0
    - _WetnessFlowGlobalTime: 1
    - _WetnessLevel: 1
    - _WetnessLevelFromGlobal: 1
    - _WetnessMergeWithSnowPerMaterial: 0
    - _WetnessNormMIP: 5
    - _WetnessNormStrength: 2
    - _WetnessNormalInfluence: 0.5
    - _WetnessShown: 1
    - _WetnessUVMult: 1
    - _ZWrite: 1
    - maxDist: 10
    - minDist: 1
    m_Colors:
    - _Color: {r: 0.75, g: 0.75, b: 0.75, a: 1}
    - _Color2: {r: 1, g: 1, b: 1, a: 1}
    - _CurvatureMultOffset: {r: 0, g: 0, b: 0, a: 0}
    - _CutoffEdgeGlow: {r: 0, g: 0, b: 0, a: 0.02}
    - _DetailColor: {r: 1, g: 1, b: 1, a: 1}
    - _DetailSpecGloss: {r: 1, g: 1, b: 1, a: 1}
    - _DiffuseScatteringColor: {r: 0, g: 0, b: 0, a: 0}
    - _DiffuseScatteringColor2: {r: 0, g: 0, b: 0, a: 0}
    - _EmissionColor: {r: 0, g: 0, b: 0, a: 1}
    - _GlitterColor: {r: 0.8, g: 0.8, b: 0.8, a: 0.2}
    - _GlitterColor2: {r: 0.8, g: 0.8, b: 0.8, a: 0.2}
    - _SnowColorAndCoverage: {r: 1, g: 1, b: 1, a: 1}
    - _SnowDiffuseScatteringColor: {r: 1, g: 1, b: 1, a: 0}
    - _SnowEmissionTransparency: {r: 0.09999997, g: 0.09999997, b: 0.09999997, a: 1}
    - _SnowGlitterColor: {r: 0.8, g: 0.8, b: 0.8, a: 0.2}
    - _SnowSpecGloss: {r: 0.09999997, g: 0.09999997, b: 0.09999997, a: 0.15}
    - _SnowTranslucencyColor: {r: 0.75, g: 1, b: 1, a: 1}
    - _SpecColor: {r: 0.75, g: 0.75, b: 0.75, a: 1}
    - _SpecColor2: {r: 1, g: 1, b: 1, a: 1}
    - _Tan2ObjectMultOffset: {r: 0, g: 0, b: 1, a: 1}
    - _TranslucencyColor: {r: 1, g: 1, b: 1, a: 1}
    - _TranslucencyColor2: {r: 1, g: 1, b: 1, a: 1}
    - _UV_Clip_Borders: {r: 0, g: 0, b: 1, a: 1}
    - _WetnessColor: {r: 0, g: 0, b: 0, a: 0}
    - _WetnessSpecGloss: {r: 0.049999982, g: 0.049999982, b: 0.049999982, a: 0.7}
    - bumpMap2TexelSize: {r: 1, g: 1, b: 1, a: 1}
    - bumpMapTexelSize: {r: 0.001953125, g: 0.001953125, b: 512, a: 512}
    - heightMapTexelSize: {r: 1, g: 1, b: 1, a: 1}
