{
  "project_info": {
    "project_number": "982349938888",
    "firebase_url": "https://recipeproject-75fb0.firebaseio.com",
    "project_id": "recipeproject-75fb0",
    "storage_bucket": "recipeproject-75fb0.appspot.com"
  },
  "client": [
    {
      "client_info": {
        "mobilesdk_app_id": "1:982349938888:android:8ce3288fec4fde0e",
        "android_client_info": {
          "package_name": "com.example.ivan.firebaseauthdemo"
        }
      },
      "oauth_client": [
        {
          "client_id": "982349938888-o95so3uti1h0qpes9o70lfr5j7cg9u75.apps.googleusercontent.com",
          "client_type": 3
        }
      ],
      "api_key": [
        {
          "current_key": "AIzaSyBn6OpCSacuolzyvzjuxpwnB_KwXoFTnRc"
        }
      ],
      "services": {
        "analytics_service": {
          "status": 1
        },
        "appinvite_service": {
          "status": 1,
          "other_platform_oauth_client": []
        },
        "ads_service": {
          "status": 2
        }
      }
    },
    {
      "client_info": {
        "mobilesdk_app_id": "1:982349938888:android:b472303e3d5b6190",
        "android_client_info": {
          "package_name": "recipe.android.com.recipeappfinal"
        }
      },
      "oauth_client": [
        {
          "client_id": "982349938888-8mhk8p8qnc7nc0209kp605u7j9ouf033.apps.googleusercontent.com",
          "client_type": 1,
          "android_info": {
            "package_name": "recipe.android.com.recipeappfinal",
            "certificate_hash": "dcd2f3a20c07f2ff92d7cefcabc130da0a501856"
          }
        },
        {
          "client_id": "982349938888-o95so3uti1h0qpes9o70lfr5j7cg9u75.apps.googleusercontent.com",
          "client_type": 3
        }
      ],
      "api_key": [
        {
          "current_key": "AIzaSyBn6OpCSacuolzyvzjuxpwnB_KwXoFTnRc"
        }
      ],
      "services": {
        "analytics_service": {
          "status": 1
        },
        "appinvite_service": {
          "status": 2,
          "other_platform_oauth_client": [
            {
              "client_id": "982349938888-o95so3uti1h0qpes9o70lfr5j7cg9u75.apps.googleusercontent.com",
              "client_type": 3
            }
          ]
        },
        "ads_service": {
          "status": 2
        }
      }
    }
  ],
  "configuration_version": "1"
}