<svg xmlns="http://www.w3.org/2000/svg" width="17.474" height="16.083" viewBox="0 0 17.474 16.083">
  <g id="menu" transform="translate(-6258.275 -423.438)" opacity="0.5">
    <g id="boton-de-menu" transform="translate(6258.275 423.438)">
      <g id="menu-2" data-name="menu" transform="translate(0 0)">
        <path id="Path_761" data-name="Path 761" d="M0,92.583H17.474V89.9H0Zm0-6.7H17.474V83.2H0ZM0,76.5v2.681H17.474V76.5Z" transform="translate(0 -76.5)" fill="#fff"/>
      </g>
    </g>
  </g>
</svg>
