<svg id="usuario" xmlns="http://www.w3.org/2000/svg" width="16.129" height="18.351" viewBox="0 0 16.129 18.351">
  <g id="Group_2" data-name="Group 2" transform="translate(3.226)">
    <g id="Group_1" data-name="Group 1">
      <path id="Path_1" data-name="Path 1" d="M125.838,0a4.839,4.839,0,1,0,4.839,4.839A4.844,4.844,0,0,0,125.838,0Z" transform="translate(-120.999)"/>
    </g>
  </g>
  <g id="Group_4" data-name="Group 4" transform="translate(0 10.824)">
    <g id="Group_3" data-name="Group 3">
      <path id="Path_2" data-name="Path 2" d="M47.038,305.465A7.766,7.766,0,0,0,40.563,302h-3a7.766,7.766,0,0,0-6.475,3.465L31,305.6v3.926H47.128V305.6Z" transform="translate(-30.999 -302)"/>
    </g>
  </g>
</svg>
