<svg xmlns="http://www.w3.org/2000/svg" width="48" height="48" viewBox="0 0 48 48">
  <g id="pause" transform="translate(-193 -195)">
    <circle id="Ellipse_4" data-name="Ellipse 4" cx="24" cy="24" r="24" transform="translate(193 195)" fill="rgba(0,0,0,0.3)"/>
    <g id="pausa" transform="translate(210.192 209.523)">
      <path id="Path_771" data-name="Path 771" d="M150.44,0h3.908a.44.44,0,0,1,.44.44V17.56a.44.44,0,0,1-.44.44H150.44a.44.44,0,0,1-.44-.44V.44A.44.44,0,0,1,150.44,0Zm0,0" transform="translate(-141.743)" fill="#8c9095"/>
      <path id="Path_772" data-name="Path 772" d="M.44,0H4.349a.44.44,0,0,1,.44.44V17.56a.44.44,0,0,1-.44.44H.44A.44.44,0,0,1,0,17.56V.44A.44.44,0,0,1,.44,0Zm0,0" fill="#8c9095"/>
    </g>
  </g>
</svg>
