<svg xmlns="http://www.w3.org/2000/svg" width="49" height="44.657" viewBox="0 0 49 44.657">
  <g id="Group_531" data-name="Group 531" transform="translate(-1216.609 -242.666)">
    <path id="Subtraction_1" data-name="Subtraction 1" d="M44.852,43.657H3.461a3.371,3.371,0,0,1-1.091-.181,2.994,2.994,0,0,1-.941-.383A3.033,3.033,0,0,1,.18,41.556,3,3,0,0,1,0,40.529V3.018A3.021,3.021,0,0,1,3.018,0H20.774a3.021,3.021,0,0,1,3.017,3.018v16.71H44.852A3.152,3.152,0,0,1,48,22.876V40.509A3.152,3.152,0,0,1,44.852,43.657ZM42.456,21.5V41.885h2.157a1.616,1.616,0,0,0,1.615-1.614V23.114A1.616,1.616,0,0,0,44.613,21.5ZM23.8,21.45V41.872H40.467V21.45ZM1.847,36.154V40.27a1.617,1.617,0,0,0,.992,1.489,1.241,1.241,0,0,0,.178.014H20.774a1.247,1.247,0,0,0,1.245-1.245V36.154ZM1.856,5.743V34.382h20.08V5.743Zm1.162-3.97A1.247,1.247,0,0,0,1.772,3.018V3.97H22.019V3.018a1.247,1.247,0,0,0-1.245-1.245Z" transform="translate(1217.109 243.166)" fill="#feb902" stroke="rgba(0,0,0,0)" stroke-miterlimit="10" stroke-width="1"/>
    <path id="Union_1" data-name="Union 1" d="M17.741,18.789l-5.164-2.87a1.049,1.049,0,1,1,1.02-1.835l3.544,1.969c-1.091-5.871-3.989-9.985-8.627-12.241A17.283,17.283,0,0,0,1.095,2.1,1.05,1.05,0,0,1,1,.005,19.1,19.1,0,0,1,9.345,1.883c3.543,1.7,7.9,5.264,9.627,12.685l1.359-2.316a1.05,1.05,0,1,1,1.81,1.062L19.156,18.4a1.049,1.049,0,0,1-1.415.386Z" transform="translate(1240.548 243.256)" fill="#feb902"/>
    <rect id="Rectangle_563" data-name="Rectangle 563" width="6.297" height="2.304" rx="1.152" transform="translate(1226.134 279.96)" fill="#feb902"/>
  </g>
</svg>
