<story path="stories/StandUpComedianRequests.story" title="">
<meta>
<property keyword="@" name="author" value="iva"/>
</meta>
<narrative keyword="Narrative:">
  <inOrderTo keyword="As a">user</inOrderTo>
  <asA keyword="I want to">perform an action</asA>
  <iWantTo keyword="So that">I can achieve a business goal</iWantTo>
</narrative>
<scenario keyword="Scenario:" title="Check in StandUpComedian request">
<step outcome="successful">Given Click <parameter>xpath.curtain</parameter> element</step>
<step outcome="successful">Given I wil wait for a <parameter>3</parameter> seconds</step>
<step outcome="successful">When Click <parameter>xpath.clickOnTheStandUpRequest</parameter> element</step>
<step outcome="successful">Given I wil wait for a <parameter>3</parameter> seconds</step>
<step outcome="successful">Then I should see <parameter>xpath.resultTitleStandUpComedianRequest</parameter> element</step>
</scenario>
</story>
