{
	"id": "6f90e711-abf0-4054-aa3c-22bbbc7a95c8",
	"name": "Funimation mock server",
	"values": [
		{
			"key": "url",
			"value": "https://347ac9e4-7aa6-4eb5-8744-8839d3331cc0.mock.pstmn.io",
			"enabled": true
		},
		{
			"key": "apikey",
			"value": "dsdfsd76sfda87687fds37",
			"enabled": true
		},
		{
			"key": "userID",
			"value": 844,
			"enabled": true
		},
		{
			"key": "user_firstName",
			"value": "Krem",
			"enabled": true
		},
		{
			"key": "user_lastName",
			"value": "Georgieva",
			"enabled": true
		},
		{
			"key": "countryName",
			"value": "Bulgaria",
			"enabled": true
		},
		{
			"key": "countryID",
			"value": "12",
			"enabled": true
		},
		{
			"key": "cityID",
			"value": "23",
			"enabled": true
		},
		{
			"key": "cityName",
			"value": "Sofia",
			"enabled": true
		},
		{
			"key": "ocupationID",
			"value": "2",
			"enabled": true
		},
		{
			"key": "ocupation_area",
			"value": "Comedian",
			"enabled": true
		},
		{
			"key": "userEmail",
			"value": "krem@yahoo.com",
			"enabled": true
		},
		{
			"key": "postTitle",
			"value": "example title",
			"enabled": true
		},
		{
			"key": "postContent",
			"value": "Hello everybody!",
			"enabled": true
		},
		{
			"key": "post_submitted_time",
			"value": "12-11-2019",
			"enabled": true
		},
		{
			"key": "postID",
			"value": null,
			"enabled": true
		},
		{
			"key": "email",
			"value": "kreml044fje6x7@abv.bg",
			"enabled": true
		}
	],
	"_postman_variable_scope": "environment",
	"_postman_exported_at": "2019-11-29T20:26:02.825Z",
	"_postman_exported_using": "Postman/7.12.0"
}