{
	"info": {
		"_postman_id": "22ddc119-c9eb-4b8a-a363-60188a3feb43",
		"name": "Funimation mock server",
		"description": "Autorization: Go to the getpostman.com and sign up.",
		"schema": "https://schema.getpostman.com/json/collection/v2.1.0/collection.json"
	},
	"item": [
		{
			"name": "Add a new post",
			"event": [
				{
					"listen": "test",
					"script": {
						"id": "1a587feb-7332-4cf9-b377-90d7141d33d6",
						"exec": [
							"",
							"const jsonData = pm.response.json();",
							"",
							"//Save a return ID as a variable",
							"pm.environment.set(\"postID\", jsonData.id);",
							"",
							"pm.test(\"A numeric id is returned\", function(){",
							"    pm.expect(jsonData).to.be.an(\"object\");",
							"    pm.expect(jsonData.postID).to.be.a(\"number\");",
							"    pm.expect(jsonData.postID).is.above(0);",
							"});",
							"",
							"",
							"pm.test(\"Successful POST request\", function () {",
							"    pm.expect(pm.response.code).to.be.oneOf([ 201,202]);",
							"});"
						],
						"type": "text/javascript"
					}
				}
			],
			"request": {
				"method": "POST",
				"header": [
					{
						"key": "Content-Type",
						"value": "application/json",
						"type": "text"
					}
				],
				"body": {
					"mode": "formdata",
					"formdata": [
						{
							"key": "userId",
							"value": "{{userID}}",
							"type": "text"
						},
						{
							"key": "userFirstName",
							"value": "{{user_firstName}}",
							"type": "text"
						},
						{
							"key": "userLastName",
							"value": "{{user_lastName}}",
							"type": "text"
						},
						{
							"key": "userEmail",
							"value": "{{userEmail}}",
							"type": "text"
						},
						{
							"key": "postTitle",
							"value": "{{postTitle}}",
							"type": "text"
						},
						{
							"key": "postContent",
							"value": "{{postContent}}",
							"type": "text"
						},
						{
							"key": "postSubmittedtime",
							"value": "{{post_submitted_time}}",
							"type": "text"
						}
					]
				},
				"url": {
					"raw": "{{url}}/posts",
					"host": [
						"{{url}}"
					],
					"path": [
						"posts"
					]
				}
			},
			"response": [
				{
					"name": "Add a new post  ",
					"originalRequest": {
						"method": "POST",
						"header": [
							{
								"key": "Content-Type",
								"name": "Content-Type",
								"value": "application/json",
								"type": "text"
							}
						],
						"body": {
							"mode": "raw",
							"raw": "{\n    \"author\": {\n        \"userId\": {{userID}},\n        \"firstName\": \"{{user_firstName}}\",\n        \"lastName\": \"{{user_lastName}}\",\n        \"city\": {\n            \"cityId\": {{cityID}},\n            \"cityName\": \"{{cityName}}\",\n            \"country\": {\n                \"countryId\": {{countryID}},\n                \"countryName\": \"{{countryName}}\"\n            }\n        },\n        \"occupation\": {\n            \"occupationId\": {{ocipationID}},\n            \"occupationArea\": \"{{ocupation_area}}\"\n        },\n        \"username\": \"{{userEmail}}\",\n        \"enabled\": true,\n        \"accountNonExpired\": true,\n        \"accountNonLocked\": true,\n        \"credentialsNonExpired\": true\n    },\n    \"title\": \"{{postTitle}}\",\n    \"postMessage\": \"{{postContent}}\",\n    \"timeStamp\": \"{{post_submitted_time}}\"\n}",
							"options": {
								"raw": {
									"language": "json"
								}
							}
						},
						"url": {
							"raw": "{{url}}/posts",
							"host": [
								"{{url}}"
							],
							"path": [
								"posts"
							]
						}
					},
					"status": "Created",
					"code": 201,
					"_postman_previewlanguage": "json",
					"header": [
						{
							"key": "Access-Control-Allow-Origin",
							"value": "*"
						},
						{
							"key": "Content-Encoding",
							"value": "gzip"
						},
						{
							"key": "Content-Type",
							"value": "application/json; charset=utf-8"
						},
						{
							"key": "Date",
							"value": "Thu, 28 Nov 2019 20:47:36 GMT"
						},
						{
							"key": "ETag",
							"value": "W/\"ac-1rU4G4f0rUNLJZ/+neFyyyFdv+M\""
						},
						{
							"key": "Server",
							"value": "nginx"
						},
						{
							"key": "Vary",
							"value": "Accept-Encoding"
						},
						{
							"key": "x-srv-span",
							"value": "v=1;s=219f0562095b8480"
						},
						{
							"key": "x-srv-trace",
							"value": "v=1;t=47b89507c58b50aa"
						},
						{
							"key": "Content-Length",
							"value": "154"
						},
						{
							"key": "Connection",
							"value": "keep-alive"
						}
					],
					"cookie": [],
					"body": "{\n\t\"postID\": {{$randomInt}}\n}"
				}
			]
		},
		{
			"name": "Get all posts",
			"event": [
				{
					"listen": "test",
					"script": {
						"id": "e6396551-fcd9-46b9-92b3-188bd25bfd65",
						"exec": [
							"pm.test(\"Status code is 200\", function () {",
							"    pm.response.to.have.status(200);",
							"});",
							"",
							"pm.test(\"Content-Type is present\", function () {",
							"    pm.response.to.have.header(\"Content-Type\");",
							"});",
							"",
							"pm.test(\"The Content-Type header has the correct value\", () => { ",
							"    pm.response.to.have.header(\"Content-Type\", \"application/json; charset=utf-8\");",
							"});",
							"",
							"",
							""
						],
						"type": "text/javascript"
					}
				}
			],
			"request": {
				"method": "GET",
				"header": [
					{
						"key": "X-Mock-Response-Code",
						"value": "403",
						"type": "text",
						"disabled": true
					},
					{
						"key": "X-Mock-Response-Name",
						"value": "Internal Server Error",
						"type": "text",
						"disabled": true
					}
				],
				"url": {
					"raw": "{{url}}/posts",
					"host": [
						"{{url}}"
					],
					"path": [
						"posts"
					]
				},
				"description": "Get a list with all posts\n\n- Post 1\n- Post 2"
			},
			"response": [
				{
					"name": "Failure: Invalid credentials",
					"originalRequest": {
						"method": "GET",
						"header": [
							{
								"key": "Content-Type",
								"value": "application/json",
								"type": "text"
							}
						],
						"url": {
							"raw": "{{url}}/posts",
							"host": [
								"{{url}}"
							],
							"path": [
								"posts"
							]
						}
					},
					"status": "Forbidden",
					"code": 403,
					"_postman_previewlanguage": "json",
					"header": [
						{
							"key": "Access-Control-Allow-Origin",
							"value": "*"
						},
						{
							"key": "Content-Encoding",
							"value": "gzip"
						},
						{
							"key": "Content-Type",
							"value": "application/json; charset=utf-8"
						},
						{
							"key": "Date",
							"value": "Thu, 28 Nov 2019 22:44:25 GMT"
						},
						{
							"key": "ETag",
							"value": "W/\"ac-1rU4G4f0rUNLJZ/+neFyyyFdv+M\""
						},
						{
							"key": "Server",
							"value": "nginx"
						},
						{
							"key": "Vary",
							"value": "Accept-Encoding"
						},
						{
							"key": "x-srv-span",
							"value": "v=1;s=7568bacf8913920f"
						},
						{
							"key": "x-srv-trace",
							"value": "v=1;t=299f3bf6c1456338"
						},
						{
							"key": "Content-Length",
							"value": "377"
						},
						{
							"key": "Connection",
							"value": "keep-alive"
						}
					],
					"cookie": [],
					"body": "{\n\t\"message\": \"Give me API key to munch on.\"\n}"
				},
				{
					"name": "Internal Server Error",
					"originalRequest": {
						"method": "GET",
						"header": [
							{
								"key": "X-Mock-Response-Code",
								"value": "403",
								"type": "text",
								"disabled": true
							},
							{
								"key": "X-Mock-Response-Code",
								"value": "Internal Server Error",
								"type": "text"
							}
						],
						"url": {
							"raw": "{{url}}/posts",
							"host": [
								"{{url}}"
							],
							"path": [
								"posts"
							]
						}
					},
					"status": "Internal Server Error",
					"code": 500,
					"_postman_previewlanguage": "json",
					"header": [
						{
							"key": "Access-Control-Allow-Origin",
							"value": "*"
						},
						{
							"key": "Content-Encoding",
							"value": "gzip"
						},
						{
							"key": "Content-Type",
							"value": "application/json; charset=utf-8"
						},
						{
							"key": "Date",
							"value": "Fri, 29 Nov 2019 14:02:52 GMT"
						},
						{
							"key": "ETag",
							"value": "W/\"ac-1rU4G4f0rUNLJZ/+neFyyyFdv+M\""
						},
						{
							"key": "Server",
							"value": "nginx"
						},
						{
							"key": "Vary",
							"value": "Accept-Encoding"
						},
						{
							"key": "x-srv-span",
							"value": "v=1;s=7568bacf8913920f"
						},
						{
							"key": "x-srv-trace",
							"value": "v=1;t=299f3bf6c1456338"
						},
						{
							"key": "Content-Length",
							"value": "493"
						},
						{
							"key": "Connection",
							"value": "keep-alive"
						}
					],
					"cookie": [],
					"body": "{\n\t\"message\": \"Server error. Our engineers working on that\"\n}"
				},
				{
					"name": "Get all posts",
					"originalRequest": {
						"method": "GET",
						"header": [
							{
								"key": "Content-Type",
								"value": "application/json",
								"type": "text"
							}
						],
						"url": {
							"raw": "{{url}}/posts",
							"host": [
								"{{url}}"
							],
							"path": [
								"posts"
							],
							"query": [
								{
									"key": "",
									"value": ""
								}
							]
						}
					},
					"status": "OK",
					"code": 200,
					"_postman_previewlanguage": "json",
					"header": [
						{
							"key": "Access-Control-Allow-Origin",
							"value": "*"
						},
						{
							"key": "Content-Encoding",
							"value": "gzip"
						},
						{
							"key": "Content-Type",
							"value": "application/json; charset=utf-8"
						},
						{
							"key": "Date",
							"value": "Thu, 28 Nov 2019 22:11:52 GMT"
						},
						{
							"key": "ETag",
							"value": "W/\"ac-1rU4G4f0rUNLJZ/+neFyyyFdv+M\""
						},
						{
							"key": "Server",
							"value": "nginx"
						},
						{
							"key": "Vary",
							"value": "Accept-Encoding"
						},
						{
							"key": "x-srv-span",
							"value": "v=1;s=7568bacf8913920f"
						},
						{
							"key": "x-srv-trace",
							"value": "v=1;t=299f3bf6c1456338"
						},
						{
							"key": "Content-Length",
							"value": "154"
						},
						{
							"key": "Connection",
							"value": "keep-alive"
						}
					],
					"cookie": [],
					"body": "[\n\t\n    {\n        \"postId\": 1,\n        \"author\": {\n            \"userId\": 70,\n            \"firstName\": \"Kremena\",\n            \"lastName\": \"Stoyanova\",\n            \"city\": {\n                \"cityId\": 23,\n                \"cityName\": \"Sofia\",\n                \"country\": {\n                    \"countryId\": 26,\n                    \"countryName\": \"Bulgaria\"\n                }\n            },\n            \"occupation\": {\n                \"occupationId\": 2,\n                \"occupationArea\": \"Stand up comedian\"\n            },\n        \"title\": \"Morty Jr. Dimension C-132\",\n        \"postMessage\": \"Oh, I'm sorry Morty, are you the scientist or are you the kid who wanted to get laid?\",\n        \"timeStamp\": \"26-November-2019 22:38\",\n        \"usersWhoLikedPost\": []\n    },\n    \n    {\n        \"postId\": 2,\n        \"author\": {\n            \"userId\": 70,\n            \"firstName\": \"Kremena\",\n            \"lastName\": \"Stoyanova\",\n            \"city\": {\n                \"cityId\": 23,\n                \"cityName\": \"Sofia\",\n                \"country\": {\n                    \"countryId\": 26,\n                    \"countryName\": \"Bulgaria\"\n                }\n            },\n            \"occupation\": {\n                \"occupationId\": 2,\n                \"occupationArea\": \"Stand up comedian\"\n            },\n        \"title\": \"Morty Jr. Dimension C-132\",\n        \"postMessage\": \"Oh, I'm sorry Morty, are you the scientist or are you the kid who wanted to get laid?\",\n        \"timeStamp\": \"26-November-2019 22:38\",\n        \"usersWhoLikedPost\": []\n    },\n    \n    {\n        \"postId\": 3,\n        \"author\": {\n            \"userId\": 71,\n            \"firstName\": \"Thomas\",\n            \"lastName\": \"Scharenberg\",\n            \"city\": {\n                \"cityId\": 23,\n                \"cityName\": \"Sofia\",\n                \"country\": {\n                    \"countryId\": 26,\n                    \"countryName\": \"Bulgaria\"\n                }\n            },\n            \"occupation\": {\n                \"occupationId\": 2,\n                \"occupationArea\": \"Python developer\"\n            },\n        \"title\": \"Need a party with jesteries.\",\n        \"postMessage\": \"I want to make a party. Do you have possibilities for jesteries like part of the show?\",\n        \"timeStamp\": \"28-November-2019 12:38\",\n        \"usersWhoLikedPost\": []\n    },\n    \n    {\n        \"postId\":{{$randomInt}},\n        \"author\": {\n            \"userId\": 70,\n            \"firstName\": \"Kremena\",\n            \"lastName\": \"Stoyanova\",\n            \"city\": {\n                \"cityId\": 23,\n                \"cityName\": \"Sofia\",\n                \"country\": {\n                    \"countryId\": 26,\n                    \"countryName\": \"Bulgaria\"\n                }\n            },\n            \"occupation\": {\n                \"occupationId\": 2,\n                \"occupationArea\": \"Stand up comedian\"\n            },\n        \"title\": \"Morty Jr. Dimension C-132\",\n        \"postMessage\": \"Oh, I'm sorry Morty, are you the scientist or are you the kid who wanted to get laid?\",\n        \"timeStamp\": {{$timestamp}},\n    }\n\t\n]"
				}
			]
		},
		{
			"name": "Find the post",
			"event": [
				{
					"listen": "test",
					"script": {
						"id": "ce06d3db-fd79-4db8-be76-53ef54b383b3",
						"exec": [
							"",
							"",
							"pm.test(\"The Content-Type header has the correct value\", () => { ",
							"    pm.response.to.have.header(\"Content-Type\", \"application/json; charset=utf-8\");",
							"});"
						],
						"type": "text/javascript"
					}
				}
			],
			"request": {
				"method": "GET",
				"header": [],
				"url": {
					"raw": "{{url}}/posts/{{postID}}",
					"host": [
						"{{url}}"
					],
					"path": [
						"posts",
						"{{postID}}"
					]
				},
				"description": "Find the existing post by the postID"
			},
			"response": [
				{
					"name": "Find the post successfully 3",
					"originalRequest": {
						"method": "GET",
						"header": [
							{
								"key": "Content-Type",
								"value": "application/json",
								"type": "text"
							}
						],
						"url": {
							"raw": "{{url}}/posts/3",
							"host": [
								"{{url}}"
							],
							"path": [
								"posts",
								"3"
							]
						}
					},
					"status": "OK",
					"code": 200,
					"_postman_previewlanguage": "json",
					"header": [
						{
							"key": "Access-Control-Allow-Origin",
							"value": "*"
						},
						{
							"key": "Content-Encoding",
							"value": "gzip"
						},
						{
							"key": "Content-Type",
							"value": "application/json; charset=utf-8"
						},
						{
							"key": "Date",
							"value": "Fri, 29 Nov 2019 15:14:58 GMT"
						},
						{
							"key": "ETag",
							"value": "W/\"ac-1rU4G4f0rUNLJZ/+neFyyyFdv+M\""
						},
						{
							"key": "Server",
							"value": "nginx"
						},
						{
							"key": "Vary",
							"value": "Accept-Encoding"
						},
						{
							"key": "x-srv-span",
							"value": "v=1;s=7568bacf8913920f"
						},
						{
							"key": "x-srv-trace",
							"value": "v=1;t=299f3bf6c1456338"
						},
						{
							"key": "Content-Length",
							"value": "337"
						},
						{
							"key": "Connection",
							"value": "keep-alive"
						}
					],
					"cookie": [],
					"body": " {\n        \"postId\": 3,\n        \"author\": {\n            \"userId\": 70,\n            \"firstName\": \"Kremena\",\n            \"lastName\": \"Stoyanova\",\n            \"city\": {\n                \"cityId\": 23,\n                \"cityName\": \"Sofia\",\n                \"country\": {\n                    \"countryId\": 26,\n                    \"countryName\": \"Bulgaria\"\n                }\n            },\n            \"occupation\": {\n                \"occupationId\": 2,\n                \"occupationArea\": \"Stand up comedian\"\n            },\n        \"title\": \"Morty Jr. Dimension C-132\",\n        \"postMessage\": \"Oh, I'm sorry Morty, are you the scientist or are you the kid who wanted to get laid?\",\n        \"timeStamp\": \"26-November-2019 22:38\"\n}"
				},
				{
					"name": "Find the post successfully 2",
					"originalRequest": {
						"method": "GET",
						"header": [
							{
								"key": "Content-Type",
								"value": "application/json",
								"type": "text"
							},
							{
								"key": "",
								"value": "",
								"type": "text"
							}
						],
						"url": {
							"raw": "{{url}}/posts/2",
							"host": [
								"{{url}}"
							],
							"path": [
								"posts",
								"2"
							]
						}
					},
					"status": "OK",
					"code": 200,
					"_postman_previewlanguage": "json",
					"header": [
						{
							"key": "Access-Control-Allow-Origin",
							"value": "*"
						},
						{
							"key": "Content-Encoding",
							"value": "gzip"
						},
						{
							"key": "Content-Type",
							"value": "application/json; charset=utf-8"
						},
						{
							"key": "Date",
							"value": "Fri, 29 Nov 2019 15:09:34 GMT"
						},
						{
							"key": "ETag",
							"value": "W/\"ac-1rU4G4f0rUNLJZ/+neFyyyFdv+M\""
						},
						{
							"key": "Server",
							"value": "nginx"
						},
						{
							"key": "Vary",
							"value": "Accept-Encoding"
						},
						{
							"key": "x-srv-span",
							"value": "v=1;s=7568bacf8913920f"
						},
						{
							"key": "x-srv-trace",
							"value": "v=1;t=299f3bf6c1456338"
						},
						{
							"key": "Content-Length",
							"value": "492"
						},
						{
							"key": "Connection",
							"value": "keep-alive"
						}
					],
					"cookie": [],
					"body": " {\n        \"postId\": 2,\n        \"author\": {\n            \"userId\": 70,\n            \"firstName\": \"Kremena\",\n            \"lastName\": \"Stoyanova\",\n            \"city\": {\n                \"cityId\": 23,\n                \"cityName\": \"Sofia\",\n                \"country\": {\n                    \"countryId\": 26,\n                    \"countryName\": \"Bulgaria\"\n                }\n            },\n            \"occupation\": {\n                \"occupationId\": 2,\n                \"occupationArea\": \"Stand up comedian\"\n            },\n        \"title\": \"Morty Jr. Dimension C-132\",\n        \"postMessage\": \"Oh, I'm sorry Morty, are you the scientist or are you the kid who wanted to get laid?\",\n        \"timeStamp\": \"26-November-2019 22:38\"\n}"
				},
				{
					"name": "Cannot find the post Invalid credentials",
					"originalRequest": {
						"method": "GET",
						"header": [
							{
								"key": "Content-Type",
								"value": "application/json",
								"type": "text"
							}
						],
						"url": {
							"raw": "{{url}}/posts/{{postID}}",
							"host": [
								"{{url}}"
							],
							"path": [
								"posts",
								"{{postID}}"
							]
						}
					},
					"status": "Forbidden",
					"code": 403,
					"_postman_previewlanguage": "json",
					"header": [
						{
							"key": "Access-Control-Allow-Origin",
							"value": "*"
						},
						{
							"key": "Content-Encoding",
							"value": "gzip"
						},
						{
							"key": "Content-Type",
							"value": "application/json; charset=utf-8"
						},
						{
							"key": "Date",
							"value": "Fri, 29 Nov 2019 17:42:04 GMT"
						},
						{
							"key": "ETag",
							"value": "W/\"ac-1rU4G4f0rUNLJZ/+neFyyyFdv+M\""
						},
						{
							"key": "Server",
							"value": "nginx"
						},
						{
							"key": "Vary",
							"value": "Accept-Encoding"
						},
						{
							"key": "x-srv-span",
							"value": "v=1;s=7568bacf8913920f"
						},
						{
							"key": "x-srv-trace",
							"value": "v=1;t=299f3bf6c1456338"
						},
						{
							"key": "Content-Length",
							"value": "492"
						},
						{
							"key": "Connection",
							"value": "keep-alive"
						}
					],
					"cookie": [],
					"body": "{\n\t\"message\": \"Give me API key to munch on.\"\n}"
				}
			]
		},
		{
			"name": "getCityById",
			"event": [
				{
					"listen": "test",
					"script": {
						"id": "518b5565-845f-4e10-b8a0-63e97b4455bc",
						"exec": [
							"pm.test(\"The response body is JSON\", () => {",
							"    pm.response.to.be.json;",
							"});",
							"",
							"const jsonData = pm.response.json();",
							"",
							"pm.test(\"The response body is not empty\", () => {",
							"    pm.expect(pm.response.json(), \"The response body is empty\").to.not.be.empty;",
							"});",
							"",
							"// Testing that the response is an object and has the correct keys",
							"pm.test(\"The response should be an object\", () => {",
							"    pm.expect(jsonData).to.be.an('object').to.have.keys('cityId', 'cityName','country');",
							"});"
						],
						"type": "text/javascript"
					}
				}
			],
			"request": {
				"method": "GET",
				"header": [
					{
						"key": "Content-Type",
						"value": "application/json",
						"type": "text"
					}
				],
				"url": {
					"raw": "{{url}}/cities/4",
					"host": [
						"{{url}}"
					],
					"path": [
						"cities",
						"4"
					]
				}
			},
			"response": [
				{
					"name": "City 23",
					"originalRequest": {
						"method": "GET",
						"header": [],
						"url": {
							"raw": "{{url}}/cities/23",
							"host": [
								"{{url}}"
							],
							"path": [
								"cities",
								"23"
							]
						}
					},
					"status": "OK",
					"code": 200,
					"_postman_previewlanguage": "json",
					"header": [
						{
							"key": "Access-Control-Allow-Origin",
							"value": "*"
						},
						{
							"key": "Content-Encoding",
							"value": "gzip"
						},
						{
							"key": "Content-Type",
							"value": "text/html; charset=utf-8"
						},
						{
							"key": "Date",
							"value": "Thu, 28 Nov 2019 15:37:37 GMT"
						},
						{
							"key": "ETag",
							"value": "W/\"1c42-9g3byWHU/yCFlJQEVbCVrNFrz/0\""
						},
						{
							"key": "Server",
							"value": "nginx"
						},
						{
							"key": "Vary",
							"value": "Accept-Encoding"
						},
						{
							"key": "x-srv-span",
							"value": "v=1;s=e49b5c8776d43750"
						},
						{
							"key": "x-srv-trace",
							"value": "v=1;t=0263020c20d1a10a"
						},
						{
							"key": "Content-Length",
							"value": "96"
						},
						{
							"key": "Connection",
							"value": "keep-alive"
						}
					],
					"cookie": [],
					"body": "{\n    \"cityId\": 23,\n    \"cityName\": \"Sofia\",\n    \"country\": {\n        \"countryId\": 26,\n        \"countryName\": \"Bulgaria\"\n    }\n}"
				},
				{
					"name": "City 20",
					"originalRequest": {
						"method": "GET",
						"header": [],
						"url": {
							"raw": "{{url}}/cities/20",
							"host": [
								"{{url}}"
							],
							"path": [
								"cities",
								"20"
							]
						}
					},
					"status": "OK",
					"code": 200,
					"_postman_previewlanguage": "json",
					"header": [
						{
							"key": "Access-Control-Allow-Origin",
							"value": "*"
						},
						{
							"key": "Content-Encoding",
							"value": "gzip"
						},
						{
							"key": "Content-Type",
							"value": "text/html; charset=utf-8"
						},
						{
							"key": "Date",
							"value": "Thu, 28 Nov 2019 15:37:37 GMT"
						},
						{
							"key": "ETag",
							"value": "W/\"1c42-9g3byWHU/yCFlJQEVbCVrNFrz/0\""
						},
						{
							"key": "Server",
							"value": "nginx"
						},
						{
							"key": "Vary",
							"value": "Accept-Encoding"
						},
						{
							"key": "x-srv-span",
							"value": "v=1;s=e49b5c8776d43750"
						},
						{
							"key": "x-srv-trace",
							"value": "v=1;t=0263020c20d1a10a"
						},
						{
							"key": "Content-Length",
							"value": "96"
						},
						{
							"key": "Connection",
							"value": "keep-alive"
						}
					],
					"cookie": [],
					"body": "{\n    \"cityId\": 20,\n    \"cityName\": \"Silistra\",\n    \"country\": {\n        \"countryId\": 26,\n        \"countryName\": \"Bulgaria\"\n    }\n}"
				},
				{
					"name": "City 4",
					"originalRequest": {
						"method": "GET",
						"header": [],
						"url": {
							"raw": "{{url}}/cities/4",
							"host": [
								"{{url}}"
							],
							"path": [
								"cities",
								"4"
							]
						}
					},
					"status": "OK",
					"code": 200,
					"_postman_previewlanguage": "html",
					"header": [
						{
							"key": "Access-Control-Allow-Origin",
							"value": "*"
						},
						{
							"key": "Content-Encoding",
							"value": "gzip"
						},
						{
							"key": "Content-Type",
							"value": "text/html; charset=utf-8"
						},
						{
							"key": "Date",
							"value": "Thu, 28 Nov 2019 15:35:12 GMT"
						},
						{
							"key": "ETag",
							"value": "W/\"1c42-9g3byWHU/yCFlJQEVbCVrNFrz/0\""
						},
						{
							"key": "Server",
							"value": "nginx"
						},
						{
							"key": "Vary",
							"value": "Accept-Encoding"
						},
						{
							"key": "x-srv-span",
							"value": "v=1;s=e49b5c8776d43750"
						},
						{
							"key": "x-srv-trace",
							"value": "v=1;t=0263020c20d1a10a"
						},
						{
							"key": "Content-Length",
							"value": "79"
						},
						{
							"key": "Connection",
							"value": "keep-alive"
						}
					],
					"cookie": [],
					"body": "{\r\n    \"cityId\": 4,\r\n    \"cityName\":\"Varna\",\r\n    \"country\": \r\n    {\r\n        \"countryId\": 26,\r\n        \"countryName\": \"Bulgaria\"\r\n    }\r\n}"
				},
				{
					"name": "City 1",
					"originalRequest": {
						"method": "GET",
						"header": [],
						"url": {
							"raw": "{{url}}/cities/1",
							"host": [
								"{{url}}"
							],
							"path": [
								"cities",
								"1"
							]
						}
					},
					"status": "OK",
					"code": 200,
					"_postman_previewlanguage": "html",
					"header": [
						{
							"key": "Access-Control-Allow-Origin",
							"value": "*"
						},
						{
							"key": "Content-Encoding",
							"value": "gzip"
						},
						{
							"key": "Content-Type",
							"value": "text/html; charset=utf-8"
						},
						{
							"key": "Date",
							"value": "Thu, 28 Nov 2019 15:31:14 GMT"
						},
						{
							"key": "ETag",
							"value": "W/\"1c42-9g3byWHU/yCFlJQEVbCVrNFrz/0\""
						},
						{
							"key": "Server",
							"value": "nginx"
						},
						{
							"key": "Vary",
							"value": "Accept-Encoding"
						},
						{
							"key": "x-srv-span",
							"value": "v=1;s=e49b5c8776d43750"
						},
						{
							"key": "x-srv-trace",
							"value": "v=1;t=0263020c20d1a10a"
						},
						{
							"key": "Content-Length",
							"value": "619"
						},
						{
							"key": "Connection",
							"value": "keep-alive"
						}
					],
					"cookie": [],
					"body": "{\r\n    \"cityId\": 1,\r\n    \"cityName\": \"-\",\r\n    \"country\":\r\n    {\r\n        \"countryId\": 0,\r\n        \"countryName\": \"-\"\r\n    }\r\n}"
				}
			]
		},
		{
			"name": "Registrer of a new user",
			"event": [
				{
					"listen": "test",
					"script": {
						"id": "01bb59c3-8082-4568-a832-94234befd4bd",
						"exec": [
							"pm.test(\"Status code is 201\", function () {",
							"    pm.response.to.have.status(201);",
							"});",
							"",
							"",
							"pm.test(\"Content-Type is present\", function () {",
							"    pm.response.to.have.header(\"Content-Type\");",
							"});",
							"",
							"const jsonData = pm.response.json();",
							"",
							"pm.environment.set(\"userID\", jsonData.userID);",
							"",
							"pm.test(\"A numeric id is returned\", function(){",
							"    pm.expect(jsonData).to.be.an(\"object\");",
							"    pm.expect(jsonData.userID).to.be.a(\"number\");",
							"    pm.expect(jsonData.userID).is.above(0);",
							"});",
							"",
							"pm.test(\"Capitalize the first name\", () => {",
							"    _.each(jsonData.users, (user) => {",
							"        // Using the .capitalize() function to change the data and put a capital letter at the start",
							"        pm.expect(_.capitalize(user.firstName)).to.equal('Joe')",
							"        // This assertion is checking the raw response and the name that it returns",
							"        pm.expect(user.firstName).to.equal('joe')",
							"    })",
							"});"
						],
						"type": "text/javascript"
					}
				}
			],
			"request": {
				"method": "POST",
				"header": [
					{
						"key": "Content-Type",
						"value": "application/json",
						"type": "text"
					}
				],
				"body": {
					"mode": "raw",
					"raw": "{\n\t\"firstName\": \"{{user_firstName}}\",\n\t\"lastName\": \"{{user_lastName}}\",\n\t\"age\": {{$randomInt}},\n\t\"email\": \"{{_userEmail}}\",\n\t\"password\": \"{{userPpassword}}\"\n}"
				},
				"url": {
					"raw": "{{url}}/users",
					"host": [
						"{{url}}"
					],
					"path": [
						"users"
					]
				}
			},
			"response": [
				{
					"name": "Registrer of a new user ",
					"originalRequest": {
						"method": "POST",
						"header": [
							{
								"key": "Content-Type",
								"name": "Content-Type",
								"value": "application/json",
								"type": "text"
							}
						],
						"body": {
							"mode": "raw",
							"raw": "{\n\t\"firstName\": \"{{user_firstName}}\",\n\t\"lastName\": \"{{user_lastName}}\",\n\t\"age\": {{$randomInt}},\n\t\"email\": \"{{_userEmail}}\",\n\t\"password\": \"{{userPpassword}}\"\n\t\n}",
							"options": {
								"raw": {
									"language": "json"
								}
							}
						},
						"url": {
							"raw": "{{url}}/users",
							"host": [
								"{{url}}"
							],
							"path": [
								"users"
							]
						}
					},
					"status": "Created",
					"code": 201,
					"_postman_previewlanguage": "json",
					"header": [
						{
							"key": "Content-Type",
							"value": "application/json; charset=utf-8"
						},
						{
							"key": "Date",
							"value": "Fri, 29 Nov 2019 11:42:43 GMT"
						},
						{
							"key": "ETag",
							"value": "W/\"4c-gcyyABm1cCPbYGfvkn/sYmYSuus\""
						},
						{
							"key": "Server",
							"value": "nginx"
						},
						{
							"key": "Content-Length",
							"value": "76"
						},
						{
							"key": "Connection",
							"value": "keep-alive"
						}
					],
					"cookie": [],
					"body": "{\n\t\"userID\": {{$randomInt}}\n}"
				}
			]
		},
		{
			"name": "Add a city",
			"event": [
				{
					"listen": "test",
					"script": {
						"id": "6954e6db-08e1-4085-ad69-576dab8f0bbf",
						"exec": [
							"pm.test(\"Status code is 200\", function () {",
							"    pm.response.to.have.status(201);",
							"});",
							"",
							"pm.test(\"Successful POST request\", function () {",
							"    pm.expect(pm.response.code).to.be.oneOf([201,202]);",
							"});"
						],
						"type": "text/javascript"
					}
				},
				{
					"listen": "prerequest",
					"script": {
						"id": "90bf750c-563c-4fc0-ae6b-eaa41c9c6790",
						"exec": [
							"var random = Math.random().toString(36).substring(2);",
							"var city = random + \" city\";",
							"",
							"pm.environment.set(\"city\", city);"
						],
						"type": "text/javascript"
					}
				}
			],
			"request": {
				"auth": {
					"type": "basic",
					"basic": [
						{
							"key": "username",
							"value": "kremena_victoria@yahoo.com",
							"type": "string"
						},
						{
							"key": "password",
							"value": "qwerty123",
							"type": "string"
						}
					]
				},
				"method": "POST",
				"header": [
					{
						"key": "Content-Type",
						"value": "application/json",
						"type": "text"
					}
				],
				"body": {
					"mode": "formdata",
					"formdata": [
						{
							"key": "cityId",
							"value": "{{$randomInt}}",
							"type": "text"
						},
						{
							"key": "cityName",
							"value": "{{city}}",
							"type": "text"
						}
					]
				},
				"url": {
					"raw": "{{url}}/cities/new",
					"host": [
						"{{url}}"
					],
					"path": [
						"cities",
						"new"
					]
				}
			},
			"response": [
				{
					"name": "Add a city",
					"originalRequest": {
						"method": "POST",
						"header": [
							{
								"key": "Content-Type",
								"name": "Content-Type",
								"value": "application/json",
								"type": "text"
							}
						],
						"body": {
							"mode": "formdata",
							"formdata": [
								{
									"key": "cityId",
									"value": "{{$randomInt}}",
									"type": "text"
								},
								{
									"key": "cityName",
									"value": "{{city}}",
									"type": "text"
								}
							],
							"options": {
								"raw": {
									"language": "json"
								}
							}
						},
						"url": {
							"raw": "{{url}}/cities/new",
							"host": [
								"{{url}}"
							],
							"path": [
								"cities",
								"new"
							],
							"query": [
								{
									"key": "",
									"value": ""
								}
							]
						}
					},
					"status": "Created",
					"code": 201,
					"_postman_previewlanguage": "json",
					"header": [
						{
							"key": "Access-Control-Allow-Origin",
							"value": "*"
						},
						{
							"key": "Content-Encoding",
							"value": "gzip"
						},
						{
							"key": "Content-Type",
							"value": "application/json; charset=utf-8"
						},
						{
							"key": "Date",
							"value": "Sun, 01 Dec 2019 18:38:46 GMT"
						},
						{
							"key": "ETag",
							"value": "W/\"b1-EapaEsYsAAuwKAzW3yvQwJwq0Bg\""
						},
						{
							"key": "Server",
							"value": "nginx"
						},
						{
							"key": "Vary",
							"value": "Accept-Encoding"
						},
						{
							"key": "x-srv-span",
							"value": "v=1;s=25226ae056d0c452"
						},
						{
							"key": "x-srv-trace",
							"value": "v=1;t=96809ac63d698dc1"
						},
						{
							"key": "Content-Length",
							"value": "158"
						},
						{
							"key": "Connection",
							"value": "keep-alive"
						}
					],
					"cookie": [],
					"body": "{\r\n\t\"cityId\": {{$randomInt}}\r\n    \"cityName\": \"My town\"\r\n}\r\n"
				}
			]
		}
	],
	"event": [
		{
			"listen": "prerequest",
			"script": {
				"id": "3c2ddea0-d4f3-4b6f-83dd-7d2093561aa0",
				"type": "text/javascript",
				"exec": [
					""
				]
			}
		},
		{
			"listen": "test",
			"script": {
				"id": "987175cc-e24d-41dd-894e-ee779d64009a",
				"type": "text/javascript",
				"exec": [
					""
				]
			}
		}
	],
	"protocolProfileBehavior": {}
}