<?xml version="1.0" encoding="UTF-8" standalone="no"?>
<!-- Created with Inkscape (http://www.inkscape.org/) -->

<svg
   xmlns:dc="http://purl.org/dc/elements/1.1/"
   xmlns:cc="http://creativecommons.org/ns#"
   xmlns:rdf="http://www.w3.org/1999/02/22-rdf-syntax-ns#"
   xmlns:svg="http://www.w3.org/2000/svg"
   xmlns="http://www.w3.org/2000/svg"
   xmlns:xlink="http://www.w3.org/1999/xlink"
   xmlns:sodipodi="http://sodipodi.sourceforge.net/DTD/sodipodi-0.dtd"
   xmlns:inkscape="http://www.inkscape.org/namespaces/inkscape"
   width="921.44434"
   height="1088.1017"
   id="svg4507"
   version="1.1"
   inkscape:version="0.91 r"
   sodipodi:docname="ExpSetup-RP.svg"
   inkscape:export-filename="/home/svoboda/mnt/buon/GW/Experiments/EdgePlasmaPhysics/ParticleFlux/BallPenProbe/Experiments/0117RadialProfile/setup/ExpSetup-RP.png"
   inkscape:export-xdpi="200.02724"
   inkscape:export-ydpi="200.02724">
  <defs
     id="defs4509">
    <linearGradient
       inkscape:collect="always"
       id="linearGradient9141">
      <stop
         style="stop-color:#ff0000;stop-opacity:1;"
         offset="0"
         id="stop9143" />
      <stop
         style="stop-color:#ff0000;stop-opacity:0;"
         offset="1"
         id="stop9145" />
    </linearGradient>
    <marker
       inkscape:stockid="Arrow1Mstart"
       orient="auto"
       refY="0"
       refX="0"
       id="Arrow1Mstart"
       style="overflow:visible">
      <path
         id="path3949"
         d="M 0,0 5,-5 -12.5,0 5,5 0,0 z"
         style="fill-rule:evenodd;stroke:#000000;stroke-width:1pt"
         transform="matrix(0.4,0,0,0.4,4,0)"
         inkscape:connector-curvature="0" />
    </marker>
    <marker
       inkscape:stockid="Arrow1Send"
       orient="auto"
       refY="0"
       refX="0"
       id="Arrow1Send"
       style="overflow:visible">
      <path
         id="path3958"
         d="M 0,0 5,-5 -12.5,0 5,5 0,0 z"
         style="fill-rule:evenodd;stroke:#000000;stroke-width:1pt"
         transform="matrix(-0.2,0,0,-0.2,-1.2,0)"
         inkscape:connector-curvature="0" />
    </marker>
    <marker
       inkscape:stockid="Arrow1Mend"
       orient="auto"
       refY="0"
       refX="0"
       id="Arrow1Mend"
       style="overflow:visible">
      <path
         id="path3952"
         d="M 0,0 5,-5 -12.5,0 5,5 0,0 z"
         style="fill-rule:evenodd;stroke:#000000;stroke-width:1pt"
         transform="matrix(-0.4,0,0,-0.4,-4,0)"
         inkscape:connector-curvature="0" />
    </marker>
    <marker
       inkscape:stockid="Arrow2Mend"
       orient="auto"
       refY="0"
       refX="0"
       id="Arrow2Mend"
       style="overflow:visible">
      <path
         id="path3970"
         style="fill-rule:evenodd;stroke-width:0.625;stroke-linejoin:round"
         d="M 8.7185878,4.0337352 -2.2072895,0.01601326 8.7185884,-4.0017078 c -1.7454984,2.3720609 -1.7354408,5.6174519 -6e-7,8.035443 z"
         transform="scale(-0.6,-0.6)"
         inkscape:connector-curvature="0" />
    </marker>
    <marker
       inkscape:stockid="Arrow1Lend"
       orient="auto"
       refY="0"
       refX="0"
       id="Arrow1Lend"
       style="overflow:visible">
      <path
         id="path3946"
         d="M 0,0 5,-5 -12.5,0 5,5 0,0 z"
         style="fill-rule:evenodd;stroke:#000000;stroke-width:1pt"
         transform="matrix(-0.8,0,0,-0.8,-10,0)"
         inkscape:connector-curvature="0" />
    </marker>
    <linearGradient
       inkscape:collect="always"
       id="linearGradient3790">
      <stop
         style="stop-color:#ff0000;stop-opacity:1;"
         offset="0"
         id="stop3792" />
      <stop
         style="stop-color:#ff0000;stop-opacity:0;"
         offset="1"
         id="stop3794" />
    </linearGradient>
    <radialGradient
       inkscape:collect="always"
       xlink:href="#linearGradient3790"
       id="radialGradient3796"
       cx="309.10669"
       cy="487.68692"
       fx="309.10669"
       fy="487.68692"
       r="115.17954"
       gradientUnits="userSpaceOnUse" />
    <radialGradient
       inkscape:collect="always"
       xlink:href="#linearGradient3790"
       id="radialGradient9017"
       gradientUnits="userSpaceOnUse"
       cx="309.10669"
       cy="487.68692"
       fx="309.10669"
       fy="487.68692"
       r="115.17954"
       gradientTransform="translate(-220.16185,269.0694)" />
    <radialGradient
       inkscape:collect="always"
       xlink:href="#linearGradient9141"
       id="radialGradient9147"
       cx="309.10669"
       cy="487.68692"
       fx="309.10669"
       fy="487.68692"
       r="116.14631"
       gradientUnits="userSpaceOnUse" />
    <marker
       inkscape:stockid="Arrow1Send"
       orient="auto"
       refY="0"
       refX="0"
       id="Arrow1Send-4"
       style="overflow:visible">
      <path
         id="path3958-8"
         d="M 0,0 5,-5 -12.5,0 5,5 0,0 Z"
         style="fill-rule:evenodd;stroke:#000000;stroke-width:1pt"
         transform="matrix(-0.2,0,0,-0.2,-1.2,0)"
         inkscape:connector-curvature="0" />
    </marker>
  </defs>
  <sodipodi:namedview
     id="base"
     pagecolor="#ffffff"
     bordercolor="#666666"
     borderopacity="1.0"
     inkscape:pageopacity="0.0"
     inkscape:pageshadow="2"
     inkscape:zoom="0.71471781"
     inkscape:cx="-17.567146"
     inkscape:cy="542.56067"
     inkscape:document-units="mm"
     inkscape:current-layer="layer1"
     showgrid="false"
     inkscape:window-width="2048"
     inkscape:window-height="1100"
     inkscape:window-x="-3"
     inkscape:window-y="-3"
     inkscape:window-maximized="1"
     showguides="true"
     inkscape:guide-bbox="true"
     units="mm"
     fit-margin-top="0"
     fit-margin-left="0"
     fit-margin-right="0"
     fit-margin-bottom="0" />
  <metadata
     id="metadata4512">
    <rdf:RDF>
      <cc:Work
         rdf:about="">
        <dc:format>image/svg+xml</dc:format>
        <dc:type
           rdf:resource="http://purl.org/dc/dcmitype/StillImage" />
        <dc:title />
      </cc:Work>
    </rdf:RDF>
  </metadata>
  <g
     inkscape:label="Layer 1"
     inkscape:groupmode="layer"
     id="layer1"
     transform="translate(568.74731,-697.74496)">
    <rect
       style="fill:#ffffff;fill-opacity:1;stroke:#000000;stroke-opacity:1"
       id="rect3798"
       width="35.433071"
       height="283.46457"
       x="-36.982388"
       y="1265.8452" />
    <circle
       id="path9131"
       style="fill:url(#radialGradient9147);stroke:#000000;stroke-width:0.15209402;stroke-miterlimit:4;stroke-opacity:1;stroke-dasharray:none;fill-opacity:1"
       transform="matrix(2.5859471,0,0,2.5859471,-800.96722,-209.05688)"
       d="M 424.28623,487.68692 A 115.17954,115.17954 0 0 1 309.10669,602.86646 115.17954,115.17954 0 0 1 193.92715,487.68692 115.17954,115.17954 0 0 1 309.10669,372.50738 115.17954,115.17954 0 0 1 424.28623,487.68692 Z"
       sodipodi:type="arc"
       sodipodi:ry="115.17954"
       sodipodi:rx="115.17954"
       sodipodi:cy="487.68692"
       sodipodi:cx="309.10669" />
    <path
       inkscape:connector-curvature="0"
       sodipodi:nodetypes="cc"
       id="path5312"
       d="m 231.27314,1318.2675 -2e-5,435.8987"
       style="fill:none;stroke:#000000;stroke-width:3.54330516;stroke-linecap:square;stroke-linejoin:miter;stroke-miterlimit:4;stroke-opacity:1;stroke-dasharray:none" />
    <g
       id="g3885"
       transform="translate(-5.1334418,211.50381)">
      <g
         id="g3826">
        <path
           style="fill:none;stroke:#000000;stroke-width:3.54330516;stroke-linecap:square;stroke-linejoin:miter;stroke-miterlimit:4;stroke-dasharray:none;stroke-opacity:1"
           d="m 12.238649,1071.9647 -6.932734,0"
           id="path3800"
           sodipodi:nodetypes="cc"
           inkscape:connector-curvature="0"
           inkscape:tile-cx="8.772282"
           inkscape:tile-cy="1071.9647"
           inkscape:tile-w="6.932734"
           inkscape:tile-h="0"
           inkscape:tile-x0="5.305915"
           inkscape:tile-y0="1071.9647" />
        <path
           inkscape:tile-y0="1071.9647"
           inkscape:tile-x0="5.305915"
           inkscape:tile-h="0"
           inkscape:tile-w="6.932734"
           inkscape:tile-cy="1071.9647"
           inkscape:tile-cx="8.772282"
           inkscape:connector-curvature="0"
           sodipodi:nodetypes="cc"
           id="path3820"
           d="m 12.324226,1080.5932 -6.9327334,0"
           style="fill:none;stroke:#000000;stroke-width:3.54330516;stroke-linecap:square;stroke-linejoin:miter;stroke-miterlimit:4;stroke-dasharray:none;stroke-opacity:1" />
        <path
           inkscape:tile-y0="1071.9647"
           inkscape:tile-x0="5.305915"
           inkscape:tile-h="0"
           inkscape:tile-w="6.932734"
           inkscape:tile-cy="1071.9647"
           inkscape:tile-cx="8.772282"
           inkscape:connector-curvature="0"
           sodipodi:nodetypes="cc"
           id="path3822"
           d="m 12.238649,1089.746 -6.932734,0"
           style="fill:none;stroke:#000000;stroke-width:3.54330516;stroke-linecap:square;stroke-linejoin:miter;stroke-miterlimit:4;stroke-dasharray:none;stroke-opacity:1" />
        <path
           style="fill:none;stroke:#000000;stroke-width:3.54330516;stroke-linecap:square;stroke-linejoin:miter;stroke-miterlimit:4;stroke-dasharray:none;stroke-opacity:1"
           d="m 12.324226,1098.3745 -6.9327334,0"
           id="path3824"
           sodipodi:nodetypes="cc"
           inkscape:connector-curvature="0"
           inkscape:tile-cx="8.772282"
           inkscape:tile-cy="1071.9647"
           inkscape:tile-w="6.932734"
           inkscape:tile-h="0"
           inkscape:tile-x0="5.305915"
           inkscape:tile-y0="1071.9647" />
      </g>
      <g
         transform="translate(0.11698219,35.094658)"
         id="g3832">
        <path
           inkscape:tile-y0="1071.9647"
           inkscape:tile-x0="5.305915"
           inkscape:tile-h="0"
           inkscape:tile-w="6.932734"
           inkscape:tile-cy="1071.9647"
           inkscape:tile-cx="8.772282"
           inkscape:connector-curvature="0"
           sodipodi:nodetypes="cc"
           id="path3834"
           d="m 12.238649,1071.9647 -6.932734,0"
           style="fill:none;stroke:#000000;stroke-width:3.54330516;stroke-linecap:square;stroke-linejoin:miter;stroke-miterlimit:4;stroke-dasharray:none;stroke-opacity:1" />
        <path
           style="fill:none;stroke:#000000;stroke-width:3.54330516;stroke-linecap:square;stroke-linejoin:miter;stroke-miterlimit:4;stroke-dasharray:none;stroke-opacity:1"
           d="m 12.324226,1080.5932 -6.9327334,0"
           id="path3836"
           sodipodi:nodetypes="cc"
           inkscape:connector-curvature="0"
           inkscape:tile-cx="8.772282"
           inkscape:tile-cy="1071.9647"
           inkscape:tile-w="6.932734"
           inkscape:tile-h="0"
           inkscape:tile-x0="5.305915"
           inkscape:tile-y0="1071.9647" />
        <path
           style="fill:none;stroke:#000000;stroke-width:3.54330516;stroke-linecap:square;stroke-linejoin:miter;stroke-miterlimit:4;stroke-dasharray:none;stroke-opacity:1"
           d="m 12.238649,1089.746 -6.932734,0"
           id="path3838"
           sodipodi:nodetypes="cc"
           inkscape:connector-curvature="0"
           inkscape:tile-cx="8.772282"
           inkscape:tile-cy="1071.9647"
           inkscape:tile-w="6.932734"
           inkscape:tile-h="0"
           inkscape:tile-x0="5.305915"
           inkscape:tile-y0="1071.9647" />
        <path
           inkscape:tile-y0="1071.9647"
           inkscape:tile-x0="5.305915"
           inkscape:tile-h="0"
           inkscape:tile-w="6.932734"
           inkscape:tile-cy="1071.9647"
           inkscape:tile-cx="8.772282"
           inkscape:connector-curvature="0"
           sodipodi:nodetypes="cc"
           id="path3840"
           d="m 12.324226,1098.3745 -6.9327334,0"
           style="fill:none;stroke:#000000;stroke-width:3.54330516;stroke-linecap:square;stroke-linejoin:miter;stroke-miterlimit:4;stroke-dasharray:none;stroke-opacity:1" />
      </g>
      <g
         transform="translate(0.23396439,70.657245)"
         id="g3842">
        <path
           inkscape:tile-y0="1071.9647"
           inkscape:tile-x0="5.305915"
           inkscape:tile-h="0"
           inkscape:tile-w="6.932734"
           inkscape:tile-cy="1071.9647"
           inkscape:tile-cx="8.772282"
           inkscape:connector-curvature="0"
           sodipodi:nodetypes="cc"
           id="path3844"
           d="m 12.238649,1071.9647 -6.932734,0"
           style="fill:none;stroke:#000000;stroke-width:3.54330516;stroke-linecap:square;stroke-linejoin:miter;stroke-miterlimit:4;stroke-dasharray:none;stroke-opacity:1" />
        <path
           style="fill:none;stroke:#000000;stroke-width:3.54330516;stroke-linecap:square;stroke-linejoin:miter;stroke-miterlimit:4;stroke-dasharray:none;stroke-opacity:1"
           d="m 12.324226,1080.5932 -6.9327334,0"
           id="path3846"
           sodipodi:nodetypes="cc"
           inkscape:connector-curvature="0"
           inkscape:tile-cx="8.772282"
           inkscape:tile-cy="1071.9647"
           inkscape:tile-w="6.932734"
           inkscape:tile-h="0"
           inkscape:tile-x0="5.305915"
           inkscape:tile-y0="1071.9647" />
        <path
           style="fill:none;stroke:#000000;stroke-width:3.54330516;stroke-linecap:square;stroke-linejoin:miter;stroke-miterlimit:4;stroke-dasharray:none;stroke-opacity:1"
           d="m 12.238649,1089.746 -6.932734,0"
           id="path3848"
           sodipodi:nodetypes="cc"
           inkscape:connector-curvature="0"
           inkscape:tile-cx="8.772282"
           inkscape:tile-cy="1071.9647"
           inkscape:tile-w="6.932734"
           inkscape:tile-h="0"
           inkscape:tile-x0="5.305915"
           inkscape:tile-y0="1071.9647" />
        <path
           inkscape:tile-y0="1071.9647"
           inkscape:tile-x0="5.305915"
           inkscape:tile-h="0"
           inkscape:tile-w="6.932734"
           inkscape:tile-cy="1071.9647"
           inkscape:tile-cx="8.772282"
           inkscape:connector-curvature="0"
           sodipodi:nodetypes="cc"
           id="path3850"
           d="m 12.324226,1098.3745 -6.9327334,0"
           style="fill:none;stroke:#000000;stroke-width:3.54330516;stroke-linecap:square;stroke-linejoin:miter;stroke-miterlimit:4;stroke-dasharray:none;stroke-opacity:1" />
      </g>
      <g
         id="g3852"
         transform="translate(0.35094658,105.7519)">
        <path
           style="fill:none;stroke:#000000;stroke-width:3.54330516;stroke-linecap:square;stroke-linejoin:miter;stroke-miterlimit:4;stroke-dasharray:none;stroke-opacity:1"
           d="m 12.238649,1071.9647 -6.932734,0"
           id="path3854"
           sodipodi:nodetypes="cc"
           inkscape:connector-curvature="0"
           inkscape:tile-cx="8.772282"
           inkscape:tile-cy="1071.9647"
           inkscape:tile-w="6.932734"
           inkscape:tile-h="0"
           inkscape:tile-x0="5.305915"
           inkscape:tile-y0="1071.9647" />
        <path
           inkscape:tile-y0="1071.9647"
           inkscape:tile-x0="5.305915"
           inkscape:tile-h="0"
           inkscape:tile-w="6.932734"
           inkscape:tile-cy="1071.9647"
           inkscape:tile-cx="8.772282"
           inkscape:connector-curvature="0"
           sodipodi:nodetypes="cc"
           id="path3856"
           d="m 12.324226,1080.5932 -6.9327334,0"
           style="fill:none;stroke:#000000;stroke-width:3.54330516;stroke-linecap:square;stroke-linejoin:miter;stroke-miterlimit:4;stroke-dasharray:none;stroke-opacity:1" />
        <path
           inkscape:tile-y0="1071.9647"
           inkscape:tile-x0="5.305915"
           inkscape:tile-h="0"
           inkscape:tile-w="6.932734"
           inkscape:tile-cy="1071.9647"
           inkscape:tile-cx="8.772282"
           inkscape:connector-curvature="0"
           sodipodi:nodetypes="cc"
           id="path3858"
           d="m 12.238649,1089.746 -6.932734,0"
           style="fill:none;stroke:#000000;stroke-width:3.54330516;stroke-linecap:square;stroke-linejoin:miter;stroke-miterlimit:4;stroke-dasharray:none;stroke-opacity:1" />
        <path
           style="fill:none;stroke:#000000;stroke-width:3.54330516;stroke-linecap:square;stroke-linejoin:miter;stroke-miterlimit:4;stroke-dasharray:none;stroke-opacity:1"
           d="m 12.324226,1098.3745 -6.9327334,0"
           id="path3860"
           sodipodi:nodetypes="cc"
           inkscape:connector-curvature="0"
           inkscape:tile-cx="8.772282"
           inkscape:tile-cy="1071.9647"
           inkscape:tile-w="6.932734"
           inkscape:tile-h="0"
           inkscape:tile-x0="5.305915"
           inkscape:tile-y0="1071.9647" />
      </g>
    </g>
    <path
       inkscape:connector-curvature="0"
       sodipodi:nodetypes="cc"
       id="path3933"
       d="m -408.98298,1283.4914 370.866229,0"
       style="fill:none;stroke:#000000;stroke-width:1.77165353;stroke-linecap:square;stroke-linejoin:miter;stroke-miterlimit:4;stroke-opacity:1;stroke-dasharray:5.3149606, 5.3149606;stroke-dashoffset:0" />
    <path
       style="fill:none;stroke:#000000;stroke-width:1.77165353;stroke-linecap:square;stroke-linejoin:miter;stroke-miterlimit:4;stroke-opacity:1;stroke-dasharray:5.3149606, 5.3149606;stroke-dashoffset:0"
       d="m -537.19546,1051.3987 533.0423629,0"
       id="path3935"
       sodipodi:nodetypes="cc"
       inkscape:connector-curvature="0" />
    <path
       style="fill:none;stroke:#000000;stroke-width:1.77165353;stroke-linecap:square;stroke-linejoin:miter;stroke-miterlimit:4;stroke-opacity:1;stroke-dasharray:none;marker-start:url(#Arrow1Mend);marker-mid:none;marker-end:url(#Arrow1Mstart)"
       d="m -390.93197,1048.3215 -2e-5,235.4396"
       id="path3937"
       sodipodi:nodetypes="cc"
       inkscape:connector-curvature="0" />
    <text
       xml:space="preserve"
       style="font-style:normal;font-weight:normal;font-size:32px;line-height:125%;font-family:Sans;letter-spacing:0px;word-spacing:0px;fill:#000000;fill-opacity:1;stroke:none"
       x="-1266.1178"
       y="-409.62036"
       id="text6265"
       sodipodi:linespacing="125%"
       transform="matrix(0,-1,1,0,0,0)"><tspan
         sodipodi:role="line"
         id="tspan6267"
         x="-1266.1178"
         y="-409.62036"
         style="font-size:24px">LP<tspan
   style="font-size:24px;baseline-shift:super"
   id="tspan6279">1</tspan><tspan
   style="font-size:24px;baseline-shift:sub"
   id="tspan6277">pos</tspan>=38 mm</tspan></text>
    <path
       style="fill:none;stroke:#000000;stroke-width:1.77165353;stroke-linecap:square;stroke-linejoin:miter;stroke-miterlimit:4;stroke-opacity:1;stroke-dasharray:5.3149606, 5.3149606;stroke-dashoffset:0"
       d="m -554.97676,1405.1529 516.956775,0"
       id="path6269"
       sodipodi:nodetypes="cc"
       inkscape:connector-curvature="0" />
    <path
       inkscape:connector-curvature="0"
       sodipodi:nodetypes="cc"
       id="path6271"
       d="m -452.69857,1052.0649 -2e-5,300.0138"
       style="fill:none;stroke:#000000;stroke-width:1.77165353;stroke-linecap:square;stroke-linejoin:miter;stroke-miterlimit:4;stroke-opacity:1;stroke-dasharray:none;marker-start:url(#Arrow1Mend);marker-mid:none;marker-end:url(#Arrow1Mstart)" />
    <path
       style="fill:none;stroke:#000000;stroke-width:1.77165353;stroke-linecap:square;stroke-linejoin:miter;stroke-miterlimit:4;stroke-opacity:1;stroke-dasharray:none;marker-start:url(#Arrow1Mend);marker-mid:none;marker-end:url(#Arrow1Mstart)"
       d="m -535.05403,1052.0649 -2e-5,351.4859"
       id="path6273"
       sodipodi:nodetypes="cc"
       inkscape:connector-curvature="0" />
    <path
       style="fill:none;stroke:#000000;stroke-width:1.77165353;stroke-linecap:square;stroke-linejoin:miter;stroke-miterlimit:4;stroke-opacity:1;stroke-dasharray:5.3149606, 5.3149606;stroke-dashoffset:0"
       d="m -477.30058,1352.7449 437.910906,0"
       id="path6275"
       sodipodi:nodetypes="cc"
       inkscape:connector-curvature="0" />
    <text
       transform="matrix(0,-1,1,0,0,0)"
       sodipodi:linespacing="125%"
       id="text6289"
       y="-473.25867"
       x="-1265.1819"
       style="font-size:32px;font-style:normal;font-weight:normal;line-height:125%;letter-spacing:0px;word-spacing:0px;fill:#000000;fill-opacity:1;stroke:none;font-family:Sans"
       xml:space="preserve"><tspan
         style="font-size:24px"
         y="-473.25867"
         x="-1265.1819"
         id="tspan6291"
         sodipodi:role="line">r<tspan
   style="font-size:65.00091553%;baseline-shift:sub"
   id="tspan6297">a</tspan>=85 mm</tspan></text>
    <text
       xml:space="preserve"
       style="font-size:32px;font-style:normal;font-weight:normal;line-height:125%;letter-spacing:0px;word-spacing:0px;fill:#000000;fill-opacity:1;stroke:none;font-family:Sans"
       x="-1262.3743"
       y="-550.93481"
       id="text6299"
       sodipodi:linespacing="125%"
       transform="matrix(0,-1,1,0,0,0)"><tspan
         sodipodi:role="line"
         id="tspan6301"
         x="-1262.3743"
         y="-550.93481"
         style="font-size:24px">r<tspan
   id="tspan6303"
   style="font-size:65.00091553%;baseline-shift:sub">0</tspan>=100 mm</tspan></text>
    <text
       xml:space="preserve"
       style="font-size:32px;font-style:normal;font-weight:normal;line-height:125%;letter-spacing:0px;word-spacing:0px;fill:#000000;fill-opacity:1;stroke:none;font-family:Sans"
       x="-280.97061"
       y="1039.6281"
       id="text6305"
       sodipodi:linespacing="125%"><tspan
         sodipodi:role="line"
         id="tspan6307"
         x="-280.97061"
         y="1039.6281">HFS</tspan></text>
    <text
       sodipodi:linespacing="125%"
       id="text6309"
       y="1041.4159"
       x="227.59439"
       style="font-size:32px;font-style:normal;font-weight:normal;line-height:125%;letter-spacing:0px;word-spacing:0px;fill:#000000;fill-opacity:1;stroke:none;font-family:Sans"
       xml:space="preserve"><tspan
         y="1041.4159"
         x="227.59439"
         id="tspan6311"
         sodipodi:role="line">LFS</tspan></text>
    <text
       sodipodi:linespacing="125%"
       id="text6313"
       y="1284.634"
       x="13.080829"
       style="font-style:normal;font-weight:normal;font-size:32px;line-height:125%;font-family:Sans;letter-spacing:0px;word-spacing:0px;fill:#000000;fill-opacity:1;stroke:none"
       xml:space="preserve"><tspan
         style="font-size:24px"
         y="1284.634"
         x="13.080829"
         id="tspan6315"
         sodipodi:role="line">LP<tspan
   style="font-size:65.00091553%;baseline-shift:sub"
   id="tspan6319">1,2</tspan></tspan><tspan
         style="font-size:24px"
         y="1314.634"
         x="13.080829"
         sodipodi:role="line"
         id="tspan3604" /></text>
    <text
       xml:space="preserve"
       style="font-style:normal;font-weight:normal;font-size:32px;line-height:125%;font-family:Sans;letter-spacing:0px;word-spacing:0px;fill:#000000;fill-opacity:1;stroke:none"
       x="13.080829"
       y="1430.2194"
       id="text6321"
       sodipodi:linespacing="125%"><tspan
         sodipodi:role="line"
         id="tspan6323"
         x="13.080829"
         y="1430.2194"
         style="font-size:24px">LP<tspan
   id="tspan6325"
   style="font-size:65.00091553%;baseline-shift:sub">23 24</tspan></tspan></text>
    <path
       style="fill:none;stroke:#000000;stroke-width:3.54330516;stroke-linecap:square;stroke-linejoin:miter;stroke-miterlimit:4;stroke-dasharray:none;stroke-opacity:1"
       d="m -19.867614,1283.4256 -2e-5,265.4614"
       id="path7882"
       sodipodi:nodetypes="cc"
       inkscape:connector-curvature="0" />
    <path
       inkscape:connector-curvature="0"
       sodipodi:nodetypes="cc"
       id="path7884"
       d="m -16.844064,1283.371 14.17322,0"
       style="fill:none;stroke:#000000;stroke-width:3.54330516;stroke-linecap:square;stroke-linejoin:miter;stroke-miterlimit:4;stroke-opacity:1;stroke-dasharray:none" />
    <g
       id="g8719"
       style="display:inline"
       transform="translate(40.348266,1568.7457)">
      <path
         style="fill:none;stroke:#000000;stroke-width:3.54330707;stroke-linecap:square;stroke-linejoin:miter;stroke-miterlimit:4;stroke-opacity:1;stroke-dasharray:none;display:inline"
         d="m 212.1968,201.43114 -42.51967,0"
         id="path8721"
         sodipodi:nodetypes="cc"
         inkscape:connector-curvature="0" />
      <path
         style="fill:none;stroke:#000000;stroke-width:3.54330587;stroke-linecap:butt;stroke-linejoin:miter;stroke-miterlimit:4;stroke-opacity:1;stroke-dasharray:none;display:inline"
         d="m 190.93697,187.2579 0,14.17324"
         id="path8723"
         sodipodi:nodetypes="cc"
         inkscape:connector-curvature="0" />
      <path
         style="fill:none;stroke:#000000;stroke-width:3.54330707;stroke-linecap:square;stroke-linejoin:miter;stroke-miterlimit:4;stroke-opacity:1;stroke-dasharray:none;display:inline"
         d="m 205.11019,208.51774 -28.34646,0"
         id="path8725"
         sodipodi:nodetypes="cc"
         inkscape:connector-curvature="0" />
      <path
         style="fill:none;stroke:#000000;stroke-width:3.54330707;stroke-linecap:square;stroke-linejoin:miter;stroke-miterlimit:4;stroke-opacity:1;stroke-dasharray:none;display:inline"
         d="m 198.02357,215.60436 -14.17322,0"
         id="path8727"
         sodipodi:nodetypes="cc"
         inkscape:connector-curvature="0" />
    </g>
    <path
       style="fill:none;stroke:#000000;stroke-width:2.22262907;stroke-linecap:square;stroke-linejoin:miter;stroke-miterlimit:4;stroke-dasharray:none;stroke-opacity:1"
       d="m -31.145992,1551.4284 0,66.8656"
       id="path5319"
       sodipodi:nodetypes="cc"
       inkscape:connector-curvature="0" />
    <g
       id="g8780"
       transform="matrix(0.79631227,0,0,0.79631227,-84.772672,302.95005)">
      <g
         transform="matrix(0,1,-1,0,1754.4446,1604.0286)"
         id="g8767">
        <ellipse
           style="color:#000000;display:inline;overflow:visible;visibility:visible;fill:none;stroke:#000000;stroke-width:1.92675233;stroke-linecap:square;stroke-linejoin:miter;stroke-miterlimit:4;stroke-dasharray:none;stroke-dashoffset:0;stroke-opacity:1;marker:none"
           id="path6422"
           transform="matrix(2,0,0,2.666666,-749.66783,1417.6752)"
           cx="421.65353"
           cy="100.86611"
           rx="14.173228"
           ry="10.629921" />
        <path
           style="display:inline;fill:none;stroke:#000000;stroke-width:4.44964743;stroke-linecap:square;stroke-linejoin:miter;stroke-miterlimit:4;stroke-dasharray:none;stroke-opacity:1"
           d="m 121.98567,1686.6513 15.89824,0"
           id="path6424"
           sodipodi:nodetypes="cc"
           inkscape:connector-curvature="0" />
        <path
           style="display:inline;fill:none;stroke:#000000;stroke-width:4.44964743;stroke-linecap:square;stroke-linejoin:miter;stroke-miterlimit:4;stroke-dasharray:none;stroke-opacity:1"
           d="m 50.099459,1686.6513 15.193291,0"
           id="path6426"
           sodipodi:nodetypes="cc"
           inkscape:connector-curvature="0" />
      </g>
      <text
         xml:space="preserve"
         style="font-style:normal;font-weight:normal;font-size:32px;line-height:125%;font-family:Sans;letter-spacing:0px;word-spacing:0px;fill:#000000;fill-opacity:1;stroke:none"
         x="-12.94457"
         y="1657.7274"
         id="text8774"
         sodipodi:linespacing="125%"><tspan
           sodipodi:role="line"
           id="tspan8776"
           x="-12.94457"
           y="1657.7274"
           style="font-size:24px">U<tspan
   id="tspan8778"
   style="font-size:65.00091553%;baseline-shift:sub">LP_rp1</tspan></tspan></text>
    </g>
    <g
       id="g8853"
       style="display:inline"
       transform="matrix(0.48347268,0,0,0.48347268,-100.44693,1652.6486)">
      <path
         style="display:inline;fill:none;stroke:#000000;stroke-width:3.54330707;stroke-linecap:square;stroke-linejoin:miter;stroke-miterlimit:4;stroke-dasharray:none;stroke-opacity:1"
         d="m 212.1968,201.43114 -42.51967,0"
         id="path8855"
         sodipodi:nodetypes="cc"
         inkscape:connector-curvature="0" />
      <path
         style="display:inline;fill:none;stroke:#000000;stroke-width:3.54330587;stroke-linecap:butt;stroke-linejoin:miter;stroke-miterlimit:4;stroke-dasharray:none;stroke-opacity:1"
         d="m 190.93697,187.2579 0,14.17324"
         id="path8857"
         sodipodi:nodetypes="cc"
         inkscape:connector-curvature="0" />
      <path
         style="display:inline;fill:none;stroke:#000000;stroke-width:3.54330707;stroke-linecap:square;stroke-linejoin:miter;stroke-miterlimit:4;stroke-dasharray:none;stroke-opacity:1"
         d="m 205.11019,208.51774 -28.34646,0"
         id="path8859"
         sodipodi:nodetypes="cc"
         inkscape:connector-curvature="0" />
      <path
         style="display:inline;fill:none;stroke:#000000;stroke-width:3.54330707;stroke-linecap:square;stroke-linejoin:miter;stroke-miterlimit:4;stroke-dasharray:none;stroke-opacity:1"
         d="m 198.02357,215.60436 -14.17322,0"
         id="path8861"
         sodipodi:nodetypes="cc"
         inkscape:connector-curvature="0" />
    </g>
    <path
       sodipodi:type="arc"
       style="fill:none;stroke:#000000;stroke-width:1.63686037;stroke-miterlimit:4;stroke-opacity:1;stroke-dasharray:none"
       id="path4528"
       sodipodi:cx="309.10669"
       sodipodi:cy="487.68692"
       sodipodi:rx="115.17954"
       sodipodi:ry="115.17954"
       d="M 424.28623,487.68692 A 115.17954,115.17954 0 0 1 309.10669,602.86646 115.17954,115.17954 0 0 1 193.92715,487.68692 115.17954,115.17954 0 0 1 309.10669,372.50738 115.17954,115.17954 0 0 1 424.28623,487.68692 Z"
       transform="matrix(1.4523101,-2.6872943,2.6872943,1.4523101,-1761.1107,1174.4637)" />
    <text
       xml:space="preserve"
       style="font-size:32px;font-style:normal;font-weight:normal;line-height:125%;letter-spacing:0px;word-spacing:0px;fill:#000000;fill-opacity:1;stroke:none;font-family:Sans"
       id="text9170"
       sodipodi:linespacing="125%"
       transform="translate(3.52737,-7.05474)"><textPath
         xlink:href="#path4528"
         id="textPath9199"><tspan
   id="tspan9172">chamber</tspan></textPath></text>
    <text
       sodipodi:linespacing="125%"
       id="text9202"
       style="font-size:32px;font-style:normal;font-weight:normal;line-height:125%;letter-spacing:0px;word-spacing:0px;fill:#000000;fill-opacity:1;stroke:none;font-family:Sans"
       xml:space="preserve"
       transform="translate(-33.510015,31.74633)"><textPath
         id="textPath9204"
         xlink:href="#path4528">plasma radius</textPath></text>
    <text
       xml:space="preserve"
       style="font-style:normal;font-weight:normal;font-size:32px;line-height:125%;font-family:Sans;letter-spacing:0px;word-spacing:0px;fill:#000000;fill-opacity:1;stroke:none"
       x="-1546.4067"
       y="-46.947849"
       id="text9208"
       sodipodi:linespacing="125%"
       transform="matrix(0,-1,1,0,0,0)"><tspan
         sodipodi:role="line"
         id="tspan9210"
         x="-1546.4067"
         y="-46.947849">double rake probe</tspan></text>
    <g
       transform="translate(-9.6499404,215.01664)"
       id="g3562">
      <g
         id="g3564">
        <path
           inkscape:tile-y0="1071.9647"
           inkscape:tile-x0="5.305915"
           inkscape:tile-h="0"
           inkscape:tile-w="6.932734"
           inkscape:tile-cy="1071.9647"
           inkscape:tile-cx="8.772282"
           inkscape:connector-curvature="0"
           sodipodi:nodetypes="cc"
           id="path3566"
           d="m 12.238649,1071.9647 -6.932734,0"
           style="fill:none;stroke:#000000;stroke-width:3.54330516;stroke-linecap:square;stroke-linejoin:miter;stroke-miterlimit:4;stroke-dasharray:none;stroke-opacity:1" />
        <path
           style="fill:none;stroke:#000000;stroke-width:3.54330516;stroke-linecap:square;stroke-linejoin:miter;stroke-miterlimit:4;stroke-dasharray:none;stroke-opacity:1"
           d="m 12.324226,1080.5932 -6.9327334,0"
           id="path3568"
           sodipodi:nodetypes="cc"
           inkscape:connector-curvature="0"
           inkscape:tile-cx="8.772282"
           inkscape:tile-cy="1071.9647"
           inkscape:tile-w="6.932734"
           inkscape:tile-h="0"
           inkscape:tile-x0="5.305915"
           inkscape:tile-y0="1071.9647" />
        <path
           style="fill:none;stroke:#000000;stroke-width:3.54330516;stroke-linecap:square;stroke-linejoin:miter;stroke-miterlimit:4;stroke-dasharray:none;stroke-opacity:1"
           d="m 12.238649,1089.746 -6.932734,0"
           id="path3570"
           sodipodi:nodetypes="cc"
           inkscape:connector-curvature="0"
           inkscape:tile-cx="8.772282"
           inkscape:tile-cy="1071.9647"
           inkscape:tile-w="6.932734"
           inkscape:tile-h="0"
           inkscape:tile-x0="5.305915"
           inkscape:tile-y0="1071.9647" />
        <path
           inkscape:tile-y0="1071.9647"
           inkscape:tile-x0="5.305915"
           inkscape:tile-h="0"
           inkscape:tile-w="6.932734"
           inkscape:tile-cy="1071.9647"
           inkscape:tile-cx="8.772282"
           inkscape:connector-curvature="0"
           sodipodi:nodetypes="cc"
           id="path3572"
           d="m 12.324226,1098.3745 -6.9327334,0"
           style="fill:none;stroke:#000000;stroke-width:3.54330516;stroke-linecap:square;stroke-linejoin:miter;stroke-miterlimit:4;stroke-dasharray:none;stroke-opacity:1" />
      </g>
      <g
         id="g3574"
         transform="translate(0.11698219,35.094658)">
        <path
           style="fill:none;stroke:#000000;stroke-width:3.54330516;stroke-linecap:square;stroke-linejoin:miter;stroke-miterlimit:4;stroke-dasharray:none;stroke-opacity:1"
           d="m 12.238649,1071.9647 -6.932734,0"
           id="path3576"
           sodipodi:nodetypes="cc"
           inkscape:connector-curvature="0"
           inkscape:tile-cx="8.772282"
           inkscape:tile-cy="1071.9647"
           inkscape:tile-w="6.932734"
           inkscape:tile-h="0"
           inkscape:tile-x0="5.305915"
           inkscape:tile-y0="1071.9647" />
        <path
           inkscape:tile-y0="1071.9647"
           inkscape:tile-x0="5.305915"
           inkscape:tile-h="0"
           inkscape:tile-w="6.932734"
           inkscape:tile-cy="1071.9647"
           inkscape:tile-cx="8.772282"
           inkscape:connector-curvature="0"
           sodipodi:nodetypes="cc"
           id="path3578"
           d="m 12.324226,1080.5932 -6.9327334,0"
           style="fill:none;stroke:#000000;stroke-width:3.54330516;stroke-linecap:square;stroke-linejoin:miter;stroke-miterlimit:4;stroke-dasharray:none;stroke-opacity:1" />
        <path
           inkscape:tile-y0="1071.9647"
           inkscape:tile-x0="5.305915"
           inkscape:tile-h="0"
           inkscape:tile-w="6.932734"
           inkscape:tile-cy="1071.9647"
           inkscape:tile-cx="8.772282"
           inkscape:connector-curvature="0"
           sodipodi:nodetypes="cc"
           id="path3580"
           d="m 12.238649,1089.746 -6.932734,0"
           style="fill:none;stroke:#000000;stroke-width:3.54330516;stroke-linecap:square;stroke-linejoin:miter;stroke-miterlimit:4;stroke-dasharray:none;stroke-opacity:1" />
        <path
           style="fill:none;stroke:#000000;stroke-width:3.54330516;stroke-linecap:square;stroke-linejoin:miter;stroke-miterlimit:4;stroke-dasharray:none;stroke-opacity:1"
           d="m 12.324226,1098.3745 -6.9327334,0"
           id="path3582"
           sodipodi:nodetypes="cc"
           inkscape:connector-curvature="0"
           inkscape:tile-cx="8.772282"
           inkscape:tile-cy="1071.9647"
           inkscape:tile-w="6.932734"
           inkscape:tile-h="0"
           inkscape:tile-x0="5.305915"
           inkscape:tile-y0="1071.9647" />
      </g>
      <g
         id="g3584"
         transform="translate(0.23396439,70.657245)">
        <path
           style="fill:none;stroke:#000000;stroke-width:3.54330516;stroke-linecap:square;stroke-linejoin:miter;stroke-miterlimit:4;stroke-dasharray:none;stroke-opacity:1"
           d="m 12.238649,1071.9647 -6.932734,0"
           id="path3586"
           sodipodi:nodetypes="cc"
           inkscape:connector-curvature="0"
           inkscape:tile-cx="8.772282"
           inkscape:tile-cy="1071.9647"
           inkscape:tile-w="6.932734"
           inkscape:tile-h="0"
           inkscape:tile-x0="5.305915"
           inkscape:tile-y0="1071.9647" />
        <path
           inkscape:tile-y0="1071.9647"
           inkscape:tile-x0="5.305915"
           inkscape:tile-h="0"
           inkscape:tile-w="6.932734"
           inkscape:tile-cy="1071.9647"
           inkscape:tile-cx="8.772282"
           inkscape:connector-curvature="0"
           sodipodi:nodetypes="cc"
           id="path3588"
           d="m 12.324226,1080.5932 -6.9327334,0"
           style="fill:none;stroke:#000000;stroke-width:3.54330516;stroke-linecap:square;stroke-linejoin:miter;stroke-miterlimit:4;stroke-dasharray:none;stroke-opacity:1" />
        <path
           inkscape:tile-y0="1071.9647"
           inkscape:tile-x0="5.305915"
           inkscape:tile-h="0"
           inkscape:tile-w="6.932734"
           inkscape:tile-cy="1071.9647"
           inkscape:tile-cx="8.772282"
           inkscape:connector-curvature="0"
           sodipodi:nodetypes="cc"
           id="path3590"
           d="m 12.238649,1089.746 -6.932734,0"
           style="fill:none;stroke:#000000;stroke-width:3.54330516;stroke-linecap:square;stroke-linejoin:miter;stroke-miterlimit:4;stroke-dasharray:none;stroke-opacity:1" />
        <path
           style="fill:none;stroke:#000000;stroke-width:3.54330516;stroke-linecap:square;stroke-linejoin:miter;stroke-miterlimit:4;stroke-dasharray:none;stroke-opacity:1"
           d="m 12.324226,1098.3745 -6.9327334,0"
           id="path3592"
           sodipodi:nodetypes="cc"
           inkscape:connector-curvature="0"
           inkscape:tile-cx="8.772282"
           inkscape:tile-cy="1071.9647"
           inkscape:tile-w="6.932734"
           inkscape:tile-h="0"
           inkscape:tile-x0="5.305915"
           inkscape:tile-y0="1071.9647" />
      </g>
      <g
         transform="translate(0.35094658,105.7519)"
         id="g3594">
        <path
           inkscape:tile-y0="1071.9647"
           inkscape:tile-x0="5.305915"
           inkscape:tile-h="0"
           inkscape:tile-w="6.932734"
           inkscape:tile-cy="1071.9647"
           inkscape:tile-cx="8.772282"
           inkscape:connector-curvature="0"
           sodipodi:nodetypes="cc"
           id="path3596"
           d="m 12.238649,1071.9647 -6.932734,0"
           style="fill:none;stroke:#000000;stroke-width:3.54330516;stroke-linecap:square;stroke-linejoin:miter;stroke-miterlimit:4;stroke-dasharray:none;stroke-opacity:1" />
        <path
           style="fill:none;stroke:#000000;stroke-width:3.54330516;stroke-linecap:square;stroke-linejoin:miter;stroke-miterlimit:4;stroke-dasharray:none;stroke-opacity:1"
           d="m 12.324226,1080.5932 -6.9327334,0"
           id="path3598"
           sodipodi:nodetypes="cc"
           inkscape:connector-curvature="0"
           inkscape:tile-cx="8.772282"
           inkscape:tile-cy="1071.9647"
           inkscape:tile-w="6.932734"
           inkscape:tile-h="0"
           inkscape:tile-x0="5.305915"
           inkscape:tile-y0="1071.9647" />
        <path
           style="fill:none;stroke:#000000;stroke-width:3.54330516;stroke-linecap:square;stroke-linejoin:miter;stroke-miterlimit:4;stroke-dasharray:none;stroke-opacity:1"
           d="m 12.238649,1089.746 -6.932734,0"
           id="path3600"
           sodipodi:nodetypes="cc"
           inkscape:connector-curvature="0"
           inkscape:tile-cx="8.772282"
           inkscape:tile-cy="1071.9647"
           inkscape:tile-w="6.932734"
           inkscape:tile-h="0"
           inkscape:tile-x0="5.305915"
           inkscape:tile-y0="1071.9647" />
        <path
           inkscape:tile-y0="1071.9647"
           inkscape:tile-x0="5.305915"
           inkscape:tile-h="0"
           inkscape:tile-w="6.932734"
           inkscape:tile-cy="1071.9647"
           inkscape:tile-cx="8.772282"
           inkscape:connector-curvature="0"
           sodipodi:nodetypes="cc"
           id="path3602"
           d="m 12.324226,1098.3745 -6.9327334,0"
           style="fill:none;stroke:#000000;stroke-width:3.54330516;stroke-linecap:square;stroke-linejoin:miter;stroke-miterlimit:4;stroke-dasharray:none;stroke-opacity:1" />
      </g>
    </g>
    <text
       xml:space="preserve"
       style="font-style:normal;font-weight:normal;font-size:32px;line-height:125%;font-family:Sans;letter-spacing:0px;word-spacing:0px;fill:#000000;fill-opacity:1;stroke:none"
       x="17.597328"
       y="1353.3851"
       id="text3606"
       sodipodi:linespacing="125%"><tspan
         sodipodi:role="line"
         id="tspan3608"
         x="17.597328"
         y="1353.3851"
         style="font-size:24px">LP<tspan
   id="tspan3610"
   style="font-size:65.00091553%;baseline-shift:sub">11,12</tspan></tspan><tspan
         id="tspan3612"
         sodipodi:role="line"
         x="17.597328"
         y="1383.3851"
         style="font-size:24px" /></text>
    <path
       transform="matrix(2.5833146,0,0,2.5931784,-800.15352,-213.71965)"
       d="M 424.28623,487.68692 A 115.17954,115.17954 0 0 1 309.10669,602.86646 115.17954,115.17954 0 0 1 193.92715,487.68692 115.17954,115.17954 0 0 1 309.10669,372.50738 115.17954,115.17954 0 0 1 424.28623,487.68692 Z"
       sodipodi:ry="115.17954"
       sodipodi:rx="115.17954"
       sodipodi:cy="487.68692"
       sodipodi:cx="309.10669"
       id="path3788"
       style="fill:url(#radialGradient9017);fill-opacity:1;stroke:none"
       sodipodi:type="arc" />
    <path
       inkscape:connector-curvature="0"
       sodipodi:nodetypes="cc"
       id="path3614"
       d="m -7.8993709,1550.5379 0,120.0599"
       style="fill:none;stroke:#000000;stroke-width:2.22262907;stroke-linecap:square;stroke-linejoin:miter;stroke-miterlimit:4;stroke-dasharray:none;stroke-opacity:1" />
    <g
       transform="matrix(0,0.79631227,-0.79631227,0,1334.8956,1632.4484)"
       id="g3618">
      <ellipse
         style="color:#000000;display:inline;overflow:visible;visibility:visible;fill:none;stroke:#000000;stroke-width:1.92675233;stroke-linecap:square;stroke-linejoin:miter;stroke-miterlimit:4;stroke-dasharray:none;stroke-dashoffset:0;stroke-opacity:1;marker:none"
         id="ellipse3620"
         transform="matrix(2,0,0,2.666666,-749.66783,1417.6752)"
         cx="421.65353"
         cy="100.86611"
         rx="14.173228"
         ry="10.629921" />
      <path
         style="display:inline;fill:none;stroke:#000000;stroke-width:4.44964743;stroke-linecap:square;stroke-linejoin:miter;stroke-miterlimit:4;stroke-dasharray:none;stroke-opacity:1"
         d="m 121.98567,1686.6513 15.89824,0"
         id="path3622"
         sodipodi:nodetypes="cc"
         inkscape:connector-curvature="0" />
      <path
         style="display:inline;fill:none;stroke:#000000;stroke-width:4.44964743;stroke-linecap:square;stroke-linejoin:miter;stroke-miterlimit:4;stroke-dasharray:none;stroke-opacity:1"
         d="m 50.099459,1686.6513 15.193291,0"
         id="path3624"
         sodipodi:nodetypes="cc"
         inkscape:connector-curvature="0" />
    </g>
    <text
       xml:space="preserve"
       style="font-style:normal;font-weight:normal;font-size:25.48199272px;line-height:125%;font-family:Sans;letter-spacing:0px;word-spacing:0px;fill:#000000;fill-opacity:1;stroke:none"
       x="20.973133"
       y="1700.4718"
       id="text3626"
       sodipodi:linespacing="125%"><tspan
         sodipodi:role="line"
         id="tspan3628"
         x="20.973133"
         y="1700.4718"
         style="font-size:19.11149406px">U<tspan
   id="tspan3630"
   style="font-size:12.42264652px;baseline-shift:sub">LP_rp5</tspan></tspan></text>
    <g
       id="g3642"
       transform="translate(3.4808003,5.1315111)">
      <g
         id="g3632"
         style="display:inline"
         transform="matrix(0.48347268,0,0,0.48347268,-126.46111,1647.1284)">
        <path
           style="display:inline;fill:none;stroke:#000000;stroke-width:3.54330707;stroke-linecap:square;stroke-linejoin:miter;stroke-miterlimit:4;stroke-dasharray:none;stroke-opacity:1"
           d="m 212.1968,201.43114 -42.51967,0"
           id="path3634"
           sodipodi:nodetypes="cc"
           inkscape:connector-curvature="0" />
        <path
           style="display:inline;fill:none;stroke:#000000;stroke-width:3.54330587;stroke-linecap:butt;stroke-linejoin:miter;stroke-miterlimit:4;stroke-dasharray:none;stroke-opacity:1"
           d="m 190.93697,74.118485 0,127.312655"
           id="path3636"
           sodipodi:nodetypes="cc"
           inkscape:connector-curvature="0" />
        <path
           style="display:inline;fill:none;stroke:#000000;stroke-width:3.54330707;stroke-linecap:square;stroke-linejoin:miter;stroke-miterlimit:4;stroke-dasharray:none;stroke-opacity:1"
           d="m 205.11019,208.51774 -28.34646,0"
           id="path3638"
           sodipodi:nodetypes="cc"
           inkscape:connector-curvature="0" />
        <path
           style="display:inline;fill:none;stroke:#000000;stroke-width:3.54330707;stroke-linecap:square;stroke-linejoin:miter;stroke-miterlimit:4;stroke-dasharray:none;stroke-opacity:1"
           d="m 198.02357,215.60436 -14.17322,0"
           id="path3640"
           sodipodi:nodetypes="cc"
           inkscape:connector-curvature="0" />
      </g>
    </g>
    <path
       style="fill:none;stroke:#000000;stroke-width:3.54330516;stroke-linecap:square;stroke-linejoin:miter;stroke-miterlimit:4;stroke-dasharray:none;stroke-opacity:1;marker-end:url(#Arrow1Send-4)"
       d="m 52.654375,1712.5411 19.53094,16.7441"
       id="path3466"
       sodipodi:nodetypes="cc"
       inkscape:connector-curvature="0" />
    <text
       xml:space="preserve"
       style="font-style:normal;font-weight:normal;font-size:32px;line-height:125%;font-family:Sans;letter-spacing:0px;word-spacing:0px;fill:#000000;fill-opacity:1;stroke:none"
       x="79.80497"
       y="1755.9332"
       id="text3468"
       sodipodi:linespacing="125%"><tspan
         sodipodi:role="line"
         id="tspan3470"
         x="79.80497"
         y="1755.9332"
         style="font-size:12.5px">(Papouch_ST_08)</tspan><tspan
         id="tspan3472"
         sodipodi:role="line"
         x="79.80497"
         y="1771.5582"
         style="font-size:24px" /></text>
    <text
       xml:space="preserve"
       style="font-style:normal;font-weight:normal;font-size:32px;line-height:125%;font-family:Sans;letter-spacing:0px;word-spacing:0px;fill:#000000;fill-opacity:1;stroke:none"
       x="80.425087"
       y="1738.411"
       id="text3474"
       sodipodi:linespacing="125%"><tspan
         sodipodi:role="line"
         id="tspan3476"
         x="80.425087"
         y="1738.411"
         style="font-size:24px">DAS</tspan><tspan
         id="tspan3478"
         sodipodi:role="line"
         x="80.425087"
         y="1768.411"
         style="font-size:24px" /></text>
    <path
       inkscape:connector-curvature="0"
       sodipodi:nodetypes="cc"
       id="path3687"
       d="m -82.607885,1641.4175 -19.530935,16.7441"
       style="fill:none;stroke:#000000;stroke-width:3.54330516;stroke-linecap:square;stroke-linejoin:miter;stroke-miterlimit:4;stroke-dasharray:none;stroke-opacity:1;marker-end:url(#Arrow1Send-4)" />
    <text
       sodipodi:linespacing="125%"
       id="text3689"
       y="1699.5784"
       x="-167.37883"
       style="font-style:normal;font-weight:normal;font-size:32px;line-height:125%;font-family:Sans;letter-spacing:0px;word-spacing:0px;fill:#000000;fill-opacity:1;stroke:none"
       xml:space="preserve"><tspan
         style="font-size:12.5px"
         y="1699.5784"
         x="-167.37883"
         id="tspan3691"
         sodipodi:role="line">(Papouch_ST_09)</tspan><tspan
         style="font-size:24px"
         y="1715.2034"
         x="-167.37883"
         sodipodi:role="line"
         id="tspan3693" /></text>
    <text
       sodipodi:linespacing="125%"
       id="text3695"
       y="1682.0562"
       x="-166.75871"
       style="font-style:normal;font-weight:normal;font-size:32px;line-height:125%;font-family:Sans;letter-spacing:0px;word-spacing:0px;fill:#000000;fill-opacity:1;stroke:none"
       xml:space="preserve"><tspan
         style="font-size:24px"
         y="1682.0562"
         x="-166.75871"
         id="tspan3697"
         sodipodi:role="line">DAS</tspan><tspan
         style="font-size:24px"
         y="1712.0562"
         x="-166.75871"
         sodipodi:role="line"
         id="tspan3699" /></text>
    <text
       xml:space="preserve"
       style="font-style:normal;font-weight:normal;font-size:32px;line-height:125%;font-family:Sans;letter-spacing:0px;word-spacing:0px;fill:#000000;fill-opacity:1;stroke:none"
       x="-557.25281"
       y="772.69781"
       id="text3701"
       sodipodi:linespacing="125%"
       inkscape:export-xdpi="90"
       inkscape:export-ydpi="90"><tspan
         sodipodi:role="line"
         id="tspan3703"
         x="-557.25281"
         y="772.69781"
         style="font-size:40px">South-East port</tspan><tspan
         id="tspan3705"
         sodipodi:role="line"
         x="-557.25281"
         y="822.69781"
         style="font-size:24px" /></text>
  </g>
</svg>
