257.76       
281.82       
294.5106     
301.37       
318.7745     
381.96074    
388.8648     
396.47291    
402.61914    
412.08154    
438.79296    
447.14802    
471.31457    
492.19313    
501.56783    
504.7738     
587.5621     
667.8151     
706.5190        
728.1349     
946.353679    
1031.1221083  
1082.9091140   
1091.292           
1196.9045041   