293.69032
296.68984
297.32352
298.14448
299.95116
302.04905
302.40324
302.58422
305.74456
305.90856
340.74594
342.71193
344.06057
344.09885
344.38763
346.58604
347.54500
347.67016
349.05738
349.78403
351.38177
352.1261
352.60406
352.61656
355.49243
355.85148
356.53787
357.02539
358.53187
358.57051
358.69845
360.66791
360.88591
361.87677
363.14629
364.7843
364.7843
367.99131
368.74564
370.55658
370.92461
372.25627
372.76188
373.33173
374.33619
374.55610
374.58993
374.82619
374.94851
375.82327
376.00494
376.37888
376.55387
376.71915
378.78799
379.00927
379.50019
379.85111
379.95473
381.29643
381.58400
382.44435
382.58809
382.78224
383.42222
384.04372
384.10477
384.99664
385.63713
386.55228
387.25009
387.80180
387.85730
388.62820
388.70480
388.85132
389.56562
389.97071
390.29455
390.64795
392.02578
392.29115
392.7920
392.7920
393.02964
395.6677
396.92570
400.52417
404.58122
406.35939
407.17377
413.20579
414.38678
419.9095
420.20289
425.07866
426.04741
427.17602
430.79020
432.57616
437.59298
438.35447
440.47501
441.51222
442.73096
489.14921
492.05028
495.75965
513.9
516.74881
517.15960
522.71891
523.29400
526.95370
527.03560
532.80383
532.85313
537.14893
539.71276
540.57749
542.96964
543.45235
544.69164
545.56092
639.36009
640.00008
641.16489
642.13504
643.08460
649.49800
654.62390
659.29134
667.79865
