<?xml version="1.0" encoding="UTF-8" standalone="no"?>
<svg
   xmlns:dc="http://purl.org/dc/elements/1.1/"
   xmlns:cc="http://creativecommons.org/ns#"
   xmlns:rdf="http://www.w3.org/1999/02/22-rdf-syntax-ns#"
   xmlns:svg="http://www.w3.org/2000/svg"
   xmlns="http://www.w3.org/2000/svg"
   xmlns:xlink="http://www.w3.org/1999/xlink"
   xmlns:sodipodi="http://sodipodi.sourceforge.net/DTD/sodipodi-0.dtd"
   xmlns:inkscape="http://www.inkscape.org/namespaces/inkscape"
   width="900"
   height="600"
   viewBox="0 0 900.00001 600.00001"
   id="svg2"
   version="1.1"
   inkscape:version="0.92.5 (2060ec1f9f, 2020-04-08)"
   sodipodi:docname="expsetup.svg"
   inkscape:export-filename="/golem/Dirigent/Diagnostics/StripDetector/setup.png"
   inkscape:export-xdpi="15.88"
   inkscape:export-ydpi="15.88">
  <defs
     id="defs4">
    <marker
       inkscape:stockid="Arrow1Lend"
       orient="auto"
       refY="0.0"
       refX="0.0"
       id="marker8913"
       style="overflow:visible;"
       inkscape:isstock="true">
      <path
         id="path8915"
         d="M 0.0,0.0 L 5.0,-5.0 L -12.5,0.0 L 5.0,5.0 L 0.0,0.0 z "
         style="fill-rule:evenodd;stroke:#000000;stroke-width:1pt;stroke-opacity:1;fill:#000000;fill-opacity:1"
         transform="scale(0.8) rotate(180) translate(12.5,0)" />
    </marker>
    <marker
       inkscape:isstock="true"
       style="overflow:visible"
       id="marker5679"
       refX="0"
       refY="0"
       orient="auto"
       inkscape:stockid="Arrow1Mend">
      <path
         transform="matrix(-0.4,0,0,-0.4,-4,0)"
         style="fill:#000000;fill-opacity:1;fill-rule:evenodd;stroke:#000000;stroke-width:1pt;stroke-opacity:1"
         d="M 0,0 5,-5 -12.5,0 5,5 0,0 Z"
         id="path5681"
         inkscape:connector-curvature="0" />
    </marker>
    <marker
       inkscape:stockid="Arrow1Lend"
       orient="auto"
       refY="0.0"
       refX="0.0"
       id="marker5418"
       style="overflow:visible;"
       inkscape:isstock="true">
      <path
         id="path4905"
         d="M 0.0,0.0 L 5.0,-5.0 L -12.5,0.0 L 5.0,5.0 L 0.0,0.0 z "
         style="fill-rule:evenodd;stroke:#000000;stroke-width:1pt;stroke-opacity:1;fill:#000000;fill-opacity:1"
         transform="scale(0.8) rotate(180) translate(12.5,0)" />
    </marker>
    <marker
       inkscape:stockid="Arrow2Lend"
       orient="auto"
       refY="0.0"
       refX="0.0"
       id="Arrow2Lend"
       style="overflow:visible;"
       inkscape:isstock="true">
      <path
         id="path4923"
         style="fill-rule:evenodd;stroke-width:0.625;stroke-linejoin:round;stroke:#000000;stroke-opacity:1;fill:#000000;fill-opacity:1"
         d="M 8.7185878,4.0337352 L -2.2072895,0.016013256 L 8.7185884,-4.0017078 C 6.9730900,-1.6296469 6.9831476,1.6157441 8.7185878,4.0337352 z "
         transform="scale(1.1) rotate(180) translate(1,0)" />
    </marker>
    <marker
       inkscape:stockid="DotS"
       orient="auto"
       refY="0"
       refX="0"
       id="marker4510"
       style="overflow:visible"
       inkscape:isstock="true">
      <path
         inkscape:connector-curvature="0"
         id="path4512"
         d="m -2.5,-1 c 0,2.76 -2.24,5 -5,5 -2.76,0 -5,-2.24 -5,-5 0,-2.76 2.24,-5 5,-5 2.76,0 5,2.24 5,5 z"
         style="fill:#000000;fill-opacity:1;fill-rule:evenodd;stroke:#000000;stroke-width:1pt;stroke-opacity:1"
         transform="matrix(0.2,0,0,0.2,1.48,0.2)" />
    </marker>
    <marker
       inkscape:isstock="true"
       style="overflow:visible"
       id="marker12343"
       refX="0"
       refY="0"
       orient="auto"
       inkscape:stockid="DotS">
      <path
         inkscape:connector-curvature="0"
         transform="matrix(0.2,0,0,0.2,1.48,0.2)"
         style="fill:#000000;fill-opacity:1;fill-rule:evenodd;stroke:#000000;stroke-width:1pt;stroke-opacity:1"
         d="m -2.5,-1 c 0,2.76 -2.24,5 -5,5 -2.76,0 -5,-2.24 -5,-5 0,-2.76 2.24,-5 5,-5 2.76,0 5,2.24 5,5 z"
         id="path12345" />
    </marker>
    <marker
       inkscape:isstock="true"
       style="overflow:visible"
       id="marker11855"
       refX="0"
       refY="0"
       orient="auto"
       inkscape:stockid="DotS">
      <path
         inkscape:connector-curvature="0"
         transform="matrix(0.2,0,0,0.2,1.48,0.2)"
         style="fill:#000000;fill-opacity:1;fill-rule:evenodd;stroke:#000000;stroke-width:1pt;stroke-opacity:1"
         d="m -2.5,-1 c 0,2.76 -2.24,5 -5,5 -2.76,0 -5,-2.24 -5,-5 0,-2.76 2.24,-5 5,-5 2.76,0 5,2.24 5,5 z"
         id="path11857" />
    </marker>
    <marker
       inkscape:stockid="DotS"
       orient="auto"
       refY="0"
       refX="0"
       id="DotS"
       style="overflow:visible"
       inkscape:isstock="true">
      <path
         id="path6149"
         d="m -2.5,-1 c 0,2.76 -2.24,5 -5,5 -2.76,0 -5,-2.24 -5,-5 0,-2.76 2.24,-5 5,-5 2.76,0 5,2.24 5,5 z"
         style="fill-rule:evenodd;stroke:#000000;stroke-width:1pt;stroke-opacity:1;fill:#000000;fill-opacity:1"
         transform="matrix(0.2,0,0,0.2,1.48,0.2)"
         inkscape:connector-curvature="0" />
    </marker>
    <marker
       inkscape:stockid="DotS"
       orient="auto"
       refY="0"
       refX="0"
       id="marker7070"
       style="overflow:visible"
       inkscape:isstock="true">
      <path
         id="path7072"
         d="m -2.5,-1 c 0,2.76 -2.24,5 -5,5 -2.76,0 -5,-2.24 -5,-5 0,-2.76 2.24,-5 5,-5 2.76,0 5,2.24 5,5 z"
         style="fill:#000000;fill-opacity:1;fill-rule:evenodd;stroke:#000000;stroke-width:1pt;stroke-opacity:1"
         transform="matrix(0.2,0,0,0.2,1.48,0.2)"
         inkscape:connector-curvature="0" />
    </marker>
    <marker
       inkscape:stockid="DotS"
       orient="auto"
       refY="0"
       refX="0"
       id="marker6751"
       style="overflow:visible"
       inkscape:isstock="true">
      <path
         id="path6753"
         d="m -2.5,-1 c 0,2.76 -2.24,5 -5,5 -2.76,0 -5,-2.24 -5,-5 0,-2.76 2.24,-5 5,-5 2.76,0 5,2.24 5,5 z"
         style="fill:#000000;fill-opacity:1;fill-rule:evenodd;stroke:#000000;stroke-width:1pt;stroke-opacity:1"
         transform="matrix(0.2,0,0,0.2,1.48,0.2)"
         inkscape:connector-curvature="0" />
    </marker>
    <marker
       inkscape:stockid="Arrow1Mend"
       orient="auto"
       refY="0"
       refX="0"
       id="marker4608"
       style="overflow:visible"
       inkscape:isstock="true">
      <path
         id="path4610"
         d="M 0,0 5,-5 -12.5,0 5,5 0,0 Z"
         style="fill:#000000;fill-opacity:1;fill-rule:evenodd;stroke:#000000;stroke-width:1pt;stroke-opacity:1"
         transform="matrix(-0.4,0,0,-0.4,-4,0)"
         inkscape:connector-curvature="0" />
    </marker>
    <marker
       inkscape:stockid="Arrow1Mend"
       orient="auto"
       refY="0"
       refX="0"
       id="Arrow1Mend"
       style="overflow:visible"
       inkscape:isstock="true">
      <path
         id="path4191"
         d="M 0,0 5,-5 -12.5,0 5,5 0,0 Z"
         style="fill:#000000;fill-opacity:1;fill-rule:evenodd;stroke:#000000;stroke-width:1pt;stroke-opacity:1"
         transform="matrix(-0.4,0,0,-0.4,-4,0)"
         inkscape:connector-curvature="0" />
    </marker>
    <marker
       inkscape:stockid="Arrow2Mend"
       orient="auto"
       refY="0"
       refX="0"
       id="Arrow2Mend"
       style="overflow:visible"
       inkscape:isstock="true">
      <path
         id="path4209"
         style="fill:#000000;fill-opacity:1;fill-rule:evenodd;stroke:#000000;stroke-width:0.625;stroke-linejoin:round;stroke-opacity:1"
         d="M 8.7185878,4.0337352 -2.2072895,0.01601326 8.7185884,-4.0017078 c -1.7454984,2.3720609 -1.7354408,5.6174519 -6e-7,8.035443 z"
         transform="scale(-0.6,-0.6)"
         inkscape:connector-curvature="0" />
    </marker>
    <marker
       inkscape:stockid="Arrow1Lend"
       orient="auto"
       refY="0"
       refX="0"
       id="Arrow1Lend"
       style="overflow:visible"
       inkscape:isstock="true">
      <path
         id="path4185"
         d="M 0,0 5,-5 -12.5,0 5,5 0,0 Z"
         style="fill:#000000;fill-opacity:1;fill-rule:evenodd;stroke:#000000;stroke-width:1pt;stroke-opacity:1"
         transform="matrix(-0.8,0,0,-0.8,-10,0)"
         inkscape:connector-curvature="0" />
    </marker>
    <marker
       inkscape:stockid="Arrow1Lstart"
       orient="auto"
       refY="0"
       refX="0"
       id="Arrow1Lstart"
       style="overflow:visible"
       inkscape:isstock="true">
      <path
         id="path4182"
         d="M 0,0 5,-5 -12.5,0 5,5 0,0 Z"
         style="fill:#000000;fill-opacity:1;fill-rule:evenodd;stroke:#000000;stroke-width:1pt;stroke-opacity:1"
         transform="matrix(0.8,0,0,0.8,10,0)"
         inkscape:connector-curvature="0" />
    </marker>
    <marker
       inkscape:stockid="Arrow1Mend"
       orient="auto"
       refY="0"
       refX="0"
       id="Arrow1Mend-7"
       style="overflow:visible"
       inkscape:isstock="true">
      <path
         inkscape:connector-curvature="0"
         id="path4191-5"
         d="M 0,0 5,-5 -12.5,0 5,5 0,0 Z"
         style="fill:#000000;fill-opacity:1;fill-rule:evenodd;stroke:#000000;stroke-width:1pt;stroke-opacity:1"
         transform="matrix(-0.4,0,0,-0.4,-4,0)" />
    </marker>
    <marker
       inkscape:stockid="Arrow1Mend"
       orient="auto"
       refY="0"
       refX="0"
       id="marker4608-3"
       style="overflow:visible"
       inkscape:isstock="true">
      <path
         inkscape:connector-curvature="0"
         id="path4610-5"
         d="M 0,0 5,-5 -12.5,0 5,5 0,0 Z"
         style="fill:#000000;fill-opacity:1;fill-rule:evenodd;stroke:#000000;stroke-width:1pt;stroke-opacity:1"
         transform="matrix(-0.4,0,0,-0.4,-4,0)" />
    </marker>
    <marker
       inkscape:stockid="Arrow1Mend"
       orient="auto"
       refY="0"
       refX="0"
       id="marker4608-3-9"
       style="overflow:visible"
       inkscape:isstock="true">
      <path
         inkscape:connector-curvature="0"
         id="path4610-5-3"
         d="M 0,0 5,-5 -12.5,0 5,5 0,0 Z"
         style="fill:#000000;fill-opacity:1;fill-rule:evenodd;stroke:#000000;stroke-width:1pt;stroke-opacity:1"
         transform="matrix(-0.4,0,0,-0.4,-4,0)" />
    </marker>
    <marker
       inkscape:stockid="Arrow1Mend"
       orient="auto"
       refY="0"
       refX="0"
       id="marker4608-3-0"
       style="overflow:visible"
       inkscape:isstock="true">
      <path
         inkscape:connector-curvature="0"
         id="path4610-5-6"
         d="M 0,0 5,-5 -12.5,0 5,5 0,0 Z"
         style="fill:#000000;fill-opacity:1;fill-rule:evenodd;stroke:#000000;stroke-width:1pt;stroke-opacity:1"
         transform="matrix(-0.4,0,0,-0.4,-4,0)" />
    </marker>
    <marker
       inkscape:stockid="Arrow1Mend"
       orient="auto"
       refY="0"
       refX="0"
       id="marker4608-3-0-6"
       style="overflow:visible"
       inkscape:isstock="true">
      <path
         inkscape:connector-curvature="0"
         id="path4610-5-6-1"
         d="M 0,0 5,-5 -12.5,0 5,5 0,0 Z"
         style="fill:#000000;fill-opacity:1;fill-rule:evenodd;stroke:#000000;stroke-width:1pt;stroke-opacity:1"
         transform="matrix(-0.4,0,0,-0.4,-4,0)" />
    </marker>
    <marker
       inkscape:stockid="Arrow1Mend"
       orient="auto"
       refY="0"
       refX="0"
       id="marker4608-3-0-3"
       style="overflow:visible"
       inkscape:isstock="true">
      <path
         inkscape:connector-curvature="0"
         id="path4610-5-6-5"
         d="M 0,0 5,-5 -12.5,0 5,5 0,0 Z"
         style="fill:#000000;fill-opacity:1;fill-rule:evenodd;stroke:#000000;stroke-width:1pt;stroke-opacity:1"
         transform="matrix(-0.4,0,0,-0.4,-4,0)" />
    </marker>
    <marker
       inkscape:stockid="DotS"
       orient="auto"
       refY="0"
       refX="0"
       id="marker6869-3"
       style="overflow:visible"
       inkscape:isstock="true">
      <path
         inkscape:connector-curvature="0"
         id="path6871-7"
         d="m -2.5,-1 c 0,2.76 -2.24,5 -5,5 -2.76,0 -5,-2.24 -5,-5 0,-2.76 2.24,-5 5,-5 2.76,0 5,2.24 5,5 z"
         style="fill:#000000;fill-opacity:1;fill-rule:evenodd;stroke:#000000;stroke-width:1pt;stroke-opacity:1"
         transform="matrix(0.2,0,0,0.2,1.48,0.2)" />
    </marker>
    <marker
       inkscape:stockid="Arrow1Mend"
       orient="auto"
       refY="0"
       refX="0"
       id="marker4608-3-9-9"
       style="overflow:visible"
       inkscape:isstock="true">
      <path
         inkscape:connector-curvature="0"
         id="path4610-5-3-7"
         d="M 0,0 5,-5 -12.5,0 5,5 0,0 Z"
         style="fill:#000000;fill-opacity:1;fill-rule:evenodd;stroke:#000000;stroke-width:1pt;stroke-opacity:1"
         transform="matrix(-0.4,0,0,-0.4,-4,0)" />
    </marker>
    <marker
       inkscape:stockid="DotS"
       orient="auto"
       refY="0"
       refX="0"
       id="marker6869-2-6"
       style="overflow:visible"
       inkscape:isstock="true">
      <path
         inkscape:connector-curvature="0"
         id="path6871-8-1"
         d="m -2.5,-1 c 0,2.76 -2.24,5 -5,5 -2.76,0 -5,-2.24 -5,-5 0,-2.76 2.24,-5 5,-5 2.76,0 5,2.24 5,5 z"
         style="fill:#000000;fill-opacity:1;fill-rule:evenodd;stroke:#000000;stroke-width:1pt;stroke-opacity:1"
         transform="matrix(0.2,0,0,0.2,1.48,0.2)" />
    </marker>
    <marker
       inkscape:stockid="Arrow1Mend"
       orient="auto"
       refY="0"
       refX="0"
       id="marker4608-3-9-9-2"
       style="overflow:visible"
       inkscape:isstock="true">
      <path
         inkscape:connector-curvature="0"
         id="path4610-5-3-7-9"
         d="M 0,0 5,-5 -12.5,0 5,5 0,0 Z"
         style="fill:#000000;fill-opacity:1;fill-rule:evenodd;stroke:#000000;stroke-width:1pt;stroke-opacity:1"
         transform="matrix(-0.4,0,0,-0.4,-4,0)" />
    </marker>
    <marker
       inkscape:stockid="DotS"
       orient="auto"
       refY="0"
       refX="0"
       id="marker6869-2-1"
       style="overflow:visible"
       inkscape:isstock="true">
      <path
         inkscape:connector-curvature="0"
         id="path6871-8-9"
         d="m -2.5,-1 c 0,2.76 -2.24,5 -5,5 -2.76,0 -5,-2.24 -5,-5 0,-2.76 2.24,-5 5,-5 2.76,0 5,2.24 5,5 z"
         style="fill:#000000;fill-opacity:1;fill-rule:evenodd;stroke:#000000;stroke-width:1pt;stroke-opacity:1"
         transform="matrix(0.2,0,0,0.2,1.48,0.2)" />
    </marker>
    <marker
       inkscape:stockid="Arrow1Mend"
       orient="auto"
       refY="0"
       refX="0"
       id="marker4608-3-9-9-4"
       style="overflow:visible"
       inkscape:isstock="true">
      <path
         inkscape:connector-curvature="0"
         id="path4610-5-3-7-7"
         d="M 0,0 5,-5 -12.5,0 5,5 0,0 Z"
         style="fill:#000000;fill-opacity:1;fill-rule:evenodd;stroke:#000000;stroke-width:1pt;stroke-opacity:1"
         transform="matrix(-0.4,0,0,-0.4,-4,0)" />
    </marker>
    <marker
       inkscape:stockid="DotS"
       orient="auto"
       refY="0"
       refX="0"
       id="marker6869-2-1-4"
       style="overflow:visible"
       inkscape:isstock="true">
      <path
         inkscape:connector-curvature="0"
         id="path6871-8-9-5"
         d="m -2.5,-1 c 0,2.76 -2.24,5 -5,5 -2.76,0 -5,-2.24 -5,-5 0,-2.76 2.24,-5 5,-5 2.76,0 5,2.24 5,5 z"
         style="fill:#000000;fill-opacity:1;fill-rule:evenodd;stroke:#000000;stroke-width:1pt;stroke-opacity:1"
         transform="matrix(0.2,0,0,0.2,1.48,0.2)" />
    </marker>
    <marker
       inkscape:stockid="Arrow1Mend"
       orient="auto"
       refY="0"
       refX="0"
       id="marker4608-3-9-9-4-0"
       style="overflow:visible"
       inkscape:isstock="true">
      <path
         inkscape:connector-curvature="0"
         id="path4610-5-3-7-7-3"
         d="M 0,0 5,-5 -12.5,0 5,5 0,0 Z"
         style="fill:#000000;fill-opacity:1;fill-rule:evenodd;stroke:#000000;stroke-width:1pt;stroke-opacity:1"
         transform="matrix(-0.4,0,0,-0.4,-4,0)" />
    </marker>
    <marker
       inkscape:stockid="DotS"
       orient="auto"
       refY="0"
       refX="0"
       id="marker6869-2-1-6"
       style="overflow:visible"
       inkscape:isstock="true">
      <path
         inkscape:connector-curvature="0"
         id="path6871-8-9-3"
         d="m -2.5,-1 c 0,2.76 -2.24,5 -5,5 -2.76,0 -5,-2.24 -5,-5 0,-2.76 2.24,-5 5,-5 2.76,0 5,2.24 5,5 z"
         style="fill:#000000;fill-opacity:1;fill-rule:evenodd;stroke:#000000;stroke-width:1pt;stroke-opacity:1"
         transform="matrix(0.2,0,0,0.2,1.48,0.2)" />
    </marker>
    <marker
       inkscape:stockid="Arrow1Mend"
       orient="auto"
       refY="0"
       refX="0"
       id="marker4608-3-9-9-4-2"
       style="overflow:visible"
       inkscape:isstock="true">
      <path
         inkscape:connector-curvature="0"
         id="path4610-5-3-7-7-0"
         d="M 0,0 5,-5 -12.5,0 5,5 0,0 Z"
         style="fill:#000000;fill-opacity:1;fill-rule:evenodd;stroke:#000000;stroke-width:1pt;stroke-opacity:1"
         transform="matrix(-0.4,0,0,-0.4,-4,0)" />
    </marker>
    <radialGradient
       gradientTransform="matrix(2.0795685,0,0,2.0795685,-356.25888,-711.2558)"
       inkscape:collect="always"
       xlink:href="#linearGradient9141"
       id="radialGradient9147"
       cx="309.10669"
       cy="487.68692"
       fx="309.10669"
       fy="487.68692"
       r="116.14631"
       gradientUnits="userSpaceOnUse" />
    <linearGradient
       inkscape:collect="always"
       id="linearGradient9141">
      <stop
         style="stop-color:#ff0000;stop-opacity:1;"
         offset="0"
         id="stop9143" />
      <stop
         style="stop-color:#ff0000;stop-opacity:0;"
         offset="1"
         id="stop9145" />
    </linearGradient>
    <circle
       style="fill:none;stroke:#000000;stroke-width:1.63686037;stroke-miterlimit:4;stroke-dasharray:none;stroke-opacity:1"
       id="path4528"
       transform="matrix(1.4523101,-2.6872943,2.6872943,1.4523101,-1761.1107,1174.4637)"
       cx="309.10669"
       cy="487.68692"
       r="115.17954" />
    <circle
       style="fill:none;stroke:#000000;stroke-width:1.63686037;stroke-miterlimit:4;stroke-dasharray:none;stroke-opacity:1"
       id="circle4239"
       transform="matrix(1.4523101,-2.6872943,2.6872943,1.4523101,-1761.1107,1174.4637)"
       cx="309.10669"
       cy="487.68692"
       r="115.17954" />
    <marker
       inkscape:stockid="DotS"
       orient="auto"
       refY="0"
       refX="0"
       id="marker6869-3-3"
       style="overflow:visible"
       inkscape:isstock="true">
      <path
         inkscape:connector-curvature="0"
         id="path6871-7-6"
         d="m -2.5,-1 c 0,2.76 -2.24,5 -5,5 -2.76,0 -5,-2.24 -5,-5 0,-2.76 2.24,-5 5,-5 2.76,0 5,2.24 5,5 z"
         style="fill:#000000;fill-opacity:1;fill-rule:evenodd;stroke:#000000;stroke-width:1pt;stroke-opacity:1"
         transform="matrix(0.2,0,0,0.2,1.48,0.2)" />
    </marker>
    <marker
       inkscape:stockid="Arrow1Mend"
       orient="auto"
       refY="0"
       refX="0"
       id="marker4608-3-9-5-7"
       style="overflow:visible"
       inkscape:isstock="true">
      <path
         inkscape:connector-curvature="0"
         id="path4610-5-3-9-5"
         d="M 0,0 5,-5 -12.5,0 5,5 0,0 Z"
         style="fill:#000000;fill-opacity:1;fill-rule:evenodd;stroke:#000000;stroke-width:1pt;stroke-opacity:1"
         transform="matrix(-0.4,0,0,-0.4,-4,0)" />
    </marker>
    <marker
       inkscape:stockid="DotS"
       orient="auto"
       refY="0"
       refX="0"
       id="marker6869-35"
       style="overflow:visible"
       inkscape:isstock="true">
      <path
         id="path6871-6"
         d="m -2.5,-1 c 0,2.76 -2.24,5 -5,5 -2.76,0 -5,-2.24 -5,-5 0,-2.76 2.24,-5 5,-5 2.76,0 5,2.24 5,5 z"
         style="fill:#000000;fill-opacity:1;fill-rule:evenodd;stroke:#000000;stroke-width:1pt;stroke-opacity:1"
         transform="matrix(0.2,0,0,0.2,1.48,0.2)"
         inkscape:connector-curvature="0" />
    </marker>
    <marker
       inkscape:stockid="Arrow1Mend"
       orient="auto"
       refY="0"
       refX="0"
       id="marker4608-3-9-2"
       style="overflow:visible"
       inkscape:isstock="true">
      <path
         inkscape:connector-curvature="0"
         id="path4610-5-3-91"
         d="M 0,0 5,-5 -12.5,0 5,5 0,0 Z"
         style="fill:#000000;fill-opacity:1;fill-rule:evenodd;stroke:#000000;stroke-width:1pt;stroke-opacity:1"
         transform="matrix(-0.4,0,0,-0.4,-4,0)" />
    </marker>
    <circle
       style="fill:none;stroke:#000000;stroke-width:1.63686037;stroke-miterlimit:4;stroke-dasharray:none;stroke-opacity:1"
       id="path4528-3"
       transform="matrix(1.4523101,-2.6872943,2.6872943,1.4523101,-1761.1107,1174.4637)"
       cx="309.10669"
       cy="487.68692"
       r="115.17954" />
    <circle
       style="fill:none;stroke:#000000;stroke-width:1.63686037;stroke-miterlimit:4;stroke-dasharray:none;stroke-opacity:1"
       id="circle4235"
       transform="matrix(1.4523101,-2.6872943,2.6872943,1.4523101,-1761.1107,1174.4637)"
       cx="309.10669"
       cy="487.68692"
       r="115.17954" />
    <marker
       inkscape:stockid="Arrow1Mend"
       orient="auto"
       refY="0"
       refX="0"
       id="marker4608-3-9-9-3"
       style="overflow:visible"
       inkscape:isstock="true">
      <path
         inkscape:connector-curvature="0"
         id="path4610-5-3-7-5"
         d="M 0,0 5,-5 -12.5,0 5,5 0,0 Z"
         style="fill:#000000;fill-opacity:1;fill-rule:evenodd;stroke:#000000;stroke-width:1pt;stroke-opacity:1"
         transform="matrix(-0.4,0,0,-0.4,-4,0)" />
    </marker>
  </defs>
  <sodipodi:namedview
     id="base"
     pagecolor="#ffffff"
     bordercolor="#666666"
     borderopacity="1.0"
     inkscape:pageopacity="1"
     inkscape:pageshadow="2"
     inkscape:zoom="0.49497475"
     inkscape:cx="-52.087518"
     inkscape:cy="561.17365"
     inkscape:document-units="px"
     inkscape:current-layer="layer1"
     showgrid="false"
     units="px"
     showguides="false"
     inkscape:snap-grids="true"
     inkscape:snap-bbox="true"
     inkscape:bbox-paths="true"
     inkscape:bbox-nodes="true"
     inkscape:snap-bbox-edge-midpoints="true"
     inkscape:snap-bbox-midpoints="false"
     inkscape:snap-center="true"
     inkscape:snap-page="true"
     inkscape:object-paths="true"
     inkscape:snap-intersection-paths="true"
     inkscape:snap-midpoints="true"
     inkscape:snap-object-midpoints="true"
     inkscape:snap-smooth-nodes="true"
     inkscape:object-nodes="true"
     inkscape:snap-global="false"
     inkscape:window-width="1920"
     inkscape:window-height="1015"
     inkscape:window-x="0"
     inkscape:window-y="0"
     inkscape:window-maximized="1"
     inkscape:snap-text-baseline="true"
     inkscape:document-rotation="0" />
  <metadata
     id="metadata7">
    <rdf:RDF>
      <cc:Work
         rdf:about="">
        <dc:format>image/svg+xml</dc:format>
        <dc:type
           rdf:resource="http://purl.org/dc/dcmitype/StillImage" />
        <dc:title />
      </cc:Work>
    </rdf:RDF>
  </metadata>
  <g
     inkscape:groupmode="layer"
     id="layer3"
     inkscape:label="Layer 3"
     style="display:inline"
     sodipodi:insensitive="true">
    <rect
       transform="translate(0,-452.36216)"
       style="display:inline;opacity:1;fill:#ffffff;fill-opacity:1;fill-rule:evenodd;stroke:none;stroke-width:2;stroke-linejoin:bevel;stroke-miterlimit:4;stroke-dasharray:none;stroke-dashoffset:0;stroke-opacity:1"
       id="rect4501"
       width="900"
       height="600"
       x="0"
       y="452.36215" />
  </g>
  <g
     inkscape:groupmode="layer"
     id="layer6"
     inkscape:label="Cervena"
     style="display:inline"
     sodipodi:insensitive="true">
    <circle
       id="path9131"
       style="display:inline;fill:url(#radialGradient9147);fill-opacity:1;stroke:#000000;stroke-width:0.31628993;stroke-miterlimit:4;stroke-dasharray:none;stroke-opacity:1"
       cx="286.54965"
       cy="302.92258"
       r="239.52376" />
  </g>
  <g
     inkscape:groupmode="layer"
     id="layer4"
     inkscape:label="Lupa"
     style="display:inline">
    <circle
       transform="translate(0,-452.36216)"
       style="display:inline;fill:none;fill-rule:evenodd;stroke:#000000;stroke-width:1;stroke-linecap:butt;stroke-linejoin:miter;stroke-miterlimit:4;stroke-dasharray:1, 2;stroke-dashoffset:0;stroke-opacity:1"
       id="path4875"
       cx="522.7373"
       cy="755.13397"
       r="48.504349" />
    <path
       style="display:inline;fill:none;fill-rule:evenodd;stroke:#000000;stroke-width:1;stroke-linecap:butt;stroke-linejoin:miter;stroke-miterlimit:4;stroke-dasharray:1, 2;stroke-dashoffset:0;stroke-opacity:1"
       d="M 658.44253,628.37709 521.08502,706.65561"
       id="path4877"
       inkscape:connector-curvature="0"
       sodipodi:nodetypes="cc"
       transform="translate(0,-452.36216)" />
    <path
       style="display:inline;fill:none;fill-rule:evenodd;stroke:#000000;stroke-width:1;stroke-linecap:butt;stroke-linejoin:miter;stroke-miterlimit:4;stroke-dasharray:1, 2;stroke-dashoffset:0;stroke-opacity:1"
       d="M 522.7373,351.27616 640.69537,440.1832"
       id="path4879"
       inkscape:connector-curvature="0"
       sodipodi:nodetypes="cc" />
  </g>
  <g
     inkscape:groupmode="layer"
     id="layer5"
     inkscape:label="Lupa 2"
     style="display:inline" />
  <g
     inkscape:label="Layer 1"
     inkscape:groupmode="layer"
     id="layer1"
     transform="translate(0,-452.36216)"
     style="display:inline">
    <path
       id="path1521"
       style="display:inline;fill:#0000ff;fill-opacity:0.25;stroke:#000000;stroke-width:1.33333;stroke-linecap:square;stroke-linejoin:miter;stroke-miterlimit:4;stroke-dasharray:1.33333, 5.33333;stroke-dashoffset:0;stroke-opacity:1;paint-order:markers stroke fill"
       d="m 855.15039,206.92578 a 159.2198,159.2198 0 0 0 -0.36328,-0.39648 159.2198,159.2198 0 0 0 -0.72266,-0.7793 159.2198,159.2198 0 0 0 -0.72656,-0.77148 159.2198,159.2198 0 0 0 -0.73047,-0.76954 159.2198,159.2198 0 0 0 -0.73828,-0.76367 159.2198,159.2198 0 0 0 -0.74219,-0.75781 159.2198,159.2198 0 0 0 -0.74609,-0.75391 159.2198,159.2198 0 0 0 -0.75195,-0.74804 159.2198,159.2198 0 0 0 -0.75782,-0.74414 159.2198,159.2198 0 0 0 -0.76171,-0.73829 159.2198,159.2198 0 0 0 -0.76758,-0.73242 159.2198,159.2198 0 0 0 -0.77149,-0.72851 159.2198,159.2198 0 0 0 -0.77539,-0.72266 159.2198,159.2198 0 0 0 -0.78125,-0.71875 159.2198,159.2198 0 0 0 -0.78711,-0.71289 159.2198,159.2198 0 0 0 -0.46484,-0.41601 H 715.14453 v 187.02343 h 140.00586 z"
       transform="translate(0,452.36216)" />
    <rect
       style="display:inline;fill:#00ff00;fill-opacity:0.25;stroke:#000000;stroke-width:1.33333;stroke-linecap:square;stroke-linejoin:miter;stroke-miterlimit:4;stroke-dasharray:1.33333, 5.33333;stroke-dashoffset:0;stroke-opacity:1;paint-order:markers stroke fill"
       id="rect1470"
       width="75.47673"
       height="187.02266"
       x="639.66846"
       y="648.03497" />
    <rect
       style="opacity:1;fill:#ffffff;fill-opacity:1;stroke:none;stroke-width:0.0506836;stroke-linecap:square;stroke-linejoin:miter;stroke-miterlimit:4;stroke-dasharray:none;stroke-opacity:1;paint-order:markers stroke fill"
       id="rect1472"
       width="279.32227"
       height="191.91901"
       x="627.66846"
       y="652.89246" />
    <rect
       style="display:inline;fill:#0000ff;fill-opacity:0.25;stroke:#000000;stroke-width:1.33333;stroke-linecap:square;stroke-linejoin:miter;stroke-miterlimit:4;stroke-dasharray:1.33333, 5.33333;stroke-dashoffset:0;stroke-opacity:1;paint-order:markers stroke fill"
       id="rect1466"
       width="140.0049"
       height="187.02266"
       x="701.1452"
       y="660.03497"
       ry="0" />
    <rect
       style="display:inline;fill:#00ff00;fill-opacity:0.25;stroke:#000000;stroke-width:1.33333;stroke-linecap:square;stroke-linejoin:miter;stroke-miterlimit:4;stroke-dasharray:1.33333, 5.33333;stroke-dashoffset:0;stroke-opacity:1;paint-order:markers stroke fill"
       id="rect1464"
       width="75.47673"
       height="187.02266"
       x="625.66846"
       y="660.03497" />
    <path
       id="path1505"
       style="opacity:1;fill:#ffffff;fill-opacity:1;stroke:none;stroke-width:0.0506836;stroke-linecap:square;stroke-linejoin:miter;stroke-miterlimit:4;stroke-dasharray:none;stroke-opacity:1;paint-order:markers stroke fill"
       d="m 615.32617,212.53125 a 159.2198,159.2198 0 0 0 -0.12695,0.15234 159.2198,159.2198 0 0 0 -0.67383,0.81836 159.2198,159.2198 0 0 0 -0.66992,0.82422 159.2198,159.2198 0 0 0 -0.1875,0.23242 v 189.89063 h 255.33398 a 159.2198,159.2198 0 0 0 0.11524,-0.16602 159.2198,159.2198 0 0 0 0.5957,-0.8789 159.2198,159.2198 0 0 0 0.58984,-0.88086 159.2198,159.2198 0 0 0 0.58399,-0.88672 159.2198,159.2198 0 0 0 0.57812,-0.88867 159.2198,159.2198 0 0 0 0.57227,-0.89453 159.2198,159.2198 0 0 0 0.56641,-0.89649 159.2198,159.2198 0 0 0 0.56054,-0.90039 159.2198,159.2198 0 0 0 0.55469,-0.90625 159.2198,159.2198 0 0 0 0.54883,-0.9082 159.2198,159.2198 0 0 0 0.54101,-0.91211 159.2198,159.2198 0 0 0 0.53711,-0.91406 159.2198,159.2198 0 0 0 0.5293,-0.91993 159.2198,159.2198 0 0 0 0.52539,-0.92187 159.2198,159.2198 0 0 0 0.51758,-0.92774 159.2198,159.2198 0 0 0 0.51172,-0.92968 159.2198,159.2198 0 0 0 0.5039,-0.93164 159.2198,159.2198 0 0 0 0.5,-0.9375 159.2198,159.2198 0 0 0 0.49219,-0.93946 159.2198,159.2198 0 0 0 0.48828,-0.9414 159.2198,159.2198 0 0 0 0.48047,-0.94727 159.2198,159.2198 0 0 0 0.47266,-0.94922 159.2198,159.2198 0 0 0 0.46875,-0.95312 159.2198,159.2198 0 0 0 0.46094,-0.95508 159.2198,159.2198 0 0 0 0.45507,-0.95899 159.2198,159.2198 0 0 0 0.44922,-0.96093 159.2198,159.2198 0 0 0 0.44141,-0.96485 159.2198,159.2198 0 0 0 0.43554,-0.96679 159.2198,159.2198 0 0 0 0.42969,-0.97071 159.2198,159.2198 0 0 0 0.42188,-0.97265 159.2198,159.2198 0 0 0 0.41601,-0.97657 159.2198,159.2198 0 0 0 0.41016,-0.97851 159.2198,159.2198 0 0 0 0.4043,-0.98047 159.2198,159.2198 0 0 0 0.39648,-0.98437 159.2198,159.2198 0 0 0 0.39063,-0.98829 159.2198,159.2198 0 0 0 0.38281,-0.98828 159.2198,159.2198 0 0 0 0.37695,-0.99218 159.2198,159.2198 0 0 0 0.37109,-0.99414 159.2198,159.2198 0 0 0 0.36329,-0.9961 159.2198,159.2198 0 0 0 0.35742,-1 159.2198,159.2198 0 0 0 0.34961,-1.00195 159.2198,159.2198 0 0 0 0.34375,-1.00391 159.2198,159.2198 0 0 0 0.33789,-1.00586 159.2198,159.2198 0 0 0 0.33008,-1.00781 159.2198,159.2198 0 0 0 0.32226,-1.00977 159.2198,159.2198 0 0 0 0.31836,-1.01367 159.2198,159.2198 0 0 0 0.3086,-1.01562 159.2198,159.2198 0 0 0 0.30468,-1.01563 159.2198,159.2198 0 0 0 0.29492,-1.01953 A 159.2198,159.2198 0 0 0 891,357.375 a 159.2198,159.2198 0 0 0 0.2832,-1.02344 159.2198,159.2198 0 0 0 0.27539,-1.02344 159.2198,159.2198 0 0 0 0.26953,-1.02734 159.2198,159.2198 0 0 0 0.26172,-1.02734 159.2198,159.2198 0 0 0 0.25586,-1.03125 159.2198,159.2198 0 0 0 0.24805,-1.03125 159.2198,159.2198 0 0 0 0.24219,-1.03321 159.2198,159.2198 0 0 0 0.15429,-0.68164 v -70.17773 a 159.2198,159.2198 0 0 0 -0.084,-0.375 159.2198,159.2198 0 0 0 -0.24023,-1.0332 159.2198,159.2198 0 0 0 -0.24805,-1.03321 159.2198,159.2198 0 0 0 -0.25195,-1.02929 159.2198,159.2198 0 0 0 -0.26172,-1.0293 159.2198,159.2198 0 0 0 -0.26758,-1.02734 159.2198,159.2198 0 0 0 -0.27344,-1.0254 159.2198,159.2198 0 0 0 -0.28125,-1.02148 159.2198,159.2198 0 0 0 -0.28711,-1.02148 159.2198,159.2198 0 0 0 -0.29492,-1.01954 159.2198,159.2198 0 0 0 -0.30078,-1.01757 159.2198,159.2198 0 0 0 -0.3086,-1.01563 159.2198,159.2198 0 0 0 -0.31445,-1.01367 159.2198,159.2198 0 0 0 -0.32226,-1.01172 159.2198,159.2198 0 0 0 -0.32813,-1.00781 159.2198,159.2198 0 0 0 -0.33398,-1.00781 159.2198,159.2198 0 0 0 -0.3418,-1.00391 159.2198,159.2198 0 0 0 -0.34961,-1.00195 159.2198,159.2198 0 0 0 -0.35547,-1 159.2198,159.2198 0 0 0 -0.36133,-0.99805 159.2198,159.2198 0 0 0 -0.36718,-0.99414 159.2198,159.2198 0 0 0 -0.375,-0.99219 159.2198,159.2198 0 0 0 -0.38282,-0.99023 159.2198,159.2198 0 0 0 -0.38867,-0.98828 159.2198,159.2198 0 0 0 -0.39453,-0.98438 159.2198,159.2198 0 0 0 -0.40039,-0.98242 159.2198,159.2198 0 0 0 -0.4082,-0.98047 159.2198,159.2198 0 0 0 -0.41407,-0.97656 159.2198,159.2198 0 0 0 -0.42187,-0.97266 159.2198,159.2198 0 0 0 -0.42774,-0.97265 159.2198,159.2198 0 0 0 -0.43359,-0.9668 159.2198,159.2198 0 0 0 -0.43945,-0.9668 159.2198,159.2198 0 0 0 -0.44727,-0.96094 159.2198,159.2198 0 0 0 -0.45312,-0.96093 159.2198,159.2198 0 0 0 -0.45899,-0.95508 159.2198,159.2198 0 0 0 -0.46679,-0.95313 159.2198,159.2198 0 0 0 -0.47071,-0.95117 159.2198,159.2198 0 0 0 -0.47851,-0.94726 159.2198,159.2198 0 0 0 -0.48633,-0.94336 159.2198,159.2198 0 0 0 -0.49024,-0.94141 159.2198,159.2198 0 0 0 -0.49804,-0.93555 159.2198,159.2198 0 0 0 -0.50391,-0.93554 159.2198,159.2198 0 0 0 -0.50976,-0.92969 159.2198,159.2198 0 0 0 -0.51563,-0.92774 159.2198,159.2198 0 0 0 -0.52148,-0.92382 159.2198,159.2198 0 0 0 -0.5293,-0.91992 159.2198,159.2198 0 0 0 -0.5332,-0.91602 159.2198,159.2198 0 0 0 -0.54102,-0.91406 159.2198,159.2198 0 0 0 -0.54687,-0.90821 159.2198,159.2198 0 0 0 -0.55274,-0.90625 159.2198,159.2198 0 0 0 -0.55859,-0.90234 159.2198,159.2198 0 0 0 -0.56446,-0.89844 159.2198,159.2198 0 0 0 -0.57031,-0.89453 159.2198,159.2198 0 0 0 -0.57812,-0.89062 159.2198,159.2198 0 0 0 -0.58203,-0.88672 159.2198,159.2198 0 0 0 -0.58789,-0.88281 159.2198,159.2198 0 0 0 -0.59375,-0.87891 159.2198,159.2198 0 0 0 -0.60157,-0.875 159.2198,159.2198 0 0 0 -0.60547,-0.87109 159.2198,159.2198 0 0 0 -0.61132,-0.86719 159.2198,159.2198 0 0 0 -0.61719,-0.86328 159.2198,159.2198 0 0 0 -0.62305,-0.85743 159.2198,159.2198 0 0 0 -0.6289,-0.85546 159.2198,159.2198 0 0 0 -0.63477,-0.84961 159.2198,159.2198 0 0 0 -0.64063,-0.84571 159.2198,159.2198 0 0 0 -0.64648,-0.84179 159.2198,159.2198 0 0 0 -0.65039,-0.83789 159.2198,159.2198 0 0 0 -0.6582,-0.83399 159.2198,159.2198 0 0 0 -0.66211,-0.82812 159.2198,159.2198 0 0 0 -0.66797,-0.82422 159.2198,159.2198 0 0 0 -0.67383,-0.82031 159.2198,159.2198 0 0 0 -0.32617,-0.39063 z"
       transform="translate(0,452.36216)" />
    <path
       id="path1507"
       style="opacity:1;fill:#ffffff;fill-opacity:0.75;stroke:none;stroke-width:0.0506836;stroke-linecap:square;stroke-linejoin:miter;stroke-miterlimit:4;stroke-dasharray:none;stroke-opacity:1;paint-order:markers stroke fill"
       d="m 615.32617,212.53125 h -1.6582 v 2.02734 a 159.2198,159.2198 0 0 1 0.1875,-0.23242 159.2198,159.2198 0 0 1 0.66992,-0.82422 159.2198,159.2198 0 0 1 0.67383,-0.81836 159.2198,159.2198 0 0 1 0.12695,-0.15234 z"
       transform="translate(0,452.36216)" />
    <rect
       style="display:inline;fill:#0000ff;fill-opacity:0.25;stroke:#000000;stroke-width:1.33333;stroke-linecap:square;stroke-linejoin:miter;stroke-miterlimit:4;stroke-dasharray:1.33333, 5.33333;stroke-dashoffset:0;stroke-opacity:1;paint-order:markers stroke fill"
       id="rect4116"
       width="140.0049"
       height="187.02266"
       x="689.1452"
       y="670.03497"
       ry="0" />
    <rect
       style="display:inline;fill:#00ff00;fill-opacity:0.25;stroke:#000000;stroke-width:1.33333;stroke-linecap:square;stroke-linejoin:miter;stroke-miterlimit:4;stroke-dasharray:1.33333, 5.33333;stroke-dashoffset:0;stroke-opacity:1;paint-order:markers stroke fill"
       id="rect4102"
       width="75.47673"
       height="187.02266"
       x="613.66846"
       y="670.03497" />
    <flowRoot
       xml:space="preserve"
       id="flowRoot5308"
       style="font-style:normal;font-weight:normal;line-height:0.01%;font-family:sans-serif;letter-spacing:0px;word-spacing:0px;fill:#000000;fill-opacity:1;stroke:none;stroke-width:1px;stroke-linecap:butt;stroke-linejoin:miter;stroke-opacity:1"><flowRegion
         id="flowRegion5310"><rect
           id="rect5312"
           width="59.598999"
           height="76.771591"
           x="115.15739"
           y="320.19794" /></flowRegion><flowPara
         id="flowPara5314"
         style="font-size:20px;line-height:1.25"> </flowPara></flowRoot>    <rect
       style="fill:#8c8c8c;fill-opacity:1;stroke:none;stroke-width:0.0465582;stroke-linecap:square;stroke-linejoin:miter;stroke-miterlimit:4;stroke-dasharray:none;stroke-opacity:1;paint-order:markers stroke fill"
       id="rect1346"
       width="56.12545"
       height="23.47024"
       x="501.12341"
       y="743.40002" />
    <circle
       style="fill:none;stroke:#000000;stroke-width:4.0209;stroke-miterlimit:4;stroke-dasharray:none;stroke-opacity:1"
       id="circle4242"
       transform="rotate(-61.611624)"
       cx="-528.21924"
       cy="611.1875"
       r="282.93542" />
    <text
       xml:space="preserve"
       style="font-style:normal;font-weight:normal;line-height:0%;font-family:sans-serif;letter-spacing:0px;word-spacing:0px;fill:#000000;fill-opacity:1;stroke:none;stroke-width:1px;stroke-linecap:butt;stroke-linejoin:miter;stroke-opacity:1"
       x="76.62471"
       y="867.62085"
       id="text4506"><tspan
         sodipodi:role="line"
         x="76.62471"
         y="867.62085"
         id="tspan4508"
         style="font-size:20px;line-height:1.25"><tspan
           x="76.62471"
           y="867.62085"
           id="tspan4510">HFS</tspan></tspan></text>
    <text
       xml:space="preserve"
       style="font-style:normal;font-weight:normal;line-height:0%;font-family:sans-serif;letter-spacing:0px;word-spacing:0px;display:inline;fill:#000000;fill-opacity:1;stroke:none;stroke-width:2;stroke-linecap:butt;stroke-linejoin:miter;stroke-miterlimit:4;stroke-dasharray:none;stroke-opacity:1"
       x="458.53101"
       y="857.62085"
       id="text4500"><tspan
         sodipodi:role="line"
         x="458.53101"
         y="857.62085"
         id="tspan4502"
         style="font-size:20px;line-height:1.25"><tspan
           x="458.53101"
           y="857.62085"
           id="tspan4504"
           style="stroke-width:2;stroke-miterlimit:4;stroke-dasharray:none">LFS</tspan></tspan></text>
    <text
       xml:space="preserve"
       style="font-style:normal;font-weight:normal;line-height:0%;font-family:sans-serif;letter-spacing:0px;word-spacing:0px;display:inline;fill:#000000;fill-opacity:1;stroke:none;stroke-width:1px;stroke-linecap:butt;stroke-linejoin:miter;stroke-opacity:1"
       x="640.02631"
       y="140.91803"
       id="text4506-3-6"
       transform="rotate(40.710592)"><tspan
         sodipodi:role="line"
         x="640.02631"
         y="140.91803"
         id="tspan4508-6-2"
         style="font-size:20px;line-height:1.25">plasma radius</tspan></text>
    <path
       style="display:inline;fill:none;stroke:#000000;stroke-width:1.54301;stroke-linecap:butt;stroke-linejoin:miter;stroke-miterlimit:4;stroke-dasharray:none;stroke-opacity:1"
       d="m 790.48617,799.47574 c 7.9825,0 7.9825,0 7.9825,0 v -28.0283 h 7.9829"
       id="path4620"
       inkscape:connector-curvature="0" />
    <line
       x1="631.91278"
       y1="715.33276"
       x2="631.91278"
       y2="724.09888"
       style="display:inline;stroke:#000000;stroke-width:1.75322;stroke-linecap:square"
       id="line2-3" />
    <line
       x1="631.91278"
       y1="724.09888"
       x2="631.91278"
       y2="728.48193"
       style="display:inline;stroke:#000000;stroke-width:1.75322;stroke-linecap:square"
       id="line4-6" />
    <line
       x1="631.91278"
       y1="763.54626"
       x2="631.91278"
       y2="767.92932"
       style="display:inline;stroke:#000000;stroke-width:1.75322;stroke-linecap:square"
       id="line6" />
    <rect
       x="624.89996"
       y="728.48193"
       width="14.025765"
       height="35.064415"
       style="display:inline;fill:#000000;fill-opacity:0;stroke:#000000;stroke-width:1.75322"
       id="rect8" />
    <line
       x1="631.91278"
       y1="715.33276"
       x2="631.91278"
       y2="707.44324"
       style="display:inline;stroke:#000000;stroke-width:1.75322;stroke-linecap:square"
       id="line10" />
    <circle
       cx="631.91278"
       cy="693.41748"
       style="display:inline;fill:#000000;fill-opacity:0;stroke:#000000;stroke-width:1.75322"
       id="ellipse12"
       r="14.025765" />
    <line
       x1="631.91278"
       y1="679.39172"
       x2="631.91278"
       y2="671.5022"
       style="display:inline;stroke:#000000;stroke-width:1.75322;stroke-linecap:square"
       id="line14" />
    <path
       d="m 631.91277,693.41752 m 0,8.7661 v -7.01288 m -3.5065,3.50644 h 7.0129 m -7.0129,-12.27255 h 7.0129"
       style="display:inline;fill:#000000;fill-opacity:0;stroke:#000000;stroke-width:1.75322;stroke-linecap:square"
       id="path16" />
    <line
       x1="631.91278"
       y1="829.29211"
       x2="631.91278"
       y2="836.30493"
       style="display:inline;stroke:#000000;stroke-width:1.75322;stroke-linecap:square"
       id="line18" />
    <line
       x1="624.89996"
       y1="836.30493"
       x2="638.92572"
       y2="836.30493"
       style="display:inline;stroke:#000000;stroke-width:1.75322;stroke-linecap:square"
       id="line20" />
    <line
       x1="627.52972"
       y1="841.5647"
       x2="636.29584"
       y2="841.5647"
       style="display:inline;stroke:#000000;stroke-width:1.75322;stroke-linecap:square"
       id="line22" />
    <line
       x1="630.15961"
       y1="846.82434"
       x2="633.66608"
       y2="846.82434"
       style="display:inline;stroke:#000000;stroke-width:1.75322;stroke-linecap:square"
       id="line24" />
    <line
       x1="884.98065"
       y1="785.46155"
       x2="889.36371"
       y2="785.46155"
       style="display:inline;stroke:#000000;stroke-width:1.75322;stroke-linecap:square"
       id="line28-5" />
    <rect
       x="841.15009"
       y="763.54626"
       width="43.830517"
       height="43.830517"
       style="display:inline;fill:#000000;fill-opacity:0;stroke:#000000;stroke-width:1.75322"
       id="rect30-3" />
    <path
       id="path1514"
       style="display:inline;fill:#000000;fill-opacity:0.25;stroke:#000000;stroke-width:1.33333;stroke-linecap:square;stroke-linejoin:miter;stroke-miterlimit:4;stroke-dasharray:1.33333, 5.33333;stroke-dashoffset:0;stroke-opacity:1;paint-order:markers stroke fill"
       d="m 869.20835,856.4262 a 159.2198,159.2198 0 0 0 0.11524,-0.16602 159.2198,159.2198 0 0 0 0.5957,-0.8789 159.2198,159.2198 0 0 0 0.58984,-0.88086 159.2198,159.2198 0 0 0 0.58399,-0.88672 159.2198,159.2198 0 0 0 0.57812,-0.88867 159.2198,159.2198 0 0 0 0.57227,-0.89453 159.2198,159.2198 0 0 0 0.56641,-0.89649 159.2198,159.2198 0 0 0 0.56054,-0.90039 159.2198,159.2198 0 0 0 0.55469,-0.90625 159.2198,159.2198 0 0 0 0.54883,-0.9082 159.2198,159.2198 0 0 0 0.54101,-0.91211 159.2198,159.2198 0 0 0 0.53711,-0.91406 159.2198,159.2198 0 0 0 0.5293,-0.91993 159.2198,159.2198 0 0 0 0.52539,-0.92187 159.2198,159.2198 0 0 0 0.51758,-0.92774 159.2198,159.2198 0 0 0 0.51172,-0.92968 159.2198,159.2198 0 0 0 0.5039,-0.93164 159.2198,159.2198 0 0 0 0.5,-0.9375 159.2198,159.2198 0 0 0 0.49219,-0.93946 159.2198,159.2198 0 0 0 0.48828,-0.9414 159.2198,159.2198 0 0 0 0.48047,-0.94727 159.2198,159.2198 0 0 0 0.47266,-0.94922 159.2198,159.2198 0 0 0 0.46875,-0.95312 159.2198,159.2198 0 0 0 0.46094,-0.95508 159.2198,159.2198 0 0 0 0.45507,-0.95899 159.2198,159.2198 0 0 0 0.44922,-0.96093 159.2198,159.2198 0 0 0 0.44141,-0.96485 159.2198,159.2198 0 0 0 0.43554,-0.96679 159.2198,159.2198 0 0 0 0.42969,-0.97071 159.2198,159.2198 0 0 0 0.42188,-0.97265 159.2198,159.2198 0 0 0 0.41601,-0.97657 159.2198,159.2198 0 0 0 0.41016,-0.97851 159.2198,159.2198 0 0 0 0.4043,-0.98047 159.2198,159.2198 0 0 0 0.39648,-0.98437 159.2198,159.2198 0 0 0 0.39063,-0.98829 159.2198,159.2198 0 0 0 0.38281,-0.98828 159.2198,159.2198 0 0 0 0.37695,-0.99218 159.2198,159.2198 0 0 0 0.37109,-0.99414 159.2198,159.2198 0 0 0 0.36329,-0.9961 159.2198,159.2198 0 0 0 0.35742,-1 159.2198,159.2198 0 0 0 0.34961,-1.00195 159.2198,159.2198 0 0 0 0.34375,-1.00391 159.2198,159.2198 0 0 0 0.33789,-1.00586 159.2198,159.2198 0 0 0 0.33008,-1.00781 159.2198,159.2198 0 0 0 0.32226,-1.00977 159.2198,159.2198 0 0 0 0.31836,-1.01367 159.2198,159.2198 0 0 0 0.3086,-1.01562 159.2198,159.2198 0 0 0 0.30468,-1.01563 159.2198,159.2198 0 0 0 0.29492,-1.01953 159.2198,159.2198 0 0 0 0.29102,-1.01953 159.2198,159.2198 0 0 0 0.2832,-1.02344 159.2198,159.2198 0 0 0 0.27539,-1.02344 159.2198,159.2198 0 0 0 0.26953,-1.02734 159.2198,159.2198 0 0 0 0.26172,-1.02734 159.2198,159.2198 0 0 0 0.25586,-1.03125 159.2198,159.2198 0 0 0 0.24805,-1.03125 159.2198,159.2198 0 0 0 0.24219,-1.03321 159.2198,159.2198 0 0 0 0.15429,-0.68164 v -70.17773 a 159.2198,159.2198 0 0 0 -0.084,-0.375 159.2198,159.2198 0 0 0 -0.24023,-1.0332 159.2198,159.2198 0 0 0 -0.24805,-1.03321 159.2198,159.2198 0 0 0 -0.25195,-1.02929 159.2198,159.2198 0 0 0 -0.26172,-1.0293 159.2198,159.2198 0 0 0 -0.26758,-1.02734 159.2198,159.2198 0 0 0 -0.27344,-1.0254 159.2198,159.2198 0 0 0 -0.28125,-1.02148 159.2198,159.2198 0 0 0 -0.28711,-1.02148 159.2198,159.2198 0 0 0 -0.29492,-1.01954 159.2198,159.2198 0 0 0 -0.30078,-1.01757 159.2198,159.2198 0 0 0 -0.3086,-1.01563 159.2198,159.2198 0 0 0 -0.31445,-1.01367 159.2198,159.2198 0 0 0 -0.32226,-1.01172 159.2198,159.2198 0 0 0 -0.32813,-1.00781 159.2198,159.2198 0 0 0 -0.33398,-1.00781 159.2198,159.2198 0 0 0 -0.3418,-1.00391 159.2198,159.2198 0 0 0 -0.34961,-1.00195 159.2198,159.2198 0 0 0 -0.35547,-1 159.2198,159.2198 0 0 0 -0.36133,-0.99805 159.2198,159.2198 0 0 0 -0.36718,-0.99414 159.2198,159.2198 0 0 0 -0.375,-0.99219 159.2198,159.2198 0 0 0 -0.38282,-0.99023 159.2198,159.2198 0 0 0 -0.38867,-0.98828 159.2198,159.2198 0 0 0 -0.39453,-0.98438 159.2198,159.2198 0 0 0 -0.40039,-0.98242 159.2198,159.2198 0 0 0 -0.4082,-0.98047 159.2198,159.2198 0 0 0 -0.41407,-0.97656 159.2198,159.2198 0 0 0 -0.42187,-0.97266 159.2198,159.2198 0 0 0 -0.42774,-0.97265 159.2198,159.2198 0 0 0 -0.43359,-0.9668 159.2198,159.2198 0 0 0 -0.43945,-0.9668 159.2198,159.2198 0 0 0 -0.44727,-0.96094 159.2198,159.2198 0 0 0 -0.45312,-0.96093 159.2198,159.2198 0 0 0 -0.45899,-0.95508 159.2198,159.2198 0 0 0 -0.46679,-0.95313 159.2198,159.2198 0 0 0 -0.47071,-0.95117 159.2198,159.2198 0 0 0 -0.47851,-0.94726 159.2198,159.2198 0 0 0 -0.48633,-0.94336 159.2198,159.2198 0 0 0 -0.49024,-0.94141 159.2198,159.2198 0 0 0 -0.49804,-0.93555 159.2198,159.2198 0 0 0 -0.50391,-0.93554 159.2198,159.2198 0 0 0 -0.50976,-0.92969 159.2198,159.2198 0 0 0 -0.51563,-0.92774 159.2198,159.2198 0 0 0 -0.52148,-0.92382 159.2198,159.2198 0 0 0 -0.5293,-0.91992 159.2198,159.2198 0 0 0 -0.5332,-0.91602 159.2198,159.2198 0 0 0 -0.54102,-0.91406 159.2198,159.2198 0 0 0 -0.54687,-0.90821 159.2198,159.2198 0 0 0 -0.55274,-0.90625 159.2198,159.2198 0 0 0 -0.55859,-0.90234 159.2198,159.2198 0 0 0 -0.56446,-0.89844 159.2198,159.2198 0 0 0 -0.57031,-0.89453 159.2198,159.2198 0 0 0 -0.57812,-0.89062 159.2198,159.2198 0 0 0 -0.58203,-0.88672 159.2198,159.2198 0 0 0 -0.58789,-0.88281 159.2198,159.2198 0 0 0 -0.59375,-0.87891 159.2198,159.2198 0 0 0 -0.60157,-0.875 159.2198,159.2198 0 0 0 -0.60547,-0.87109 159.2198,159.2198 0 0 0 -0.61132,-0.86719 159.2198,159.2198 0 0 0 -0.61719,-0.86328 159.2198,159.2198 0 0 0 -0.62305,-0.85743 159.2198,159.2198 0 0 0 -0.6289,-0.85546 159.2198,159.2198 0 0 0 -0.63477,-0.84961 159.2198,159.2198 0 0 0 -0.63281,-0.83594 H 833.347 V 856.4262 Z" />
    <line
       x1="772.17047"
       y1="785.46155"
       x2="776.55353"
       y2="785.46155"
       style="display:inline;stroke:#000000;stroke-width:1.75322;stroke-linecap:square"
       id="line50-5" />
    <rect
       x="776.55353"
       y="763.54626"
       width="43.830517"
       height="43.830517"
       style="display:inline;fill:#000000;fill-opacity:0;stroke:#000000;stroke-width:1.75322"
       id="rect54" />
    <line
       x1="631.91278"
       y1="767.92932"
       x2="631.91278"
       y2="785.46155"
       style="display:inline;stroke:#000000;stroke-width:1.75322;stroke-linecap:square"
       id="line74-6" />
    <line
       x1="754.63824"
       y1="785.46155"
       x2="772.17047"
       y2="785.46155"
       style="display:inline;stroke:#000000;stroke-width:1.75322;stroke-linecap:square"
       id="line76-0" />
    <line
       x1="702.04169"
       y1="785.46155"
       x2="716.06744"
       y2="785.46155"
       style="display:inline;stroke:#000000;stroke-width:1.75322;stroke-linecap:square"
       id="line78-6" />
    <path
       d="m 716.06737,785.4616 v -15.77898 l 24.5451,15.77898 -24.5451,15.77899 V 785.4616"
       style="display:inline;fill:#000000;fill-opacity:0;stroke:#000000;stroke-width:1.75322;stroke-linecap:square"
       id="path80" />
    <line
       x1="740.61249"
       y1="785.46155"
       x2="754.63824"
       y2="785.46155"
       style="display:inline;stroke:#000000;stroke-width:1.75322;stroke-linecap:square"
       id="line82-2" />
    <line
       x1="754.63824"
       y1="732.86499"
       x2="754.63824"
       y2="785.46155"
       style="display:inline;stroke:#000000;stroke-width:1.75322;stroke-linecap:square"
       id="line84" />
    <line
       x1="631.91278"
       y1="785.46155"
       x2="631.91278"
       y2="794.22766"
       style="display:inline;stroke:#000000;stroke-width:1.75322;stroke-linecap:square"
       id="line86" />
    <line
       x1="702.04169"
       y1="732.86499"
       x2="702.04169"
       y2="785.46155"
       style="display:inline;stroke:#000000;stroke-width:1.75322;stroke-linecap:square"
       id="line88" />
    <line
       x1="702.04169"
       y1="732.86499"
       x2="724.83356"
       y2="732.86499"
       style="display:inline;stroke:#000000;stroke-width:1.75322;stroke-linecap:square"
       id="line90" />
    <line
       x1="731.84637"
       y1="732.86499"
       x2="754.63824"
       y2="732.86499"
       style="display:inline;stroke:#000000;stroke-width:1.75322;stroke-linecap:square"
       id="line92" />
    <line
       x1="724.83356"
       y1="720.59241"
       x2="724.83356"
       y2="745.13745"
       style="display:inline;stroke:#000000;stroke-width:1.75322;stroke-linecap:square"
       id="line94" />
    <line
       x1="731.84637"
       y1="720.59241"
       x2="731.84637"
       y2="745.13745"
       style="display:inline;stroke:#000000;stroke-width:1.75322;stroke-linecap:square"
       id="line96" />
    <line
       x1="631.91278"
       y1="785.46155"
       x2="663.47076"
       y2="785.46155"
       style="display:inline;stroke:#000000;stroke-width:1.75322;stroke-linecap:square"
       id="line98" />
    <line
       x1="670.4837"
       y1="785.46155"
       x2="702.04169"
       y2="785.46155"
       style="display:inline;stroke:#000000;stroke-width:1.75322;stroke-linecap:square"
       id="line100" />
    <line
       x1="663.47076"
       y1="773.18909"
       x2="663.47076"
       y2="797.73413"
       style="display:inline;stroke:#000000;stroke-width:1.75322;stroke-linecap:square"
       id="line102" />
    <line
       x1="670.4837"
       y1="773.18909"
       x2="670.4837"
       y2="797.73413"
       style="display:inline;stroke:#000000;stroke-width:1.75322;stroke-linecap:square"
       id="line104" />
    <line
       x1="631.91278"
       y1="829.29211"
       x2="631.91278"
       y2="785.46155"
       style="display:inline;stroke:#000000;stroke-width:1.75322;stroke-linecap:square"
       id="line106" />
    <path
       d="m 631.91277,801.24059 m -7.0129,0 h 14.0258 m -7.0129,0 7.0129,13.14916 h -14.0258 l 7.0129,-13.14916"
       style="display:inline;fill:#000000;fill-opacity:0;stroke:#000000;stroke-width:1.75322;stroke-linecap:square"
       id="path108" />
    <circle
       cx="631.91278"
       cy="785.46155"
       style="display:inline;fill:#000000;fill-opacity:1;stroke:#000000;stroke-width:1.75322"
       id="ellipse110"
       r="1.7532207" />
    <circle
       cx="754.63824"
       cy="785.46155"
       style="display:inline;fill:#000000;fill-opacity:1;stroke:#000000;stroke-width:1.75322"
       id="ellipse112"
       r="1.7532207" />
    <circle
       cx="702.04169"
       cy="785.46155"
       style="display:inline;fill:#000000;fill-opacity:1;stroke:#000000;stroke-width:1.75322"
       id="ellipse114"
       r="1.7532207" />
    <text
       xml:space="preserve"
       style="font-style:normal;font-weight:normal;font-size:9.9652px;line-height:1.25;font-family:sans-serif;letter-spacing:0px;word-spacing:0px;fill:#000000;fill-opacity:1;stroke:none;stroke-width:0.24913"
       x="721.78888"
       y="788.5531"
       id="text4100"><tspan
         sodipodi:role="line"
         id="tspan4098"
         x="721.78888"
         y="788.5531"
         style="stroke-width:0.24913">a</tspan></text>
    <path
       style="display:inline;fill:none;stroke:#000000;stroke-width:1.7;stroke-linecap:butt;stroke-linejoin:miter;stroke-miterlimit:4;stroke-dasharray:none;stroke-opacity:1"
       d="m 820.38409,785.46155 c 20.766,0 20.766,0 20.766,0"
       id="path5574" />
    <rect
       style="fill:#ffffff;fill-opacity:1;stroke:#000000;stroke-width:0.249258;stroke-linecap:square;stroke-linejoin:miter;stroke-miterlimit:4;stroke-dasharray:none;stroke-opacity:1;paint-order:markers stroke fill"
       id="rect1196"
       width="42.978527"
       height="0.59693748"
       x="501.24805"
       y="745.58319" />
    <rect
       style="fill:#ff00fc;fill-opacity:1;stroke-width:0.249258;stroke-linecap:square;stroke-linejoin:miter;stroke-miterlimit:4;stroke-dasharray:none;paint-order:markers stroke fill"
       id="rect1218"
       width="42.978527"
       height="0.59693748"
       x="501.24805"
       y="546.28314" />
    <rect
       style="fill:#ffffff;fill-opacity:1;stroke:#000000;stroke-width:0.249258;stroke-linecap:square;stroke-linejoin:miter;stroke-miterlimit:4;stroke-dasharray:none;stroke-opacity:1;paint-order:markers stroke fill"
       id="rect1222"
       width="42.978527"
       height="0.59693748"
       x="501.24805"
       y="746.18018" />
    <rect
       style="fill:#ffffff;fill-opacity:1;stroke:#000000;stroke-width:0.249258;stroke-linecap:square;stroke-linejoin:miter;stroke-miterlimit:4;stroke-dasharray:none;stroke-opacity:1;paint-order:markers stroke fill"
       id="rect1224"
       width="42.978527"
       height="0.59693748"
       x="501.24805"
       y="746.77716" />
    <rect
       style="fill:#ffffff;fill-opacity:1;stroke:#000000;stroke-width:0.249258;stroke-linecap:square;stroke-linejoin:miter;stroke-miterlimit:4;stroke-dasharray:none;stroke-opacity:1;paint-order:markers stroke fill"
       id="rect1226"
       width="42.978527"
       height="0.59693748"
       x="501.24805"
       y="747.37415" />
    <rect
       style="fill:#ffffff;fill-opacity:1;stroke:#000000;stroke-width:0.2492;stroke-linecap:square;stroke-linejoin:miter;stroke-miterlimit:4;stroke-dasharray:none;stroke-opacity:1;paint-order:markers stroke fill"
       id="rect1228"
       width="42.968597"
       height="0.59679961"
       x="501.24802"
       y="747.97113" />
    <rect
       style="fill:#ffffff;fill-opacity:1;stroke:#000000;stroke-width:0.249258;stroke-linecap:square;stroke-linejoin:miter;stroke-miterlimit:4;stroke-dasharray:none;stroke-opacity:1;paint-order:markers stroke fill"
       id="rect1230"
       width="42.978527"
       height="0.59693748"
       x="501.24805"
       y="748.56818" />
    <rect
       style="fill:#ffffff;fill-opacity:1;stroke:#000000;stroke-width:0.249258;stroke-linecap:square;stroke-linejoin:miter;stroke-miterlimit:4;stroke-dasharray:none;stroke-opacity:1;paint-order:markers stroke fill"
       id="rect1232"
       width="42.978527"
       height="0.59693748"
       x="501.24805"
       y="749.16516" />
    <rect
       style="fill:#ffffff;fill-opacity:1;stroke:#000000;stroke-width:0.249258;stroke-linecap:square;stroke-linejoin:miter;stroke-miterlimit:4;stroke-dasharray:none;stroke-opacity:1;paint-order:markers stroke fill"
       id="rect1234"
       width="42.978527"
       height="0.59693748"
       x="501.24805"
       y="749.76215" />
    <rect
       style="fill:#ffffff;fill-opacity:1;stroke:#000000;stroke-width:0.249258;stroke-linecap:square;stroke-linejoin:miter;stroke-miterlimit:4;stroke-dasharray:none;stroke-opacity:1;paint-order:markers stroke fill"
       id="rect1236"
       width="42.978527"
       height="0.59693748"
       x="501.24805"
       y="750.35913" />
    <rect
       style="fill:#ffffff;fill-opacity:1;stroke:#000000;stroke-width:0.249258;stroke-linecap:square;stroke-linejoin:miter;stroke-miterlimit:4;stroke-dasharray:none;stroke-opacity:1;paint-order:markers stroke fill"
       id="rect1238"
       width="42.978527"
       height="0.59693748"
       x="501.24805"
       y="750.95618" />
    <rect
       style="fill:#ffffff;fill-opacity:1;stroke:#000000;stroke-width:0.249258;stroke-linecap:square;stroke-linejoin:miter;stroke-miterlimit:4;stroke-dasharray:none;stroke-opacity:1;paint-order:markers stroke fill"
       id="rect1240"
       width="42.978527"
       height="0.59693748"
       x="501.24805"
       y="751.55316" />
    <rect
       style="fill:#ffffff;fill-opacity:1;stroke:#000000;stroke-width:0.249258;stroke-linecap:square;stroke-linejoin:miter;stroke-miterlimit:4;stroke-dasharray:none;stroke-opacity:1;paint-order:markers stroke fill"
       id="rect1242"
       width="42.978527"
       height="0.59693748"
       x="501.24805"
       y="752.15015" />
    <rect
       style="fill:#ffffff;fill-opacity:1;stroke:#000000;stroke-width:0.249258;stroke-linecap:square;stroke-linejoin:miter;stroke-miterlimit:4;stroke-dasharray:none;stroke-opacity:1;paint-order:markers stroke fill"
       id="rect1244"
       width="42.978527"
       height="0.59693748"
       x="501.24805"
       y="752.15015" />
    <rect
       style="fill:#ffffff;fill-opacity:1;stroke:#000000;stroke-width:0.249258;stroke-linecap:square;stroke-linejoin:miter;stroke-miterlimit:4;stroke-dasharray:none;stroke-opacity:1;paint-order:markers stroke fill"
       id="rect1246"
       width="42.978527"
       height="0.59693748"
       x="501.24805"
       y="752.74713" />
    <rect
       style="fill:#ffffff;fill-opacity:1;stroke:#000000;stroke-width:0.249258;stroke-linecap:square;stroke-linejoin:miter;stroke-miterlimit:4;stroke-dasharray:none;stroke-opacity:1;paint-order:markers stroke fill"
       id="rect1248"
       width="42.978527"
       height="0.59693748"
       x="501.24805"
       y="753.34418" />
    <rect
       style="fill:#ffffff;fill-opacity:1;stroke:#000000;stroke-width:0.249258;stroke-linecap:square;stroke-linejoin:miter;stroke-miterlimit:4;stroke-dasharray:none;stroke-opacity:1;paint-order:markers stroke fill"
       id="rect1250"
       width="42.978527"
       height="0.59693748"
       x="501.24805"
       y="753.94116" />
    <rect
       style="fill:#ffffff;fill-opacity:1;stroke:#000000;stroke-width:0.249258;stroke-linecap:square;stroke-linejoin:miter;stroke-miterlimit:4;stroke-dasharray:none;stroke-opacity:1;paint-order:markers stroke fill"
       id="rect1252"
       width="42.978527"
       height="0.59693748"
       x="501.24805"
       y="754.53815" />
    <rect
       style="fill:#ffffff;fill-opacity:1;stroke:#000000;stroke-width:0.249258;stroke-linecap:square;stroke-linejoin:miter;stroke-miterlimit:4;stroke-dasharray:none;stroke-opacity:1;paint-order:markers stroke fill"
       id="rect1254"
       width="42.978527"
       height="0.59693748"
       x="501.24805"
       y="755.13513" />
    <rect
       style="fill:#ffffff;fill-opacity:1;stroke:#000000;stroke-width:0.249258;stroke-linecap:square;stroke-linejoin:miter;stroke-miterlimit:4;stroke-dasharray:none;stroke-opacity:1;paint-order:markers stroke fill"
       id="rect1256"
       width="42.978527"
       height="0.59693748"
       x="501.24805"
       y="755.73218" />
    <rect
       style="fill:#ffffff;fill-opacity:1;stroke:#000000;stroke-width:0.249258;stroke-linecap:square;stroke-linejoin:miter;stroke-miterlimit:4;stroke-dasharray:none;stroke-opacity:1;paint-order:markers stroke fill"
       id="rect1258"
       width="42.978527"
       height="0.59693748"
       x="501.24805"
       y="756.32916" />
    <rect
       style="fill:#ffffff;fill-opacity:1;stroke:#000000;stroke-width:0.249258;stroke-linecap:square;stroke-linejoin:miter;stroke-miterlimit:4;stroke-dasharray:none;stroke-opacity:1;paint-order:markers stroke fill"
       id="rect1260"
       width="42.978527"
       height="0.59693748"
       x="501.24805"
       y="756.92615" />
    <rect
       style="fill:#ffffff;fill-opacity:1;stroke:#000000;stroke-width:0.249258;stroke-linecap:square;stroke-linejoin:miter;stroke-miterlimit:4;stroke-dasharray:none;stroke-opacity:1;paint-order:markers stroke fill"
       id="rect1262"
       width="42.978527"
       height="0.59693748"
       x="501.24805"
       y="758.12018" />
    <rect
       style="fill:#ffffff;fill-opacity:1;stroke:#000000;stroke-width:0.249258;stroke-linecap:square;stroke-linejoin:miter;stroke-miterlimit:4;stroke-dasharray:none;stroke-opacity:1;paint-order:markers stroke fill"
       id="rect1264"
       width="42.978527"
       height="0.59693748"
       x="501.24805"
       y="757.52313" />
    <rect
       style="fill:#ffffff;fill-opacity:1;stroke:#000000;stroke-width:0.249258;stroke-linecap:square;stroke-linejoin:miter;stroke-miterlimit:4;stroke-dasharray:none;stroke-opacity:1;paint-order:markers stroke fill"
       id="rect1266"
       width="42.978527"
       height="0.59693748"
       x="501.24805"
       y="758.71716" />
    <rect
       style="fill:#ffffff;fill-opacity:1;stroke:#000000;stroke-width:0.249258;stroke-linecap:square;stroke-linejoin:miter;stroke-miterlimit:4;stroke-dasharray:none;stroke-opacity:1;paint-order:markers stroke fill"
       id="rect1268"
       width="42.978527"
       height="0.59693748"
       x="501.24805"
       y="759.91113" />
    <rect
       style="fill:#ffffff;fill-opacity:1;stroke:#000000;stroke-width:0.249258;stroke-linecap:square;stroke-linejoin:miter;stroke-miterlimit:4;stroke-dasharray:none;stroke-opacity:1;paint-order:markers stroke fill"
       id="rect1270"
       width="42.978527"
       height="0.59693748"
       x="501.24805"
       y="759.31415" />
    <rect
       style="fill:#ffffff;fill-opacity:1;stroke:#000000;stroke-width:0.249258;stroke-linecap:square;stroke-linejoin:miter;stroke-miterlimit:4;stroke-dasharray:none;stroke-opacity:1;paint-order:markers stroke fill"
       id="rect1272"
       width="42.978527"
       height="0.59693748"
       x="501.24805"
       y="760.50818" />
    <rect
       style="fill:#ffffff;fill-opacity:1;stroke:#000000;stroke-width:0.249258;stroke-linecap:square;stroke-linejoin:miter;stroke-miterlimit:4;stroke-dasharray:none;stroke-opacity:1;paint-order:markers stroke fill"
       id="rect1274"
       width="42.978527"
       height="0.59693748"
       x="501.24805"
       y="762.29913" />
    <rect
       style="fill:#ffffff;fill-opacity:1;stroke:#000000;stroke-width:0.249258;stroke-linecap:square;stroke-linejoin:miter;stroke-miterlimit:4;stroke-dasharray:none;stroke-opacity:1;paint-order:markers stroke fill"
       id="rect1276"
       width="42.978527"
       height="0.59693748"
       x="501.24805"
       y="761.10516" />
    <rect
       style="fill:#ffffff;fill-opacity:1;stroke:#000000;stroke-width:0.249258;stroke-linecap:square;stroke-linejoin:miter;stroke-miterlimit:4;stroke-dasharray:none;stroke-opacity:1;paint-order:markers stroke fill"
       id="rect1278"
       width="42.978527"
       height="0.59693748"
       x="501.24805"
       y="761.70215" />
    <rect
       style="fill:#ffffff;fill-opacity:1;stroke:#000000;stroke-width:0.249258;stroke-linecap:square;stroke-linejoin:miter;stroke-miterlimit:4;stroke-dasharray:none;stroke-opacity:1;paint-order:markers stroke fill"
       id="rect1280"
       width="42.978527"
       height="0.59693748"
       x="501.24805"
       y="762.89618" />
    <rect
       style="fill:#ffffff;fill-opacity:1;stroke:#000000;stroke-width:0.249258;stroke-linecap:square;stroke-linejoin:miter;stroke-miterlimit:4;stroke-dasharray:none;stroke-opacity:1;paint-order:markers stroke fill"
       id="rect1282"
       width="42.978527"
       height="0.59693748"
       x="501.24805"
       y="763.49316" />
    <rect
       style="fill:#ffffff;fill-opacity:1;stroke:#000000;stroke-width:0.249258;stroke-linecap:square;stroke-linejoin:miter;stroke-miterlimit:4;stroke-dasharray:none;stroke-opacity:1;paint-order:markers stroke fill"
       id="rect1284"
       width="42.978527"
       height="0.59693748"
       x="501.24805"
       y="764.09015" />
    <rect
       style="fill:#000000;fill-opacity:1;stroke:none;stroke-width:1.11302;stroke-linecap:square;stroke-linejoin:miter;stroke-miterlimit:4;stroke-dasharray:none;stroke-opacity:1;paint-order:markers stroke fill"
       id="rect1286"
       width="4.7750001"
       height="7.6399999"
       x="547.68591"
       y="751.46472" />
    <path
       style="fill:none;stroke:#000000;stroke-width:0.05;stroke-linecap:butt;stroke-linejoin:miter;stroke-miterlimit:4;stroke-dasharray:none;stroke-opacity:1"
       d="m 544.30592,745.81238 3.74125,6.24719"
       id="path1296"
       sodipodi:nodetypes="cc" />
    <path
       style="fill:none;stroke:#000000;stroke-width:0.05;stroke-linecap:butt;stroke-linejoin:miter;stroke-miterlimit:4;stroke-dasharray:none;stroke-opacity:1"
       d="m 544.30592,746.658 3.74125,6.24719"
       id="path1302"
       sodipodi:nodetypes="cc" />
    <path
       style="fill:none;stroke:#000000;stroke-width:0.05;stroke-linecap:butt;stroke-linejoin:miter;stroke-miterlimit:4;stroke-dasharray:none;stroke-opacity:1"
       d="m 544.30592,747.504 3.74125,6.24719"
       id="path1304"
       sodipodi:nodetypes="cc" />
    <path
       style="fill:none;stroke:#000000;stroke-width:0.05;stroke-linecap:butt;stroke-linejoin:miter;stroke-miterlimit:4;stroke-dasharray:none;stroke-opacity:1"
       d="m 544.30592,748.35 3.74125,6.24719"
       id="path1306"
       sodipodi:nodetypes="cc" />
    <path
       style="fill:none;stroke:#000000;stroke-width:0.05;stroke-linecap:butt;stroke-linejoin:miter;stroke-miterlimit:4;stroke-dasharray:none;stroke-opacity:1"
       d="m 544.30592,749.196 3.74125,6.24719"
       id="path1308"
       sodipodi:nodetypes="cc" />
    <path
       style="fill:none;stroke:#000000;stroke-width:0.05;stroke-linecap:butt;stroke-linejoin:miter;stroke-miterlimit:4;stroke-dasharray:none;stroke-opacity:1"
       d="m 544.30592,750.042 3.74125,6.24719"
       id="path1310"
       sodipodi:nodetypes="cc" />
    <path
       style="fill:none;stroke:#000000;stroke-width:0.05;stroke-linecap:butt;stroke-linejoin:miter;stroke-miterlimit:4;stroke-dasharray:none;stroke-opacity:1"
       d="m 544.30592,750.888 3.74125,6.24719"
       id="path1312"
       sodipodi:nodetypes="cc" />
    <path
       style="fill:none;stroke:#000000;stroke-width:0.05;stroke-linecap:butt;stroke-linejoin:miter;stroke-miterlimit:4;stroke-dasharray:none;stroke-opacity:1"
       d="m 544.30592,751.734 3.74125,6.24719"
       id="path1314"
       sodipodi:nodetypes="cc" />
    <path
       style="fill:none;stroke:#000000;stroke-width:0.05;stroke-linecap:butt;stroke-linejoin:miter;stroke-miterlimit:4;stroke-dasharray:none;stroke-opacity:1"
       d="m 544.30592,752.58 3.74125,6.24719"
       id="path1316"
       sodipodi:nodetypes="cc" />
    <path
       style="fill:none;stroke:#000000;stroke-width:0.05;stroke-linecap:butt;stroke-linejoin:miter;stroke-miterlimit:4;stroke-dasharray:none;stroke-opacity:1"
       d="m 544.30592,753.426 4.64973,-1.60245"
       id="path1318"
       sodipodi:nodetypes="cc" />
    <path
       style="fill:none;stroke:#000000;stroke-width:0.05;stroke-linecap:butt;stroke-linejoin:miter;stroke-miterlimit:4;stroke-dasharray:none;stroke-opacity:1"
       d="m 544.30592,754.272 4.64973,-1.60245"
       id="path1320"
       sodipodi:nodetypes="cc" />
    <path
       style="fill:none;stroke:#000000;stroke-width:0.05;stroke-linecap:butt;stroke-linejoin:miter;stroke-miterlimit:4;stroke-dasharray:none;stroke-opacity:1"
       d="m 544.30592,755.118 4.64973,-1.60245"
       id="path1322"
       sodipodi:nodetypes="cc" />
    <path
       style="fill:none;stroke:#000000;stroke-width:0.05;stroke-linecap:butt;stroke-linejoin:miter;stroke-miterlimit:4;stroke-dasharray:none;stroke-opacity:1"
       d="m 544.30592,755.964 4.64973,-1.60245"
       id="path1324"
       sodipodi:nodetypes="cc" />
    <path
       style="fill:none;stroke:#000000;stroke-width:0.05;stroke-linecap:butt;stroke-linejoin:miter;stroke-miterlimit:4;stroke-dasharray:none;stroke-opacity:1"
       d="m 544.30592,757.656 4.64973,-1.60245"
       id="path1326"
       sodipodi:nodetypes="cc" />
    <path
       style="fill:none;stroke:#000000;stroke-width:0.05;stroke-linecap:butt;stroke-linejoin:miter;stroke-miterlimit:4;stroke-dasharray:none;stroke-opacity:1"
       d="m 544.30592,756.81 4.64973,-1.60245"
       id="path1328"
       sodipodi:nodetypes="cc" />
    <path
       style="fill:none;stroke:#000000;stroke-width:0.05;stroke-linecap:butt;stroke-linejoin:miter;stroke-miterlimit:4;stroke-dasharray:none;stroke-opacity:1"
       d="m 544.30592,758.502 4.64973,-1.60245"
       id="path1330"
       sodipodi:nodetypes="cc" />
    <path
       style="fill:none;stroke:#000000;stroke-width:0.05;stroke-linecap:butt;stroke-linejoin:miter;stroke-miterlimit:4;stroke-dasharray:none;stroke-opacity:1"
       d="m 544.30592,759.348 4.64973,-1.60245"
       id="path1332"
       sodipodi:nodetypes="cc" />
    <path
       style="fill:none;stroke:#000000;stroke-width:0.05;stroke-linecap:butt;stroke-linejoin:miter;stroke-miterlimit:4;stroke-dasharray:none;stroke-opacity:1"
       d="m 544.30592,760.194 4.64973,-1.60245"
       id="path1334"
       sodipodi:nodetypes="cc" />
    <path
       style="fill:none;stroke:#000000;stroke-width:0.05;stroke-linecap:butt;stroke-linejoin:miter;stroke-miterlimit:4;stroke-dasharray:none;stroke-opacity:1"
       d="m 544.30592,761.04 5.54376,-7.55365"
       id="path1336"
       sodipodi:nodetypes="cc" />
    <path
       style="fill:none;stroke:#000000;stroke-width:0.05;stroke-linecap:butt;stroke-linejoin:miter;stroke-miterlimit:4;stroke-dasharray:none;stroke-opacity:1"
       d="m 544.30592,761.886 5.54376,-7.55365"
       id="path1338"
       sodipodi:nodetypes="cc" />
    <path
       style="fill:none;stroke:#000000;stroke-width:0.05;stroke-linecap:butt;stroke-linejoin:miter;stroke-miterlimit:4;stroke-dasharray:none;stroke-opacity:1"
       d="m 544.30592,762.732 5.54376,-7.55365"
       id="path1340"
       sodipodi:nodetypes="cc" />
    <path
       style="fill:none;stroke:#000000;stroke-width:0.05;stroke-linecap:butt;stroke-linejoin:miter;stroke-miterlimit:4;stroke-dasharray:none;stroke-opacity:1"
       d="m 544.30592,763.578 5.54376,-7.55365"
       id="path1342"
       sodipodi:nodetypes="cc" />
    <path
       style="fill:none;stroke:#000000;stroke-width:0.05;stroke-linecap:butt;stroke-linejoin:miter;stroke-miterlimit:4;stroke-dasharray:none;stroke-opacity:1"
       d="m 544.30592,764.424 5.54376,-7.55365"
       id="path1344"
       sodipodi:nodetypes="cc" />
    <text
       xml:space="preserve"
       style="font-style:normal;font-weight:normal;font-size:40px;line-height:0.75;font-family:sans-serif;letter-spacing:0px;word-spacing:0px;fill:#000000;fill-opacity:1;stroke:none"
       x="698.50635"
       y="641.42834"
       id="text1526"><tspan
         sodipodi:role="line"
         id="tspan1524"
         x="698.50635"
         y="641.42834"
         style="font-size:12px">32x</tspan></text>
    <text
       xml:space="preserve"
       style="font-style:normal;font-weight:normal;font-size:12px;line-height:1.25;font-family:sans-serif;letter-spacing:0px;word-spacing:0px;fill:#000000;fill-opacity:1;stroke:none"
       x="642.58704"
       y="828.1297"
       id="text1530"><tspan
         sodipodi:role="line"
         id="tspan1528"
         x="642.58704"
         y="828.1297">Sensor</tspan></text>
    <text
       xml:space="preserve"
       style="font-style:normal;font-weight:normal;font-size:12px;line-height:1.25;font-family:sans-serif;letter-spacing:0px;word-spacing:0px;fill:#000000;fill-opacity:1;stroke:none"
       x="716.58704"
       y="828.1297"
       id="text1534"><tspan
         sodipodi:role="line"
         id="tspan1532"
         x="716.58704"
         y="828.1297">PH32 analog</tspan></text>
    <text
       xml:space="preserve"
       style="font-style:normal;font-weight:normal;font-size:12px;line-height:1.25;font-family:sans-serif;letter-spacing:0px;word-spacing:0px;fill:#000000;fill-opacity:1;stroke:none"
       x="836.58704"
       y="828.1297"
       id="text1538"><tspan
         sodipodi:role="line"
         id="tspan1536"
         x="836.58704"
         y="828.1297">digital</tspan></text>
  </g>
  <g
     id="layer2"
     inkscape:label="Layer 2"
     style="display:inline"
     inkscape:groupmode="layer" />
  <circle
     style="opacity:1;fill:none;fill-opacity:1;stroke:#000000;stroke-width:1;stroke-linecap:square;stroke-linejoin:miter;stroke-miterlimit:4;stroke-dasharray:1,2;stroke-dashoffset:0;stroke-opacity:1;paint-order:markers stroke fill"
     id="path1483"
     cx="737.68604"
     cy="314.41003"
     r="159.2198" />
</svg>
