243.3534     
244.5538     
313.4720     
328.7472     
337.7146     
339.0209     
347.0281     
371.2741     
372.7320     
373.9762     
374.9486     
388.2192     
391.1957     
395.43619    
397.32562    
406.9623     
407.2157     
407.5862     
411.9215     
418.9789     
434.9426     
435.1262     
436.6892     
441.4905     
441.6974     
459.0972     
459.6175     
463.88550    
464.18104    
464.91348    
465.08394    
466.16332    
467.62350    
470.5352     
492.4531     
494.2999     
520.6650 
539.2611
615.2566
656.5283     
664.1054     
672.1398     
689.5109     

 
