244.9372
245.0040
249.377
250.8
251.72
283.626
292.145
306.342
307.161
320.966
334.85
335.427
337.540
337.806
338.120
338.552
339.679
340.352
340.966
341.169
341.364
348.983
349.224
356.039
356.333
372.593
372.903
373.685
374.489
588.245   
530.551    

