201.327      
202.696      
204.567      
205.274      
239.044      
239.433      
242.284      
243.883      
245.499      
255.806      
268.753      
269.549      
295.968      
298.378      
301.763      
302.345      
304.302      
304.713      
305.930      
312.171      
313.286      
323.857      
326.098      
326.546      
326.731      
331.230      
334.074      
344.410      
345.512      
369.870      
370.337   
371.508      
374.400      
375.467      
375.721      
375.987      
379.126      
396.159      
559.237      
619.957

 
