{
    "type": "auth",
    "port": 11002,
    "hostname": "auth-master",
  
    "redis": {
      "ip": "redis",
      "port": 6379
    },
  
    "database": {
      "ip": "database",
      "port": 3306,
      "user": "root",
      "password": "topsecret",
  
      "tablePrefix": ""
    }
  }
  