[
  {
    "text": "en",
    "link": "/en/README.html"
  },
  {
    "text": "Home",
    "link": "/en/10-home/index.html",
    "collapsible": true,
    "children": [
      {
        "text": "10-home",
        "link": "/en/10-home/README.html"
      }
    ]
  },
  {
    "text": "Server",
    "link": "/en/20-server/index.html",
    "collapsible": true,
    "children": [
      {
        "text": "20-server",
        "link": "/en/20-server/README.html"
      },
      {
        "text": "Installation",
        "link": "/en/20-server/installation.html"
      },
      {
        "text": "Server - Cash",
        "link": "/en/20-server/10-cash/index.html",
        "collapsible": true,
        "children": [
          {
            "text": "10-cash",
            "link": "/en/20-server/10-cash/README.html"
          },
          {
            "text": "Server - Cash api",
            "link": "/en/20-server/10-cash/api.html"
          },
          {
            "text": "Server - Cash - About",
            "link": "/en/20-server/10-cash/10-about/index.html",
            "collapsible": true,
            "children": [
              {
                "text": "10-about",
                "link": "/en/20-server/10-cash/10-about/README.html"
              },
              {
                "text": "Server - Cash -About - INFO",
                "link": "/en/20-server/10-cash/10-about/info.html"
              }
            ]
          }
        ]
      }
    ]
  },
  {
    "text": "Cash",
    "link": "/en/30-cash/index.html",
    "collapsible": true,
    "children": [
      {
        "text": "30-cash",
        "link": "/en/30-cash/README.html"
      }
    ]
  },
  {
    "text": "About",
    "link": "/en/99-about/index.html",
    "collapsible": true,
    "children": [
      {
        "text": "99-about",
        "link": "/en/99-about/README.html"
      },
      {
        "text": "Changelog",
        "link": "/en/99-about/changelog.html"
      }
    ]
  }
]