<?xml version="1.0" encoding="utf-8"?>
<!-- This URDF was automatically created by SolidWorks to URDF Exporter! Originally created by Stephen Brawner (brawner@gmail.com) 
     Commit Version: 1.5.1-0-g916b5db  Build Version: 1.5.7152.31018
     For more information, please see http://wiki.ros.org/sw_urdf_exporter -->
<robot name="dars" xmlns:xacro="http://www.ros.org/wiki/xacro">

  <xacro:include filename="$(find dars_description)/urdf/sj705_macro.xacro" />
	<xacro:sj705 prefix="right_"/>



</robot>