{
  "page": {
    "id": 57,
    "pid": 46,
    "title": "Grid Elements",
    "type": "Standard",
    "meta": {
      "title": "",
      "subtitle": "",
      "abstract": "On this page you'll find some examples for the usage of a simple grid.",
      "description": "",
      "keywords": "",
      "canonical": ""
    },
    "socialMedia": {
      "ogTitle": "",
      "ogDescription": "",
      "ogImage": [],
      "twitterTitle": "",
      "twitterDescription": "",
      "twitterCard": "summary",
      "twitterImage": []
    },
    "resources": {
      "media": []
    },
    "categories": "",
    "editorial": {
      "author": "",
      "authorEmail": ""
    },
    "navigation": {
      "slug": "/content-elements/grid-elements",
      "navTitle": "",
      "target": "",
      "noSearch": 0
    },
    "breadcrumbs": [
      {
        "title": "Startseite",
        "link": "/de/",
        "target": "",
        "active": 1,
        "current": 0,
        "spacer": 0
      },
      {
        "title": "Content Elements",
        "link": "/de/content-elements",
        "target": "",
        "active": 1,
        "current": 0,
        "spacer": 0
      },
      {
        "title": "Grid Elements",
        "link": "/de/content-elements/grid-elements",
        "target": "",
        "active": 1,
        "current": 1,
        "spacer": 0
      }
    ],
    "cache": {
      "timeout": "",
      "tags": ""
    },
    "appearance": {
      "layout": "layout-0",
      "backendLayout": "default",
      "backendLayoutNextLevel": "",
      "newUntil": 0
    },
    "l10n": {
      "languageId": 0
    },
    "system": {
      "tstamp": 1601029492,
      "crdate": 1599757146,
      "starttime": 0,
      "endtime": 0,
      "feGroup": 0,
      "sorting": 1584
    }
  },
  "content": {
    "colPos0": [
      {
        "id": 145,
        "pid": 57,
        "type": "text",
        "colPos": 0,
        "categories": "",
        "appearance": {
          "layout": "default",
          "frameClass": "default",
          "spaceBefore": "",
          "spaceAfter": ""
        },
        "content": {
          "header": "Description",
          "subheader": "",
          "headerLayout": 100,
          "headerPosition": "",
          "headerLink": "",
          "bodytext": "<p>Note&nbsp;that the defined grid layouts are not being applied on all viewports. On smaller devices the columns are displayed below&nbsp;each other.</p>"
        }
      },
      {
        "id": 128,
        "pid": 57,
        "type": "structured_content",
        "colPos": 0,
        "categories": "",
        "appearance": {
          "layout": "default",
          "frameClass": "default",
          "spaceBefore": "",
          "spaceAfter": ""
        },
        "content": {
          "header": "25% | 25% | 25% | 25%",
          "subheader": "",
          "headerLayout": 0,
          "headerPosition": "",
          "headerLink": "",
          "structure": {
            "layout": "25-25-25-25",
            "rows": [
              {
                "columns": [
                  {
                    "config": {
                      "name": "25%",
                      "colPos": 401
                    },
                    "elements": [
                      {
                        "id": 137,
                        "pid": 57,
                        "type": "text",
                        "colPos": -1,
                        "categories": "",
                        "appearance": {
                          "layout": "default",
                          "frameClass": "default",
                          "spaceBefore": "",
                          "spaceAfter": ""
                        },
                        "content": {
                          "header": "Content column 1",
                          "subheader": "",
                          "headerLayout": 3,
                          "headerPosition": "",
                          "headerLink": "",
                          "bodytext": "<p>Loot salmagundi topsail yawl crow's nest nipper fathom gaff gabion reef. Rutters provost tackle deadlights cog swab weigh anchor gally Pieces of Eight bring a spring upon her cable. Jury mast topsail Corsair haul wind crack Jennys tea cup pirate lugsail bilge water code of conduct cackle fruit.</p>"
                        }
                      }
                    ]
                  },
                  {
                    "config": {
                      "name": "25%",
                      "colPos": 402
                    },
                    "elements": [
                      {
                        "id": 138,
                        "pid": 57,
                        "type": "text",
                        "colPos": -1,
                        "categories": "",
                        "appearance": {
                          "layout": "default",
                          "frameClass": "default",
                          "spaceBefore": "",
                          "spaceAfter": ""
                        },
                        "content": {
                          "header": "Content column 2",
                          "subheader": "",
                          "headerLayout": 3,
                          "headerPosition": "",
                          "headerLink": "",
                          "bodytext": "<p>List marooned fluke yo-ho-ho lateen sail schooner keel poop deck grog blossom Admiral of the Black. Hands carouser draft gunwalls pillage coxswain American Main broadside lee pinnace. Square-rigged fluke rigging jack Sail ho fire ship snow Corsair ye spike.</p>"
                        }
                      }
                    ]
                  },
                  {
                    "config": {
                      "name": "25%",
                      "colPos": 403
                    },
                    "elements": [
                      {
                        "id": 139,
                        "pid": 57,
                        "type": "text",
                        "colPos": -1,
                        "categories": "",
                        "appearance": {
                          "layout": "default",
                          "frameClass": "default",
                          "spaceBefore": "",
                          "spaceAfter": ""
                        },
                        "content": {
                          "header": "Content column 3",
                          "subheader": "",
                          "headerLayout": 3,
                          "headerPosition": "",
                          "headerLink": "",
                          "bodytext": "<p>Doubloon port coxswain spyglass marooned coffer chandler haul wind Sea Legs holystone. Strike colors driver doubloon belay grog long boat holystone hulk coxswain yo-ho-ho. Snow marooned Gold Road pressgang Blimey American Main draught bilge crimp Barbary Coast.</p>"
                        }
                      }
                    ]
                  },
                  {
                    "config": {
                      "name": "25%",
                      "colPos": 404
                    },
                    "elements": [
                      {
                        "id": 140,
                        "pid": 57,
                        "type": "text",
                        "colPos": -1,
                        "categories": "",
                        "appearance": {
                          "layout": "default",
                          "frameClass": "default",
                          "spaceBefore": "",
                          "spaceAfter": ""
                        },
                        "content": {
                          "header": "Content column 4",
                          "subheader": "",
                          "headerLayout": 3,
                          "headerPosition": "",
                          "headerLink": "",
                          "bodytext": "<p>Fore gaff cable overhaul matey Sink me topgallant draft flogging crack Jennys tea cup. Prow swab smartly Gold Road hail-shot lanyard nipper crow's nest spyglass Yellow Jack. Pinnace American Main crack Jennys tea cup no prey, no pay galleon fathom Davy Jones' Locker bring a spring upon her cable lugsail matey.</p>"
                        }
                      }
                    ]
                  }
                ]
              }
            ]
          }
        }
      },
      {
        "id": 130,
        "pid": 57,
        "type": "structured_content",
        "colPos": 0,
        "categories": "",
        "appearance": {
          "layout": "default",
          "frameClass": "default",
          "spaceBefore": "",
          "spaceAfter": ""
        },
        "content": {
          "header": "33,33% | 66,66%",
          "subheader": "",
          "headerLayout": 0,
          "headerPosition": "",
          "headerLink": "",
          "structure": {
            "layout": "33-66",
            "rows": [
              {
                "columns": [
                  {
                    "config": {
                      "name": "33,33%",
                      "colPos": 401,
                      "colspan": 1
                    },
                    "elements": [
                      {
                        "id": 141,
                        "pid": 57,
                        "type": "text",
                        "colPos": -1,
                        "categories": "",
                        "appearance": {
                          "layout": "default",
                          "frameClass": "default",
                          "spaceBefore": "",
                          "spaceAfter": ""
                        },
                        "content": {
                          "header": "Content column 1",
                          "subheader": "",
                          "headerLayout": 3,
                          "headerPosition": "",
                          "headerLink": "",
                          "bodytext": "<p>Squiffy belay sheet case shot Chain Shot lass topgallant deadlights spanker fire in the hole. Ho scuttle port bilge water belay sloop starboard run a shot across the bow heave to Davy Jones' Locker. Topmast hulk gun brig jack fire ship Chain Shot landlubber or just lubber fathom piracy.</p>"
                        }
                      }
                    ]
                  },
                  {
                    "config": {
                      "name": "66,66%",
                      "colPos": 402,
                      "colspan": 2
                    },
                    "elements": [
                      {
                        "id": 142,
                        "pid": 57,
                        "type": "text",
                        "colPos": -1,
                        "categories": "",
                        "appearance": {
                          "layout": "default",
                          "frameClass": "default",
                          "spaceBefore": "",
                          "spaceAfter": ""
                        },
                        "content": {
                          "header": "Content column 2",
                          "subheader": "",
                          "headerLayout": 3,
                          "headerPosition": "",
                          "headerLink": "",
                          "bodytext": "<p>Jolly Roger yardarm chase guns yo-ho-ho loaded to the gunwalls piracy shrouds weigh anchor bounty jib. Stern take a caulk blow the man down brig draught jib barque run a rig sloop poop deck. Trysail pinnace fluke cog six pounders ahoy sheet jury mast Jack Tar red ensign.</p>"
                        }
                      }
                    ]
                  }
                ]
              }
            ]
          }
        }
      },
      {
        "id": 131,
        "pid": 57,
        "type": "structured_content",
        "colPos": 0,
        "categories": "",
        "appearance": {
          "layout": "default",
          "frameClass": "default",
          "spaceBefore": "",
          "spaceAfter": ""
        },
        "content": {
          "header": "50% | 50%",
          "subheader": "",
          "headerLayout": 0,
          "headerPosition": "",
          "headerLink": "",
          "structure": {
            "layout": "50-50",
            "rows": [
              {
                "columns": [
                  {
                    "config": {
                      "name": "50%",
                      "colPos": 401
                    },
                    "elements": [
                      {
                        "id": 143,
                        "pid": 57,
                        "type": "text",
                        "colPos": -1,
                        "categories": "",
                        "appearance": {
                          "layout": "default",
                          "frameClass": "default",
                          "spaceBefore": "",
                          "spaceAfter": ""
                        },
                        "content": {
                          "header": "Content column 1",
                          "subheader": "",
                          "headerLayout": 3,
                          "headerPosition": "",
                          "headerLink": "",
                          "bodytext": "<p>Pink ho poop deck Cat o'nine tails lookout scallywag no prey, no pay reef gally black spot. Scallywag starboard parley come about case shot red ensign hulk yo-ho-ho yawl maroon. Trysail Brethren of the Coast long boat code of conduct marooned rigging jolly boat salmagundi gabion nipperkin.</p>"
                        }
                      }
                    ]
                  },
                  {
                    "config": {
                      "name": "50%",
                      "colPos": 402
                    },
                    "elements": [
                      {
                        "id": 144,
                        "pid": 57,
                        "type": "text",
                        "colPos": -1,
                        "categories": "",
                        "appearance": {
                          "layout": "default",
                          "frameClass": "default",
                          "spaceBefore": "",
                          "spaceAfter": ""
                        },
                        "content": {
                          "header": "Content column 2",
                          "subheader": "",
                          "headerLayout": 3,
                          "headerPosition": "",
                          "headerLink": "",
                          "bodytext": "<p>Fire ship bounty scallywag gally Letter of Marque hempen halter belaying pin draught quarter barque. Salmagundi cog hardtack handsomely gun scuppers ho jack fire in the hole shrouds. Capstan draft snow lad belay reef sails brigantine keel lee Gold Road.</p>"
                        }
                      }
                    ]
                  }
                ]
              }
            ]
          }
        }
      }
    ]
  },
  "languages": [
    {
      "languageId": 0,
      "locale": "de_DE.UTF-8",
      "title": "Deutsch",
      "navigationTitle": "Deutsch",
      "twoLetterIsoCode": "de",
      "hreflang": "de",
      "direction": "ltr",
      "link": "/de/content-elements/grid-elements",
      "active": 1,
      "current": 0,
      "available": 1
    },
    {
      "languageId": 4,
      "locale": "en_US.UTF-8",
      "title": "English",
      "navigationTitle": "English",
      "twoLetterIsoCode": "en",
      "hreflang": "en-US",
      "direction": "ltr",
      "link": "",
      "active": 0,
      "current": 0,
      "available": 0
    },
    {
      "languageId": 3,
      "locale": "fr_FR.UTF-8",
      "title": "Français",
      "navigationTitle": "Français",
      "twoLetterIsoCode": "fr",
      "hreflang": "fr",
      "direction": "ltr",
      "link": "",
      "active": 0,
      "current": 0,
      "available": 0
    },
    {
      "languageId": 2,
      "locale": "nl_NL.UTF-8",
      "title": "Nederlands",
      "navigationTitle": "Nederlands",
      "twoLetterIsoCode": "nl",
      "hreflang": "nl",
      "direction": "ltr",
      "link": "",
      "active": 0,
      "current": 0,
      "available": 0
    }
  ],
  "primaryNavigation": [
    {
      "title": "Startseite",
      "link": "/de/",
      "target": "",
      "active": 1,
      "current": 0,
      "spacer": 0,
      "children": [
        {
          "title": "Content Elements",
          "link": "/de/content-elements",
          "target": "",
          "active": 1,
          "current": 0,
          "spacer": 0,
          "children": [
            {
              "title": "Header",
              "link": "/de/content-elements/header",
              "target": "",
              "active": 0,
              "current": 0,
              "spacer": 0
            },
            {
              "title": "Text",
              "link": "/de/content-elements/text",
              "target": "",
              "active": 0,
              "current": 0,
              "spacer": 0
            },
            {
              "title": "Images",
              "link": "/de/content-elements/images",
              "target": "",
              "active": 0,
              "current": 0,
              "spacer": 0
            },
            {
              "title": "Text & Images and Text & Media",
              "link": "/de/content-elements/text-images-and-text-media",
              "target": "",
              "active": 0,
              "current": 0,
              "spacer": 0
            },
            {
              "title": "Bullet List",
              "link": "/de/content-elements/bullet-list",
              "target": "",
              "active": 0,
              "current": 0,
              "spacer": 0
            },
            {
              "title": "Divider",
              "link": "/de/content-elements/divider",
              "target": "",
              "active": 0,
              "current": 0,
              "spacer": 0
            },
            {
              "title": "Article List",
              "link": "/de/content-elements/article-list",
              "target": "",
              "active": 0,
              "current": 0,
              "spacer": 0
            },
            {
              "title": "Grid Elements",
              "link": "/de/content-elements/grid-elements",
              "target": "",
              "active": 1,
              "current": 1,
              "spacer": 0
            },
            {
              "title": "Content element spacing",
              "link": "/de/content-elements/content-element-spacing",
              "target": "",
              "active": 0,
              "current": 0,
              "spacer": 0
            }
          ]
        }
      ]
    },
    {
      "title": "Grid Elements",
      "link": "/de/content-elements/grid-elements",
      "target": "",
      "active": 1,
      "current": 1,
      "spacer": 0
    }
  ]
}
