{
  "project_info": {
    "project_number": "1082195413121",
    "project_id": "it-start-project",
    "storage_bucket": "it-start-project.appspot.com"
  },
  "client": [
    {
      "client_info": {
        "mobilesdk_app_id": "1:1082195413121:android:d725450cb897e8831ee580",
        "android_client_info": {
          "package_name": "com.example.app"
        }
      },
      "oauth_client": [
        {
          "client_id": "1082195413121-gp2pi9totsgitd0shs6fvp1n75052qrg.apps.googleusercontent.com",
          "client_type": 3
        }
      ],
      "api_key": [
        {
          "current_key": "AIzaSyBIQpwXYLAVt7KB2nU2xWCx_2I2X6mBJe4"
        }
      ],
      "services": {
        "appinvite_service": {
          "other_platform_oauth_client": [
            {
              "client_id": "1082195413121-gp2pi9totsgitd0shs6fvp1n75052qrg.apps.googleusercontent.com",
              "client_type": 3
            },
            {
              "client_id": "1082195413121-44tmh4nlhs0m8negqi5amn5k98p943bf.apps.googleusercontent.com",
              "client_type": 2,
              "ios_info": {
                "bundle_id": "com.example.app"
              }
            }
          ]
        }
      }
    }
  ],
  "configuration_version": "1"
}