@startuml

title "Restaurants integration"

package User {

    class Restaurant {
        name: string
        address: string
    }

    class RestaurantIntegration {
        restaurant: Restaurant
        restaurant_division: Division
        restaurant_code_in_integration: string
        integration: Integration
        name: string
        enabled: bool
    }

    RestaurantIntegration::restaurant --> Restaurant
    RestaurantIntegration::integration --> Integration
    RestaurantIntegration::restaurant_division --> Division

    class Integration {
        name: string
        description: string
        ' Токен для авторизации запросов на интеграцию, генерится по запросу
        integration_token: string
        integration_type: Enum(IIKO, RK, 1C)
    }

    class IncomeCategory {
        name: string
        integration: Integration
        source_id: string
    }

    IncomeCategory::integration --> Integration
}


@enduml