{
    "lift_max": 0.5105282503675699,
    "lift_min": 0.0793680144641683,
    "lift_std": 0.12173591466813949,
    "lift_mean": 0.24048837642836968,
    "precision_at_k_max": 0.6363636363636364,
    "precision_at_k_min": 0.125,
    "precision_at_k_std": 0.13245392917950682,
    "precision_at_k_mean": 0.3444680791032466,
    "recall_at_k_max": 0.036231884057971016,
    "recall_at_k_min": 0.00641025641025641,
    "recall_at_k_std": 0.009839366843044192,
    "recall_at_k_mean": 0.019428300812203255
}