{
  "id": "5fdb83fa28888e6ad37d41fe",
  "created": "2020-12-17T16:14:50.265Z",
  "createdBy": "abhansali",
  "lastUpdated": "2021-03-01T20:28:46.761Z",
  "lastUpdatedBy": "jdollens",
  "name": "ServiceNow Change Request Creation",
  "description": "Create a change request in servicenow",
  "struct": {
    "type": "object",
    "description": "",
    "items": [
      {
        "nodeId": "197b7df2-22ed-441c-bf11-dad9886f69e0",
        "type": "string",
        "title": "Notification Title",
        "description": "",
        "placeholder": "Example: SEDEMO",
        "required": true
      },
      {
        "nodeId": "c2c31a0d-a58b-43c3-8914-102e2bf64b4c",
        "type": "string",
        "title": "Summary",
        "description": "",
        "placeholder": "Example: The change request for sedemo team.",
        "required": true
      },
      {
        "nodeId": "20a32dd6-3f72-4455-818f-50eadb5a5938",
        "type": "string",
        "title": "Wait Task Message",
        "description": "",
        "placeholder": "Example: Wait for CR Approval",
        "required": true
      },
      {
        "nodeId": "3cbd1aae-7f5c-409f-bfdb-e5270732ce83",
        "type": "string",
        "title": "BackoutPlan",
        "description": "",
        "placeholder": "Example: Backout-392",
        "required": true
      },
      {
        "nodeId": "4766c96c-2383-47e7-a6fa-eaf14e74061e",
        "type": "string",
        "title": "Test Plan",
        "description": "",
        "placeholder": "Example: Test-25",
        "required": true
      },
      {
        "nodeId": "bb185cc9-3660-471c-9fe7-5ab9c67b76c0",
        "type": "string",
        "title": "Implementation Plan",
        "description": "",
        "placeholder": "Example: Implement-18",
        "required": true
      }
    ]
  },
  "schema": {
    "title": "ServiceNow Change Request Creation",
    "description": "Create a change request in servicenow",
    "type": "object",
    "required": [
      "notificationTitle",
      "summary",
      "waitTaskMessage",
      "backoutPlan",
      "testPlan",
      "implementationPlan"
    ],
    "properties": {
      "notificationTitle": {
        "type": "string",
        "title": "Notification Title",
        "description": ""
      },
      "summary": {
        "type": "string",
        "title": "Summary",
        "description": ""
      },
      "waitTaskMessage": {
        "type": "string",
        "title": "Wait Task Message",
        "description": ""
      },
      "backoutPlan": {
        "type": "string",
        "title": "BackoutPlan",
        "description": ""
      },
      "testPlan": {
        "type": "string",
        "title": "Test Plan",
        "description": ""
      },
      "implementationPlan": {
        "type": "string",
        "title": "Implementation Plan",
        "description": ""
      }
    }
  },
  "uiSchema": {
    "notificationTitle": {
      "ui:placeholder": "Example: SEDEMO"
    },
    "summary": {
      "ui:placeholder": "Example: The change request for sedemo team."
    },
    "waitTaskMessage": {
      "ui:placeholder": "Example: Wait for CR Approval"
    },
    "backoutPlan": {
      "ui:placeholder": "Example: Backout-392"
    },
    "testPlan": {
      "ui:placeholder": "Example: Test-25"
    },
    "implementationPlan": {
      "ui:placeholder": "Example: Implement-18"
    }
  },
  "bindingSchema": {},
  "validationSchema": {},
  "version": "2020.1"
}