{
  "name": "Webex Teams Notification",
  "tasks": {
    "6007": {
      "name": "createMessage",
      "canvasName": "createMessage",
      "summary": "Create a Message.",
      "description": "Create a Message. Returns Message object. Optionally, specify the message as text or markdown and include an attachment.",
      "location": "Adapter",
      "locationType": "WebexTeams",
      "app": "WebexTeams",
      "type": "automatic",
      "displayName": "WebexTeams",
      "variables": {
        "incoming": {
          "body": "$var.458e.webexPayload",
          "adapter_id": "WebexTeams"
        },
        "outgoing": {
          "result": null
        },
        "error": "$var.job.errorMessage"
      },
      "deprecated": false,
      "matched": [
        {
          "key": "canvasName",
          "highlightString": "<span class='highlight-string'>createMess</span>age"
        }
      ],
      "groups": [],
      "actor": "Pronghorn",
      "x": -0.06294706723891273,
      "y": 0.6151724137931035,
      "scheduled": false
    },
    "workflow_start": {
      "name": "workflow_start",
      "groups": [],
      "x": -0.21811023622047243,
      "y": 0.6176853055916776
    },
    "workflow_end": {
      "name": "workflow_end",
      "groups": [],
      "x": 0.08226037195994278,
      "y": 0.6151724137931035
    },
    "458e": {
      "name": "transformation",
      "canvasName": "transformation",
      "summary": "JSON Transformation",
      "description": "Perform a JSON Transformation using the JST library.",
      "location": "Application",
      "locationType": null,
      "app": "WorkFlowEngine",
      "type": "operation",
      "displayName": "WorkFlowEngine",
      "variables": {
        "incoming": {
          "tr_id": "5fda8419255fc96a1dd6c4d8",
          "variableMap": {
            "formData": "$var.job.formData"
          },
          "options": {
            "extractOutput": true
          }
        },
        "outgoing": {
          "webexPayload": null
        }
      },
      "deprecated": false,
      "matched": [
        {
          "key": "description",
          "highlightString": "Perform a JSON Transformation using the <span class='highlight-string'>JST</span> library."
        }
      ],
      "groups": [],
      "x": -0.15879828326180256,
      "y": 0.6137931034482759
    },
    "9d38": {
      "name": "transformation",
      "canvasName": "transformation",
      "summary": "JSON Transformation",
      "description": "Perform a JSON Transformation using the JST library.",
      "location": "Application",
      "locationType": null,
      "app": "WorkFlowEngine",
      "type": "operation",
      "displayName": "WorkFlowEngine",
      "variables": {
        "incoming": {
          "tr_id": "5ff35e589bc9347a490356a7",
          "variableMap": {
            "status": "success",
            "taskData": "$var.6007.result"
          },
          "options": {
            "extractOutput": true
          }
        },
        "outgoing": {
          "automationStatus": null
        }
      },
      "deprecated": false,
      "matched": [
        {
          "key": "description",
          "highlightString": "Perform a JSON Transformation using the <span class='highlight-string'>JST</span> library."
        }
      ],
      "groups": [],
      "x": 0.013590844062947067,
      "y": 0.7268965517241379
    },
    "cc22": {
      "name": "transformation",
      "canvasName": "transformation",
      "summary": "JSON Transformation",
      "description": "Perform a JSON Transformation using the JST library.",
      "location": "Application",
      "locationType": null,
      "app": "WorkFlowEngine",
      "type": "operation",
      "displayName": "WorkFlowEngine",
      "variables": {
        "incoming": {
          "tr_id": "5ff35e589bc9347a490356a7",
          "variableMap": {
            "status": "error",
            "taskData": "$var.job.errorMessage"
          },
          "options": {
            "extractOutput": true
          }
        },
        "outgoing": {
          "automationStatus": null
        }
      },
      "deprecated": false,
      "matched": [
        {
          "key": "description",
          "highlightString": "Perform a JSON Transformation using the <span class='highlight-string'>JST</span> library."
        }
      ],
      "groups": [],
      "x": 0.012875536480686695,
      "y": 0.5062068965517241
    }
  },
  "transitions": {
    "4971": {},
    "6007": {
      "9d38": {
        "type": "standard",
        "state": "success"
      },
      "cc22": {
        "type": "standard",
        "state": "error"
      }
    },
    "workflow_start": {
      "458e": {
        "type": "standard",
        "state": "success"
      }
    },
    "workflow_end": {},
    "d30a": {},
    "458e": {
      "6007": {
        "type": "standard",
        "state": "success"
      }
    },
    "9d38": {
      "workflow_end": {
        "type": "standard",
        "state": "success"
      }
    },
    "cc22": {
      "workflow_end": {
        "type": "standard",
        "state": "success"
      }
    }
  },
  "font_size": 12,
  "created": "2020-12-16T22:01:47.580Z",
  "created_by": {
    "provenance": "LDAP Server",
    "username": "abhansali",
    "firstname": "Ankit",
    "inactive": false
  },
  "createdVersion": "5.10.4-2020.1.22.0",
  "groups": [],
  "last_updated": "2021-02-27T19:45:57.370Z",
  "last_updated_by": {
    "provenance": "LDAP Server",
    "username": "jdollens",
    "firstname": "Jerry",
    "inactive": false
  },
  "lastUpdatedVersion": "5.10.4-2020.1.22.0",
  "type": "automation",
  "description": null,
  "tags": []
}