{
  "id": "5fda268228888e6ad37d41fb",
  "created": "2020-12-16T15:23:46.245Z",
  "createdBy": "abhansali",
  "lastUpdated": "2021-02-27T19:45:39.116Z",
  "lastUpdatedBy": "jdollens",
  "name": "Webex Teams Notification",
  "description": "Sends notification using Cisco Webex Teams.",
  "struct": {
    "type": "object",
    "description": "",
    "items": [
      {
        "nodeId": "1d8a2f0a-fdce-48c1-a234-558f1402a982",
        "type": "string",
        "title": "RoomId",
        "description": "",
        "placeholder": "Enter the room id.",
        "required": true
      },
      {
        "nodeId": "f47c16c0-b4db-4894-894f-f095bdb6320a",
        "type": "string",
        "widget": "textarea",
        "title": "Message",
        "description": "",
        "placeholder": "`Automation Status` IAP Job Link: <http://www.itential.com|IAP-Job-Status> ServiceNOW Link: <http://www.servicenow.com|SNOW-Ticket-Status> Jira Link: <http://www.jira.com|JIRA-Ticket-Status>",
        "required": true
      }
    ]
  },
  "schema": {
    "title": "Webex Teams Notification",
    "description": "Sends notification using Cisco Webex Teams.",
    "type": "object",
    "required": [
      "roomId",
      "message"
    ],
    "properties": {
      "roomId": {
        "type": "string",
        "title": "RoomId",
        "description": ""
      },
      "message": {
        "type": "string",
        "title": "Message",
        "description": ""
      }
    }
  },
  "uiSchema": {
    "roomId": {
      "ui:placeholder": "Enter the room id."
    },
    "message": {
      "ui:placeholder": "`Automation Status` IAP Job Link: <http://www.itential.com|IAP-Job-Status> ServiceNOW Link: <http://www.servicenow.com|SNOW-Ticket-Status> Jira Link: <http://www.jira.com|JIRA-Ticket-Status>",
      "ui:widget": "textarea"
    }
  },
  "bindingSchema": {},
  "validationSchema": {},
  "version": "2020.1"
}