{
  "_id": "6197db2ab46bf0016cb6c136",
  "name": "version-compliance-MakeVersionObject",
  "description": "",
  "incoming": [
    {
      "$id": "getInfoResults",
      "type": "object",
      "properties": {
        "device": {
          "type": "string",
          "examples": [
            "csr01-atl-iag20202"
          ]
        },
        "osVersion": {
          "type": "string",
          "examples": [
            "16%2E03%2E07"
          ]
        },
        "serialNumber": {
          "type": "string",
          "examples": [
            "9A70K67RGGN"
          ]
        },
        "model": {
          "type": "string",
          "examples": [
            "CSR1000V"
          ]
        }
      },
      "required": []
    }
  ],
  "outgoing": [
    {
      "$id": "versionObject",
      "type": "object"
    }
  ],
  "steps": [
    {
      "id": 1,
      "type": "method",
      "library": "Object",
      "method": "setProperty",
      "args": [
        null,
        "device",
        null
      ],
      "view": {
        "row": 1,
        "col": 2
      }
    },
    {
      "id": 3,
      "type": "method",
      "library": "Object",
      "method": "setProperty",
      "args": [
        null,
        "version",
        null
      ],
      "view": {
        "row": 2,
        "col": 2
      }
    },
    {
      "id": 10,
      "type": "declaration",
      "library": "Object",
      "method": "new Object",
      "args": [
        null
      ],
      "view": {
        "row": 1,
        "col": 1
      }
    },
    {
      "id": 13,
      "type": "method",
      "library": "Object",
      "method": "setProperty",
      "args": [
        null,
        "model",
        null
      ],
      "view": {
        "row": 3,
        "col": 2
      }
    },
    {
      "id": 15,
      "type": "assign",
      "from": {
        "location": "incoming",
        "name": "getInfoResults",
        "ptr": "/model"
      },
      "to": {
        "location": "method",
        "name": 13,
        "ptr": "/args/2/value"
      }
    },
    {
      "id": 16,
      "type": "assign",
      "from": {
        "location": "incoming",
        "name": "getInfoResults",
        "ptr": "/osVersion"
      },
      "to": {
        "location": "method",
        "name": 3,
        "ptr": "/args/2/value"
      }
    },
    {
      "id": 17,
      "type": "assign",
      "from": {
        "location": "incoming",
        "name": "getInfoResults",
        "ptr": "/device"
      },
      "to": {
        "location": "method",
        "name": 1,
        "ptr": "/args/2/value"
      }
    },
    {
      "id": 18,
      "type": "assign",
      "from": {
        "location": "method",
        "name": 13,
        "ptr": "/return"
      },
      "to": {
        "location": "method",
        "name": 3,
        "ptr": "/args/0/value"
      }
    },
    {
      "id": 19,
      "type": "assign",
      "from": {
        "location": "method",
        "name": 3,
        "ptr": "/return"
      },
      "to": {
        "location": "method",
        "name": 1,
        "ptr": "/args/0/value"
      }
    },
    {
      "id": 20,
      "type": "assign",
      "from": {
        "location": "method",
        "name": 1,
        "ptr": "/return"
      },
      "to": {
        "location": "outgoing",
        "name": "versionObject",
        "ptr": ""
      }
    },
    {
      "id": 21,
      "type": "assign",
      "from": {
        "location": "declaration",
        "name": 10,
        "ptr": "/return"
      },
      "to": {
        "location": "method",
        "name": 13,
        "ptr": "/args/0/value"
      }
    }
  ],
  "functions": [],
  "comments": [],
  "view": {
    "col": 3,
    "row": 5
  },
  "created": "2021-11-19T17:13:14.418Z",
  "createdBy": {
    "_id": "616dcdbf1834320d53b9ed71",
    "provenance": "Itential-Okta",
    "username": "zach.baskin@itential.com"
  },
  "lastUpdated": "2021-12-01T18:43:21.842Z",
  "lastUpdatedBy": {
    "_id": "616dcdbf1834320d53b9ed71",
    "provenance": "Itential-Okta",
    "username": "zach.baskin@itential.com"
  },
  "version": "3.20.3",
  "tags": []
}