{
  "_id": "617087bda6f24300d453069c",
  "name": "addDeviceName",
  "description": "",
  "incoming": [
    {
      "$id": "list",
      "type": "array",
      "items": {
        "type": "object",
        "properties": {},
        "required": []
      }
    },
    {
      "$id": "deviceName",
      "type": "string",
      "examples": [
        "name"
      ]
    }
  ],
  "outgoing": [
    {
      "$id": "Output",
      "type": "array"
    }
  ],
  "steps": [
    {
      "id": 1,
      "type": "method",
      "library": "Array",
      "method": "map",
      "args": [
        null,
        "ƒ_map_1",
        null
      ],
      "view": {
        "row": 1,
        "col": 1
      }
    },
    {
      "id": 2,
      "type": "assign",
      "from": {
        "location": "incoming",
        "name": "list",
        "ptr": ""
      },
      "to": {
        "location": "method",
        "name": 1,
        "ptr": "/args/0/value"
      }
    },
    {
      "id": 3,
      "type": "assign",
      "from": {
        "location": "incoming",
        "name": "deviceName",
        "ptr": ""
      },
      "to": {
        "location": "method",
        "name": 1,
        "ptr": "/args/2/value"
      }
    },
    {
      "id": 4,
      "type": "assign",
      "from": {
        "location": "method",
        "name": 1,
        "ptr": "/return"
      },
      "to": {
        "location": "outgoing",
        "name": "Output",
        "ptr": ""
      }
    }
  ],
  "functions": [
    {
      "incoming": [
        {
          "type": "object",
          "properties": {},
          "required": [],
          "$id": "currentValue"
        },
        {
          "title": "index",
          "type": "number",
          "optional": true,
          "$id": "index"
        },
        {
          "$id": "array",
          "type": "array",
          "items": {
            "type": "object",
            "properties": {},
            "required": []
          },
          "optional": true
        },
        {
          "$id": "thisArg",
          "type": "object",
          "properties": {
            "0_deviceName": {
              "$id": "deviceName",
              "type": "string",
              "examples": [
                "name"
              ]
            }
          },
          "isContext": true,
          "isThis": true,
          "isIndexed": true
        }
      ],
      "outgoing": [
        {
          "title": "newValue",
          "type": [
            "array",
            "boolean",
            "number",
            "integer",
            "string",
            "object",
            "null"
          ],
          "editable": true,
          "$id": "newValue"
        }
      ],
      "functions": [],
      "name": "ƒ_map_1",
      "steps": [
        {
          "id": 1,
          "type": "method",
          "library": "Object",
          "method": "setProperty",
          "args": [
            null,
            "deviceName",
            null
          ],
          "view": {
            "row": 1,
            "col": 1
          }
        },
        {
          "id": 2,
          "type": "assign",
          "from": {
            "location": "incoming",
            "name": "currentValue",
            "ptr": ""
          },
          "to": {
            "location": "method",
            "name": 1,
            "ptr": "/args/0/value"
          }
        },
        {
          "id": 3,
          "type": "assign",
          "from": {
            "location": "incoming",
            "name": "thisArg",
            "ptr": "/0_deviceName"
          },
          "to": {
            "location": "method",
            "name": 1,
            "ptr": "/args/2/value"
          }
        },
        {
          "id": 4,
          "type": "assign",
          "from": {
            "location": "method",
            "name": 1,
            "ptr": "/return"
          },
          "to": {
            "location": "outgoing",
            "name": "newValue",
            "ptr": ""
          }
        }
      ],
      "view": {
        "col": 5,
        "row": 5
      },
      "id": "ƒ_map_1",
      "comments": []
    }
  ],
  "comments": [],
  "view": {
    "col": 3,
    "row": 5
  },
  "version": "3.17.7-2021.1.5",
  "tags": []
}