{
  "_id": "61a9197f9aa5eb00f04cf85b",
  "command": "",
  "template": "<h3>Version Compliance Report - Version Information</h3>\n<table border=\"1px solid black\" border-collapse=\"collapse\">\n<tr bgcolor=\"#ebebeb\"><th>Model</th><th>Version</th><th>Device</th><th>Compliant?</th><tr>\n{% for model, modelVal in versionObject.items() %}\n    {% if model != \"unreachable\" %}\n        {% for version, versionVal in modelVal.items() %}\n            {% for device in versionVal.get(\"devices\") %}\n                {% if versionVal.get(\"isCompliant\") == true %}\n                    <tr bgcolor=\"#baebbc\">\n                        <td>{{ model }}</td>\n                        <td>{{ version }}</td>\n                        <td>{{ device }}</td>\n                        <td>Yes</td>\n                    </tr>\n                {% else %}\n                    <tr>\n                        <td>{{ model }}</td>\n                        <td>{{ version }}</td>\n                        <td>{{ device }}</td>\n                        <td></td>\n                    </tr>\n                {% endif %}\n            {% endfor %}\n        {% endfor %}\n    {% endif %}\n{% endfor %}\n</table>\n{% if \"unreachable\" in versionObject %}\n&nbsp;\n<table border=\"1px solid black\">\n    <tr bgcolor=\"#ebebeb\"><th>Unreachable Devices</th></tr>\n    {% for device in versionObject.get(\"unreachable\").get(\"unreachable\").get(\"devices\") %}\n        <tr><td>{{ device }}</td></tr>\n    {% endfor %}\n</table>\n{% endif %}",
  "type": "jinja2",
  "name": "Version Compliance",
  "created": "2021-12-13T21:03:13.642Z",
  "lastUpdated": "2021-12-13T21:03:13.642Z",
  "version": 1,
  "data": "{\n  \"versionObject\": {\n    \"CSR1000V\": {\n      \"16.03.07\": {\n        \"devices\": [\n          \"csr01-atl-iag20202\",\n          \"aruba1\"\n        ],\n        \"isCompliant\": true\n      },\n      \"16.06.04\": {\n        \"devices\": [\n          \"csr02-atl-iag20202\"\n        ],\n        \"isCompliant\": false\n      },\n      \"03.10.03.S\": {\n        \"devices\": [\n          \"csr03-atl-iag20202\"\n        ],\n        \"isCompliant\": true\n      }\n    },\n    \"unreachable\": {\n      \"unreachable\": {\n        \"devices\": [\n          \"a10\",\n          \"asa\",\n          \"ZachB-Test-1636403128000\",\n          \"asa-aws-ansible\",\n          \"bigip02-atl-ansible-2019.3\",\n          \"bigip03-atl-ansible-2019.3\",\n          \"cisco-asa-dsup-IAG\",\n          \"DT-Juniper\",\n          \"IOS-XR-1\",\n          \"vsrx01-Juno-Test\",\n          \"vsrx.02-atl-ansible\",\n          \"vsrx01-atl\",\n          \"VzW-ios\",\n          \"VZTEI-IOS-XR-2\"\n        ],\n        \"isCompliant\": false\n      }\n    },\n    \"C9800-CL\": {\n      \"16.12.04a\": {\n        \"devices\": [\n          \"cisco-ios-catalyst-IAG\"\n        ],\n        \"isCompliant\": false\n      }\n    }\n  }\n}",
  "group": "Version Compliance",
  "description": "",
  "tags": [],
  "createdBy": {
    "_id": "616dcdbf1834320d53b9ed71",
    "provenance": "Itential-Okta",
    "username": "zach.baskin@itential.com",
    "firstname": "Zach",
    "inactive": false
  },
  "lastUpdatedBy": {
    "_id": "616dcdbf1834320d53b9ed71",
    "provenance": "Itential-Okta",
    "username": "zach.baskin@itential.com",
    "firstname": "Zach",
    "inactive": false
  }
}