{
  "type": "automation",
  "tasks": {
    "4619": {
      "name": "query",
      "canvasName": "query",
      "summary": "Fetch Host Data",
      "description": "Query data using a dot/bracket notation string and a matching key/value pair.",
      "location": "Application",
      "locationType": null,
      "app": "WorkFlowEngine",
      "type": "operation",
      "displayName": "WorkFlowEngine",
      "variables": {
        "incoming": {
          "pass_on_null": false,
          "query": "loop.result",
          "obj": "$var.4dd7.job_details"
        },
        "outgoing": {
          "return_data": null
        },
        "error": "",
        "decorators": []
      },
      "deprecated": false,
      "matched": [
        {
          "key": "canvasName",
          "highlightString": "<span class='highlight-string'>query</span>"
        },
        {
          "key": "summary",
          "highlightString": "<span class='highlight-string'>Query</span> Data Using 'json-query' Format"
        },
        {
          "key": "description",
          "highlightString": "<span class='highlight-string'>Query</span> data using a dot/bracket notation string and a matching key/value pair."
        }
      ],
      "groups": [],
      "x": 0.9476260401370533,
      "y": 0.43682008368200836,
      "scheduled": false
    },
    "4625": {
      "name": "query",
      "canvasName": "query",
      "summary": "Fetch Device Name",
      "description": "Query data using a dot/bracket notation string and a matching key/value pair.",
      "location": "Application",
      "locationType": null,
      "app": "WorkFlowEngine",
      "type": "operation",
      "displayName": "WorkFlowEngine",
      "variables": {
        "incoming": {
          "pass_on_null": false,
          "query": "selectDevice",
          "obj": "$var.job.inputObject"
        },
        "outgoing": {
          "return_data": null
        },
        "error": "",
        "decorators": []
      },
      "deprecated": false,
      "matched": [
        {
          "key": "canvasName",
          "highlightString": "<span class='highlight-string'>query</span>"
        },
        {
          "key": "summary",
          "highlightString": "<span class='highlight-string'>Query</span> Data Using 'json-query' Format"
        },
        {
          "key": "description",
          "highlightString": "<span class='highlight-string'>Query</span> data using a dot/bracket notation string and a matching key/value pair."
        }
      ],
      "groups": [],
      "x": 0.5036710719530103,
      "y": 0.5573221757322175,
      "scheduled": false
    },
    "workflow_start": {
      "name": "workflow_start",
      "groups": [],
      "x": -0.056779246206558984,
      "y": 0.5138075313807532
    },
    "workflow_end": {
      "name": "workflow_end",
      "groups": [],
      "x": 1.161037689672051,
      "y": 0.5263598326359833
    },
    "f24e": {
      "name": "getDevicesFiltered",
      "canvasName": "getDevicesFiltered",
      "summary": "Find Devices",
      "description": "Gets a specific subset of devices for based on given options",
      "location": "Application",
      "locationType": null,
      "app": "ConfigurationManager",
      "type": "automatic",
      "displayName": "ConfigurationManager",
      "variables": {
        "incoming": {
          "options": "$var.f2f7.output"
        },
        "outgoing": {
          "devices": null
        },
        "error": "",
        "decorators": []
      },
      "deprecated": false,
      "matched": [
        {
          "key": "canvasName",
          "highlightString": "<span class='highlight-string'>getDevicesFi</span>ltered"
        }
      ],
      "groups": [],
      "actor": "Pronghorn",
      "x": 0.3945178658835046,
      "y": 0.5179916317991632,
      "scheduled": false
    },
    "f2f7": {
      "name": "makeData",
      "canvasName": "makeData",
      "summary": "Make Input",
      "description": "This task takes an input and converts it to a different data type. For example, converting a number into a string.",
      "location": "Application",
      "locationType": null,
      "app": "WorkFlowEngine",
      "type": "automatic",
      "displayName": "Tools",
      "variables": {
        "incoming": {
          "input": "{\n    \"start\": 0,\n    \"limit\": 1,\n    \"filter\": {\n        \"name\": \"<!selectDevice!>\"\n    },\n    \"origins\": true,\n    \"order\": \"ascending\",\n    \"adapterType\": [\n     \"<!adapterType!>\"\n    ]\n}",
          "outputType": "json",
          "variables": "$var.9eaf.object"
        },
        "outgoing": {
          "output": null
        },
        "error": "",
        "decorators": []
      },
      "deprecated": false,
      "matched": [
        {
          "key": "canvasName",
          "highlightString": "<span class='highlight-string'>make</span><span class='highlight-string'>Data</span>"
        },
        {
          "key": "summary",
          "highlightString": "Convert input into a different <span class='highlight-string'>data</span> type"
        },
        {
          "key": "description",
          "highlightString": "This task takes an input and converts it to a different <span class='highlight-string'>data</span> type. For example, converting a number into a string."
        }
      ],
      "groups": [],
      "actor": "Pronghorn",
      "x": 0.2687224669603524,
      "y": 0.5179916317991632,
      "scheduled": false
    },
    "9eaf": {
      "name": "setObjectKey",
      "canvasName": "setObjectKey",
      "summary": "Make Input Variables",
      "description": "Set an object key",
      "location": "Application",
      "locationType": null,
      "app": "WorkFlowEngine",
      "type": "automatic",
      "displayName": "Object",
      "variables": {
        "incoming": {
          "obj": "$var.job.inputObject",
          "path": [
            "adapterType"
          ],
          "value": "$var.job.adapterType"
        },
        "outgoing": {
          "object": null
        },
        "error": "",
        "decorators": []
      },
      "deprecated": false,
      "matched": [],
      "groups": [],
      "actor": "Pronghorn",
      "x": 0.13020068526676457,
      "y": 0.5154811715481171,
      "scheduled": false
    },
    "7c8b": {
      "name": "evaluation",
      "canvasName": "evaluation",
      "summary": "Run Evaluation Task",
      "description": "Run an evaluation",
      "location": "Application",
      "locationType": null,
      "app": "WorkFlowEngine",
      "type": "operation",
      "displayName": "WorkFlowEngine",
      "variables": {
        "incoming": {
          "all_true_flag": false,
          "evaluation_groups": [
            {
              "all_true_flag": true,
              "evaluations": [
                {
                  "query": "nso",
                  "operand_1": {
                    "variable": "inputObject",
                    "task": "job"
                  },
                  "operator": "==",
                  "operand_2": {
                    "variable": true,
                    "task": "static"
                  }
                },
                {
                  "query": "",
                  "operand_1": {
                    "variable": "adapterType",
                    "task": "job"
                  },
                  "operator": "==",
                  "operand_2": {
                    "variable": "NSO",
                    "task": "static"
                  }
                }
              ]
            },
            {
              "all_true_flag": true,
              "evaluations": [
                {
                  "query": "iag",
                  "operand_1": {
                    "variable": "inputObject",
                    "task": "job"
                  },
                  "operator": "==",
                  "operand_2": {
                    "variable": true,
                    "task": "static"
                  }
                },
                {
                  "query": "",
                  "operand_1": {
                    "variable": "adapterType",
                    "task": "job"
                  },
                  "operator": "==",
                  "operand_2": {
                    "variable": "AutomationGateway",
                    "task": "static"
                  }
                }
              ]
            }
          ]
        },
        "outgoing": {
          "return_value": null
        }
      },
      "deprecated": false,
      "matched": [
        {
          "key": "canvasName",
          "highlightString": "<span class='highlight-string'>eval</span>uation"
        },
        {
          "key": "summary",
          "highlightString": "Run <span class='highlight-string'>Eval</span>uation Task"
        },
        {
          "key": "description",
          "highlightString": "Run an <span class='highlight-string'>eval</span>uation"
        }
      ],
      "groups": [],
      "x": 0.05286343612334802,
      "y": 0.891213389121339
    },
    "3de7": {
      "name": "query",
      "canvasName": "query",
      "summary": "Fetch List",
      "description": "Query data using a dot/bracket notation string and a matching key/value pair.",
      "location": "Application",
      "locationType": null,
      "app": "WorkFlowEngine",
      "type": "operation",
      "displayName": "WorkFlowEngine",
      "variables": {
        "incoming": {
          "pass_on_null": false,
          "query": "list.origins",
          "obj": "$var.f24e.devices"
        },
        "outgoing": {
          "return_data": null
        },
        "error": "",
        "decorators": []
      },
      "deprecated": false,
      "matched": [
        {
          "key": "canvasName",
          "highlightString": "<span class='highlight-string'>query</span>"
        },
        {
          "key": "summary",
          "highlightString": "<span class='highlight-string'>Query</span> Data Using 'json-query' Format"
        },
        {
          "key": "description",
          "highlightString": "<span class='highlight-string'>Query</span> data using a dot/bracket notation string and a matching key/value pair."
        }
      ],
      "groups": [],
      "x": 0.5066079295154186,
      "y": 0.4786610878661088,
      "scheduled": false
    },
    "99f0": {
      "name": "transformation",
      "canvasName": "transformation",
      "summary": "addDeviceName",
      "description": "Perform a JSON Transformation using the JST library.",
      "location": "Application",
      "locationType": null,
      "app": "WorkFlowEngine",
      "type": "operation",
      "displayName": "WorkFlowEngine",
      "variables": {
        "incoming": {
          "tr_id": "617087bda6f24300d453069c",
          "variableMap": {
            "list": "$var.3de7.return_data",
            "deviceName": "$var.4625.return_data"
          },
          "options": {
            "extractOutput": true,
            "validateIncoming": false,
            "revertToDefaultValue": false
          }
        },
        "outgoing": {
          "Output": null
        }
      },
      "deprecated": false,
      "matched": [
        {
          "key": "description",
          "highlightString": "Perform a JSON Transformation using the <span class='highlight-string'>JST</span> library."
        }
      ],
      "groups": [],
      "x": 0.6279980420949584,
      "y": 0.5221757322175732,
      "task_name": "addDeviceName"
    },
    "7e2b": {
      "name": "evaluation",
      "canvasName": "evaluation",
      "summary": "Run Evaluation Task",
      "description": "Run an evaluation",
      "location": "Application",
      "locationType": null,
      "app": "WorkFlowEngine",
      "type": "operation",
      "displayName": "WorkFlowEngine",
      "variables": {
        "incoming": {
          "all_true_flag": false,
          "evaluation_groups": [
            {
              "all_true_flag": false,
              "evaluations": [
                {
                  "query": "",
                  "operand_1": {
                    "variable": "adapterType",
                    "task": "job"
                  },
                  "operator": "==",
                  "operand_2": {
                    "variable": "NSO",
                    "task": "static"
                  }
                }
              ]
            }
          ]
        },
        "outgoing": {
          "return_value": null
        }
      },
      "deprecated": false,
      "matched": [
        {
          "key": "canvasName",
          "highlightString": "<span class='highlight-string'>eval</span>uation"
        },
        {
          "key": "summary",
          "highlightString": "Run <span class='highlight-string'>Eval</span>uation Task"
        },
        {
          "key": "description",
          "highlightString": "Run an <span class='highlight-string'>eval</span>uation"
        }
      ],
      "groups": [],
      "x": 0.7347038668624571,
      "y": 0.5238493723849372
    },
    "4dd7": {
      "name": "childJob",
      "canvasName": "childJob",
      "summary": "Run Child Job",
      "description": "Runs a child job inside a workflow.",
      "location": "Application",
      "locationType": null,
      "app": "WorkFlowEngine",
      "type": "operation",
      "displayName": "WorkFlowEngine",
      "variables": {
        "incoming": {
          "task": "",
          "workflow": "Find Connected NSOs",
          "variables": {},
          "data_array": "$var.99f0.Output",
          "transformation": "",
          "loopType": "parallel"
        },
        "outgoing": {
          "job_details": null
        }
      },
      "deprecated": false,
      "matched": [
        {
          "key": "canvasName",
          "highlightString": "<span class='highlight-string'>child</span><span class='highlight-string'>Job</span>"
        },
        {
          "key": "summary",
          "highlightString": "Run <span class='highlight-string'>Child</span> <span class='highlight-string'>Job</span>"
        },
        {
          "key": "description",
          "highlightString": "Runs a <span class='highlight-string'>child</span> <span class='highlight-string'>job</span> inside a workflow."
        }
      ],
      "groups": [],
      "actor": "job",
      "x": 0.8379833578071464,
      "y": 0.43347280334728033
    },
    "779c": {
      "name": "childJob",
      "canvasName": "childJob",
      "summary": "Run Child Job",
      "description": "Runs a child job inside a workflow.",
      "location": "Application",
      "locationType": null,
      "app": "WorkFlowEngine",
      "type": "operation",
      "displayName": "WorkFlowEngine",
      "variables": {
        "incoming": {
          "task": "",
          "workflow": "Find Connected IAGs",
          "variables": {},
          "data_array": "$var.99f0.Output",
          "transformation": "",
          "loopType": "sequential"
        },
        "outgoing": {
          "job_details": null
        }
      },
      "deprecated": false,
      "matched": [
        {
          "key": "canvasName",
          "highlightString": "<span class='highlight-string'>child</span><span class='highlight-string'>Job</span>"
        },
        {
          "key": "summary",
          "highlightString": "Run <span class='highlight-string'>Child</span> <span class='highlight-string'>Job</span>"
        },
        {
          "key": "description",
          "highlightString": "Runs a <span class='highlight-string'>child</span> <span class='highlight-string'>job</span> inside a workflow."
        }
      ],
      "groups": [],
      "actor": "job",
      "x": 0.8389623103279491,
      "y": 0.6083682008368201
    },
    "6f3c": {
      "name": "newVariable",
      "canvasName": "newVariable",
      "summary": "Create a Job Variable",
      "description": "Create a new Job variable by Job ID and assign it a value.",
      "location": "Application",
      "locationType": null,
      "app": "WorkFlowEngine",
      "type": "operation",
      "displayName": "WorkFlowEngine",
      "variables": {
        "incoming": {
          "name": "Outcome",
          "value": []
        },
        "outgoing": {
          "value": null
        }
      },
      "deprecated": false,
      "matched": [
        {
          "key": "summary",
          "highlightString": "Create a <span class='highlight-string'>Job</span> <span class='highlight-string'>Variable</span>"
        },
        {
          "key": "description",
          "highlightString": "Create a new <span class='highlight-string'>Job</span> <span class='highlight-string'>variable</span> by Job ID and assign it a value."
        },
        {
          "key": "canvasName",
          "highlightString": "new<span class='highlight-string'>Variable</span>"
        }
      ],
      "groups": [],
      "x": 0.9691629955947136,
      "y": 0.9230125523012552
    },
    "19a": {
      "name": "query",
      "canvasName": "query",
      "summary": "Fetch Host Data",
      "description": "Query data using a dot/bracket notation string and a matching key/value pair.",
      "location": "Application",
      "locationType": null,
      "app": "WorkFlowEngine",
      "type": "operation",
      "displayName": "WorkFlowEngine",
      "variables": {
        "incoming": {
          "pass_on_null": false,
          "query": "loop.result",
          "obj": "$var.779c.job_details"
        },
        "outgoing": {
          "return_data": null
        },
        "error": "",
        "decorators": []
      },
      "deprecated": false,
      "matched": [
        {
          "key": "canvasName",
          "highlightString": "<span class='highlight-string'>query</span>"
        },
        {
          "key": "summary",
          "highlightString": "<span class='highlight-string'>Query</span> Data Using 'json-query' Format"
        },
        {
          "key": "description",
          "highlightString": "<span class='highlight-string'>Query</span> data using a dot/bracket notation string and a matching key/value pair."
        }
      ],
      "groups": [],
      "x": 0.947136563876652,
      "y": 0.6075313807531381,
      "scheduled": false
    },
    "40d": {
      "name": "newVariable",
      "canvasName": "newVariable",
      "summary": "Create a Job Variable",
      "description": "Create a new Job variable by Job ID and assign it a value.",
      "location": "Application",
      "locationType": null,
      "app": "WorkFlowEngine",
      "type": "operation",
      "displayName": "WorkFlowEngine",
      "variables": {
        "incoming": {
          "name": "Outcome",
          "value": "$var.4619.return_data"
        },
        "outgoing": {
          "value": null
        }
      },
      "deprecated": false,
      "matched": [
        {
          "key": "summary",
          "highlightString": "Create a <span class='highlight-string'>Job</span> <span class='highlight-string'>Variable</span>"
        },
        {
          "key": "description",
          "highlightString": "Create a new <span class='highlight-string'>Job</span> <span class='highlight-string'>variable</span> by Job ID and assign it a value."
        },
        {
          "key": "canvasName",
          "highlightString": "new<span class='highlight-string'>Variable</span>"
        }
      ],
      "groups": [],
      "x": 1.0523739598629467,
      "y": 0.43682008368200836
    },
    "d6fe": {
      "name": "newVariable",
      "canvasName": "newVariable",
      "summary": "Create a Job Variable",
      "description": "Create a new Job variable by Job ID and assign it a value.",
      "location": "Application",
      "locationType": null,
      "app": "WorkFlowEngine",
      "type": "operation",
      "displayName": "WorkFlowEngine",
      "variables": {
        "incoming": {
          "name": "Outcome",
          "value": "$var.19a.return_data"
        },
        "outgoing": {
          "value": null
        }
      },
      "deprecated": false,
      "matched": [
        {
          "key": "summary",
          "highlightString": "Create a <span class='highlight-string'>Job</span> <span class='highlight-string'>Variable</span>"
        },
        {
          "key": "description",
          "highlightString": "Create a new <span class='highlight-string'>Job</span> <span class='highlight-string'>variable</span> by Job ID and assign it a value."
        },
        {
          "key": "canvasName",
          "highlightString": "new<span class='highlight-string'>Variable</span>"
        }
      ],
      "groups": [],
      "x": 1.0523739598629467,
      "y": 0.605857740585774
    }
  },
  "transitions": {
    "4619": {
      "40d": {
        "type": "standard",
        "state": "success"
      }
    },
    "4625": {
      "99f0": {
        "type": "standard",
        "state": "success"
      }
    },
    "workflow_start": {
      "7c8b": {
        "type": "standard",
        "state": "success"
      }
    },
    "workflow_end": {},
    "f24e": {
      "4625": {
        "type": "standard",
        "state": "success"
      },
      "3de7": {
        "type": "standard",
        "state": "success"
      },
      "6f3c": {
        "type": "standard",
        "state": "error"
      }
    },
    "f2f7": {
      "f24e": {
        "type": "standard",
        "state": "success"
      }
    },
    "9eaf": {
      "f2f7": {
        "type": "standard",
        "state": "success"
      }
    },
    "7c8b": {
      "9eaf": {
        "type": "standard",
        "state": "success"
      },
      "6f3c": {
        "type": "standard",
        "state": "failure"
      }
    },
    "3de7": {
      "99f0": {
        "type": "standard",
        "state": "success"
      }
    },
    "99f0": {
      "7e2b": {
        "type": "standard",
        "state": "success"
      }
    },
    "7e2b": {
      "4dd7": {
        "type": "standard",
        "state": "success"
      },
      "779c": {
        "type": "standard",
        "state": "failure"
      }
    },
    "4dd7": {
      "4619": {
        "type": "standard",
        "state": "success"
      }
    },
    "779c": {
      "19a": {
        "type": "standard",
        "state": "success"
      }
    },
    "6f3c": {
      "workflow_end": {
        "type": "standard",
        "state": "success"
      }
    },
    "19a": {
      "d6fe": {
        "type": "standard",
        "state": "success"
      }
    },
    "40d": {
      "workflow_end": {
        "type": "standard",
        "state": "success"
      }
    },
    "d6fe": {
      "workflow_end": {
        "type": "standard",
        "state": "success"
      }
    }
  },
  "font_size": 12,
  "name": "Find Connected Hosts",
  "description": "",
  "last_updated": "2021-11-03T19:55:47.899Z",
  "last_updated_by": {
    "provenance": "Itential-Okta",
    "username": "nick.andreano@itential.com",
    "firstname": "Nick",
    "inactive": false
  },
  "lastUpdatedVersion": "5.43.1",
  "inputSchema": {
    "type": "object",
    "properties": {
      "inputObject": {
        "type": "object",
        "examples": [
          {
            "name": "value"
          }
        ]
      },
      "adapterType": {
        "title": "value",
        "type": [
          "string",
          "number",
          "integer",
          "object",
          "array",
          "boolean"
        ],
        "examples": [
          {
            "third": "last"
          }
        ]
      }
    },
    "required": [
      "inputObject",
      "adapterType"
    ]
  },
  "outputSchema": {
    "type": "object",
    "properties": {
      "inputObject": {
        "type": "object",
        "examples": [
          {
            "name": "value"
          }
        ]
      },
      "adapterType": {
        "title": "value",
        "type": [
          "string",
          "number",
          "integer",
          "object",
          "array",
          "boolean"
        ],
        "examples": [
          {
            "third": "last"
          }
        ]
      },
      "_id": {
        "type": "string",
        "pattern": "^[0-9a-f]{24}$"
      },
      "initiator": {
        "type": "string"
      },
      "Outcome": {
        "type": "array"
      }
    }
  },
  "created": "2021-10-20T21:05:10.718Z",
  "created_by": {
    "provenance": "local_aaa",
    "username": "admin@pronghorn",
    "firstname": "admin",
    "inactive": false,
    "email": "rahul.chakraborty@itential.com"
  },
  "createdVersion": "5.40.5-2021.1.28.0",
  "canvasVersion": 1,
  "tags": [],
  "groups": [],
  "migrationVersion": 1
}