{
  "name": "Find Active Host",
  "type": "automation",
  "tasks": {
    "421": {
      "name": "query",
      "canvasName": "query",
      "summary": "Fetch Random Host Type",
      "description": "Query data using a dot/bracket notation string and a matching key/value pair.",
      "location": "Application",
      "locationType": null,
      "app": "WorkFlowEngine",
      "type": "operation",
      "displayName": "WorkFlowEngine",
      "variables": {
        "incoming": {
          "pass_on_null": false,
          "query": "type",
          "obj": "$var.9529.Output"
        },
        "outgoing": {
          "return_data": null
        },
        "error": "",
        "decorators": []
      },
      "deprecated": false,
      "matched": [
        {
          "key": "canvasName",
          "highlightString": "<span class='highlight-string'>query</span>"
        },
        {
          "key": "summary",
          "highlightString": "<span class='highlight-string'>Query</span> Data Using 'json-query' Format"
        },
        {
          "key": "description",
          "highlightString": "<span class='highlight-string'>Query</span> data using a dot/bracket notation string and a matching key/value pair."
        }
      ],
      "groups": [],
      "x": 1.19285364659814,
      "y": 0.5096234309623431,
      "scheduled": false
    },
    "4516": {
      "name": "arrayLength",
      "canvasName": "length",
      "summary": "Gets Len",
      "description": "Returns the number of elements in that array. The value is an unsigned, 32-bit integer  that is always numerically greater than the highest index in the array.",
      "location": "Application",
      "locationType": null,
      "app": "WorkFlowEngine",
      "type": "automatic",
      "displayName": "Array",
      "variables": {
        "incoming": {
          "arr": "$var.8221.combinedArray"
        },
        "outgoing": {
          "length": null
        },
        "error": "",
        "decorators": []
      },
      "deprecated": false,
      "matched": [
        {
          "key": "canvasName",
          "highlightString": "<span class='highlight-string'>length</span>"
        },
        {
          "key": "summary",
          "highlightString": "Gets the <span class='highlight-string'>length</span> of an array."
        }
      ],
      "groups": [],
      "actor": "Pronghorn",
      "x": 0.57856093979442,
      "y": 0.49456066945606697,
      "scheduled": false
    },
    "6088": {
      "name": "newVariable",
      "canvasName": "newVariable",
      "summary": "Create a Job Variable",
      "description": "Create a new Job variable by Job ID and assign it a value.",
      "location": "Application",
      "locationType": null,
      "app": "WorkFlowEngine",
      "type": "operation",
      "displayName": "WorkFlowEngine",
      "variables": {
        "incoming": {
          "name": "Result",
          "value": "$var.beb5.merged_object"
        },
        "outgoing": {
          "value": null
        }
      },
      "deprecated": false,
      "matched": [
        {
          "key": "summary",
          "highlightString": "Create a <span class='highlight-string'>Job</span> <span class='highlight-string'>Variable</span>"
        },
        {
          "key": "description",
          "highlightString": "Create a new <span class='highlight-string'>Job</span> <span class='highlight-string'>variable</span> by Job ID and assign it a value."
        },
        {
          "key": "canvasName",
          "highlightString": "new<span class='highlight-string'>Variable</span>"
        }
      ],
      "groups": [],
      "x": 1.3313754282917278,
      "y": 0.28619246861924685
    },
    "8221": {
      "name": "arrayConcat",
      "canvasName": "concat",
      "summary": "Join Results",
      "description": "Used to merge two arrays",
      "location": "Application",
      "locationType": null,
      "app": "WorkFlowEngine",
      "type": "automatic",
      "displayName": "Array",
      "variables": {
        "incoming": {
          "arr": "$var.ae67.return_data",
          "arrayN": "$var.9b00.return_data"
        },
        "outgoing": {
          "combinedArray": null
        },
        "error": "",
        "decorators": []
      },
      "deprecated": false,
      "matched": [],
      "groups": [],
      "actor": "Pronghorn",
      "x": 0.4723445912873226,
      "y": 0.49372384937238495,
      "scheduled": false
    },
    "8470": {
      "name": "objectHasOwnProperty",
      "canvasName": "objectHasOwnProperty",
      "summary": "Check Error",
      "description": "Returns a boolean indicating whether the object has the specified property as its own property (as opposed to inheriting it).",
      "location": "Application",
      "locationType": null,
      "app": "WorkFlowEngine",
      "type": "automatic",
      "displayName": "Object",
      "variables": {
        "incoming": {
          "obj": "$var.9529.Output",
          "prop": "error"
        },
        "outgoing": {
          "result": null
        },
        "error": "",
        "decorators": []
      },
      "deprecated": false,
      "matched": [],
      "groups": [],
      "actor": "Pronghorn",
      "x": 0.908957415565345,
      "y": 0.497907949790795,
      "scheduled": false
    },
    "9529": {
      "name": "transformation",
      "canvasName": "transformation",
      "summary": "filterConnectedHosts",
      "description": "Perform a JSON Transformation using the JST library.",
      "location": "Application",
      "locationType": null,
      "app": "WorkFlowEngine",
      "type": "operation",
      "displayName": "WorkFlowEngine",
      "variables": {
        "incoming": {
          "tr_id": "617090e5a6f24300d453069d",
          "variableMap": {
            "Input": "$var.8221.combinedArray"
          },
          "options": {
            "extractOutput": true,
            "validateIncoming": false,
            "revertToDefaultValue": false
          }
        },
        "outgoing": {
          "Output": null
        }
      },
      "deprecated": false,
      "matched": [
        {
          "key": "description",
          "highlightString": "Perform a JSON Transformation using the <span class='highlight-string'>JST</span> library."
        }
      ],
      "groups": [],
      "x": 0.7802251590797846,
      "y": 0.49623430962343096,
      "task_name": "filterConnectedHosts"
    },
    "workflow_start": {
      "name": "workflow_start",
      "groups": [],
      "x": 0.08125305922662751,
      "y": 0.5062761506276151
    },
    "workflow_end": {
      "name": "workflow_end",
      "groups": [],
      "x": 1.4718551150269212,
      "y": 0.507112970711297
    },
    "1fd1": {
      "name": "childJob",
      "canvasName": "childJob",
      "summary": "Run Child Job - NSO",
      "description": "Runs a child job inside a workflow.",
      "location": "Application",
      "locationType": null,
      "app": "WorkFlowEngine",
      "type": "operation",
      "displayName": "WorkFlowEngine",
      "variables": {
        "incoming": {
          "task": "",
          "workflow": "Find Connected Hosts",
          "variables": {
            "inputObject": {
              "variable": "",
              "task": "job",
              "editable": true,
              "value": "formData"
            },
            "adapterType": {
              "variable": "",
              "task": "static",
              "value": "NSO"
            }
          },
          "data_array": "",
          "transformation": "",
          "loopType": ""
        },
        "outgoing": {
          "job_details": null
        }
      },
      "deprecated": false,
      "matched": [
        {
          "key": "canvasName",
          "highlightString": "<span class='highlight-string'>child</span><span class='highlight-string'>Job</span>"
        },
        {
          "key": "summary",
          "highlightString": "Run <span class='highlight-string'>Child</span> <span class='highlight-string'>Job</span>"
        },
        {
          "key": "description",
          "highlightString": "Runs a <span class='highlight-string'>child</span> <span class='highlight-string'>job</span> inside a workflow."
        }
      ],
      "groups": [],
      "actor": "job",
      "x": 0.22026431718061673,
      "y": 0.400836820083682
    },
    "fe66": {
      "name": "childJob",
      "canvasName": "childJob",
      "summary": "Run Child Job - IAG",
      "description": "Runs a child job inside a workflow.",
      "location": "Application",
      "locationType": null,
      "app": "WorkFlowEngine",
      "type": "operation",
      "displayName": "WorkFlowEngine",
      "variables": {
        "incoming": {
          "task": "",
          "workflow": "Find Connected Hosts",
          "variables": {
            "inputObject": {
              "variable": "",
              "task": "job",
              "editable": true,
              "value": "formData"
            },
            "adapterType": {
              "variable": "",
              "task": "static",
              "value": "AutomationGateway"
            }
          },
          "data_array": "",
          "transformation": "",
          "loopType": ""
        },
        "outgoing": {
          "job_details": null
        }
      },
      "deprecated": false,
      "matched": [
        {
          "key": "canvasName",
          "highlightString": "<span class='highlight-string'>child</span><span class='highlight-string'>Job</span>"
        },
        {
          "key": "summary",
          "highlightString": "Run <span class='highlight-string'>Child</span> <span class='highlight-string'>Job</span>"
        },
        {
          "key": "description",
          "highlightString": "Runs a <span class='highlight-string'>child</span> <span class='highlight-string'>job</span> inside a workflow."
        }
      ],
      "groups": [],
      "actor": "job",
      "x": 0.22466960352422907,
      "y": 0.5857740585774058
    },
    "ae67": {
      "name": "query",
      "canvasName": "query",
      "summary": "Fetch Outcome NSO",
      "description": "Query data using a dot/bracket notation string and a matching key/value pair.",
      "location": "Application",
      "locationType": null,
      "app": "WorkFlowEngine",
      "type": "operation",
      "displayName": "WorkFlowEngine",
      "variables": {
        "incoming": {
          "pass_on_null": false,
          "query": "Outcome",
          "obj": "$var.1fd1.job_details"
        },
        "outgoing": {
          "return_data": null
        },
        "error": "",
        "decorators": []
      },
      "deprecated": false,
      "matched": [
        {
          "key": "canvasName",
          "highlightString": "<span class='highlight-string'>query</span>"
        },
        {
          "key": "summary",
          "highlightString": "<span class='highlight-string'>Query</span> Data Using 'json-query' Format"
        },
        {
          "key": "description",
          "highlightString": "<span class='highlight-string'>Query</span> data using a dot/bracket notation string and a matching key/value pair."
        }
      ],
      "groups": [],
      "x": 0.3357807146353402,
      "y": 0.40334728033472805,
      "scheduled": false
    },
    "9b00": {
      "name": "query",
      "canvasName": "query",
      "summary": "Fetch Outcome IAG",
      "description": "Query data using a dot/bracket notation string and a matching key/value pair.",
      "location": "Application",
      "locationType": null,
      "app": "WorkFlowEngine",
      "type": "operation",
      "displayName": "WorkFlowEngine",
      "variables": {
        "incoming": {
          "pass_on_null": false,
          "query": "Outcome",
          "obj": "$var.fe66.job_details"
        },
        "outgoing": {
          "return_data": null
        },
        "error": "",
        "decorators": []
      },
      "deprecated": false,
      "matched": [
        {
          "key": "canvasName",
          "highlightString": "<span class='highlight-string'>query</span>"
        },
        {
          "key": "summary",
          "highlightString": "<span class='highlight-string'>Query</span> Data Using 'json-query' Format"
        },
        {
          "key": "description",
          "highlightString": "<span class='highlight-string'>Query</span> data using a dot/bracket notation string and a matching key/value pair."
        }
      ],
      "groups": [],
      "x": 0.3299069995105237,
      "y": 0.5882845188284519,
      "scheduled": false
    },
    "a9eb": {
      "name": "evaluation",
      "canvasName": "evaluation",
      "summary": "Run Evaluation Task",
      "description": "Run an evaluation",
      "location": "Application",
      "locationType": null,
      "app": "WorkFlowEngine",
      "type": "operation",
      "displayName": "WorkFlowEngine",
      "variables": {
        "incoming": {
          "all_true_flag": false,
          "evaluation_groups": [
            {
              "all_true_flag": false,
              "evaluations": [
                {
                  "query": "",
                  "operand_1": {
                    "variable": "length",
                    "task": "4516"
                  },
                  "operator": ">",
                  "operand_2": {
                    "variable": 0,
                    "task": "static"
                  }
                }
              ]
            }
          ]
        },
        "outgoing": {
          "return_value": null
        }
      },
      "deprecated": false,
      "matched": [
        {
          "key": "canvasName",
          "highlightString": "<span class='highlight-string'>eval</span>uation"
        },
        {
          "key": "summary",
          "highlightString": "Run <span class='highlight-string'>Eval</span>uation Task"
        },
        {
          "key": "description",
          "highlightString": "Run an <span class='highlight-string'>eval</span>uation"
        }
      ],
      "groups": [],
      "x": 0.6744982868330885,
      "y": 0.29456066945606696
    },
    "a1ae": {
      "name": "evaluation",
      "canvasName": "evaluation",
      "summary": "Run Evaluation Task",
      "description": "Run an evaluation",
      "location": "Application",
      "locationType": null,
      "app": "WorkFlowEngine",
      "type": "operation",
      "displayName": "WorkFlowEngine",
      "variables": {
        "incoming": {
          "all_true_flag": false,
          "evaluation_groups": [
            {
              "all_true_flag": false,
              "evaluations": [
                {
                  "query": "",
                  "operand_1": {
                    "variable": "result",
                    "task": "8470"
                  },
                  "operator": "==",
                  "operand_2": {
                    "variable": false,
                    "task": "static"
                  }
                }
              ]
            }
          ]
        },
        "outgoing": {
          "return_value": null
        }
      },
      "deprecated": false,
      "matched": [
        {
          "key": "canvasName",
          "highlightString": "<span class='highlight-string'>eval</span>uation"
        },
        {
          "key": "summary",
          "highlightString": "Run <span class='highlight-string'>Eval</span>uation Task"
        },
        {
          "key": "description",
          "highlightString": "Run an <span class='highlight-string'>eval</span>uation"
        }
      ],
      "groups": [],
      "x": 1.028879099363681,
      "y": 0.49874476987447697
    },
    "f41b": {
      "name": "query",
      "canvasName": "query",
      "summary": "Fetch Random Host",
      "description": "Query data using a dot/bracket notation string and a matching key/value pair.",
      "location": "Application",
      "locationType": null,
      "app": "WorkFlowEngine",
      "type": "operation",
      "displayName": "WorkFlowEngine",
      "variables": {
        "incoming": {
          "pass_on_null": false,
          "query": "host",
          "obj": "$var.9529.Output"
        },
        "outgoing": {
          "return_data": null
        },
        "error": "",
        "decorators": []
      },
      "deprecated": false,
      "matched": [
        {
          "key": "canvasName",
          "highlightString": "<span class='highlight-string'>query</span>"
        },
        {
          "key": "summary",
          "highlightString": "<span class='highlight-string'>Query</span> Data Using 'json-query' Format"
        },
        {
          "key": "description",
          "highlightString": "<span class='highlight-string'>Query</span> data using a dot/bracket notation string and a matching key/value pair."
        }
      ],
      "groups": [],
      "x": 1.1052373959862947,
      "y": 0.5062761506276151,
      "scheduled": false
    },
    "419a": {
      "name": "merge",
      "canvasName": "merge",
      "summary": "Merge Data",
      "description": "Merge data into a single object",
      "location": "Application",
      "locationType": null,
      "app": "WorkFlowEngine",
      "type": "operation",
      "displayName": "WorkFlowEngine",
      "variables": {
        "incoming": {
          "data_to_merge": [
            {
              "key": "hosts",
              "value": {
                "task": "8221",
                "variable": "combinedArray"
              }
            },
            {
              "key": "randomHost",
              "value": {
                "task": "f41b",
                "variable": "return_data"
              }
            },
            {
              "key": "randomHostType",
              "value": {
                "task": "421",
                "variable": "return_data"
              }
            }
          ]
        },
        "outgoing": {
          "merged_object": null
        }
      },
      "deprecated": false,
      "matched": [
        {
          "key": "canvasName",
          "highlightString": "<span class='highlight-string'>merge</span>"
        },
        {
          "key": "summary",
          "highlightString": "<span class='highlight-string'>Merge</span> Data"
        },
        {
          "key": "description",
          "highlightString": "<span class='highlight-string'>Merge</span> data into a single object"
        }
      ],
      "groups": [],
      "x": 1.2790014684287812,
      "y": 0.5112970711297071
    },
    "beb5": {
      "name": "merge",
      "canvasName": "merge",
      "summary": "Merge Data",
      "description": "Merge data into a single object",
      "location": "Application",
      "locationType": null,
      "app": "WorkFlowEngine",
      "type": "operation",
      "displayName": "WorkFlowEngine",
      "variables": {
        "incoming": {
          "data_to_merge": [
            {
              "key": "hosts",
              "value": {
                "task": "8221",
                "variable": "combinedArray"
              }
            },
            {
              "key": "randomHost",
              "value": {
                "task": "static",
                "variable": null
              }
            },
            {
              "key": "randomHostType",
              "value": {
                "task": "static",
                "variable": null
              }
            }
          ]
        },
        "outgoing": {
          "merged_object": null
        }
      },
      "deprecated": false,
      "matched": [
        {
          "key": "canvasName",
          "highlightString": "<span class='highlight-string'>merge</span>"
        },
        {
          "key": "summary",
          "highlightString": "<span class='highlight-string'>Merge</span> Data"
        },
        {
          "key": "description",
          "highlightString": "<span class='highlight-string'>Merge</span> data into a single object"
        }
      ],
      "groups": [],
      "x": 1.1938325991189427,
      "y": 0.29372384937238494
    },
    "d876": {
      "name": "newVariable",
      "canvasName": "newVariable",
      "summary": "Create a Job Variable",
      "description": "Create a new Job variable by Job ID and assign it a value.",
      "location": "Application",
      "locationType": null,
      "app": "WorkFlowEngine",
      "type": "operation",
      "displayName": "WorkFlowEngine",
      "variables": {
        "incoming": {
          "name": "Result",
          "value": "$var.419a.merged_object"
        },
        "outgoing": {
          "value": null
        }
      },
      "deprecated": false,
      "matched": [
        {
          "key": "summary",
          "highlightString": "Create a <span class='highlight-string'>Job</span> <span class='highlight-string'>Variable</span>"
        },
        {
          "key": "description",
          "highlightString": "Create a new <span class='highlight-string'>Job</span> <span class='highlight-string'>variable</span> by Job ID and assign it a value."
        },
        {
          "key": "canvasName",
          "highlightString": "new<span class='highlight-string'>Variable</span>"
        }
      ],
      "groups": [],
      "x": 1.3734703866862457,
      "y": 0.5087866108786611
    }
  },
  "transitions": {
    "421": {
      "419a": {
        "type": "standard",
        "state": "success"
      }
    },
    "4516": {
      "a9eb": {
        "type": "standard",
        "state": "success"
      }
    },
    "6088": {
      "workflow_end": {
        "type": "standard",
        "state": "success"
      }
    },
    "8221": {
      "4516": {
        "type": "standard",
        "state": "success"
      }
    },
    "8470": {
      "a1ae": {
        "type": "standard",
        "state": "success"
      }
    },
    "9529": {
      "8470": {
        "type": "standard",
        "state": "success"
      }
    },
    "workflow_start": {
      "1fd1": {
        "type": "standard",
        "state": "success"
      },
      "fe66": {
        "type": "standard",
        "state": "success"
      }
    },
    "workflow_end": {},
    "1fd1": {
      "ae67": {
        "type": "standard",
        "state": "success"
      }
    },
    "fe66": {
      "9b00": {
        "type": "standard",
        "state": "success"
      }
    },
    "ae67": {
      "8221": {
        "type": "standard",
        "state": "success"
      }
    },
    "9b00": {
      "8221": {
        "type": "standard",
        "state": "success"
      }
    },
    "a9eb": {
      "9529": {
        "type": "standard",
        "state": "success"
      },
      "beb5": {
        "type": "standard",
        "state": "failure"
      }
    },
    "a1ae": {
      "f41b": {
        "type": "standard",
        "state": "success"
      },
      "beb5": {
        "type": "standard",
        "state": "failure"
      }
    },
    "f41b": {
      "421": {
        "type": "standard",
        "state": "success"
      }
    },
    "419a": {
      "d876": {
        "type": "standard",
        "state": "success"
      }
    },
    "beb5": {
      "6088": {
        "type": "standard",
        "state": "success"
      }
    },
    "d876": {
      "workflow_end": {
        "type": "standard",
        "state": "success"
      }
    }
  },
  "font_size": 12,
  "last_updated": "2021-12-07T18:42:10.504Z",
  "last_updated_by": {
    "provenance": "Itential-Okta",
    "username": "clarisa.colton@itential.com",
    "firstname": "Clarisa",
    "inactive": false
  },
  "lastUpdatedVersion": "5.44.0",
  "inputSchema": {
    "type": "object",
    "properties": {
      "formData": {
        "type": "object",
        "examples": [
          {
            "name": "value"
          }
        ]
      }
    },
    "required": [
      "formData"
    ]
  },
  "outputSchema": {
    "type": "object",
    "properties": {
      "formData": {
        "type": "object",
        "examples": [
          {
            "name": "value"
          }
        ]
      },
      "_id": {
        "type": "string",
        "pattern": "^[0-9a-f]{24}$"
      },
      "initiator": {
        "type": "string"
      },
      "Result": {
        "type": [
          "array",
          "boolean",
          "null",
          "number",
          "object",
          "string"
        ]
      }
    }
  },
  "created": "2021-10-20T13:35:49.049Z",
  "created_by": {
    "provenance": "local_aaa",
    "username": "admin@pronghorn",
    "firstname": "admin",
    "inactive": false,
    "email": "rahul.chakraborty@itential.com"
  },
  "createdVersion": "5.40.5-2021.1.28.0",
  "canvasVersion": 1,
  "tags": [],
  "groups": [],
  "migrationVersion": 1
}