{
  "_id": "604292c52fd5fb035530dcea",
  "name": "Versa Create Spoke Group formData2 creator",
  "description": "",
  "incoming": [
    {
      "$id": "vrfs",
      "type": "array",
      "items": {
        "type": "string",
        "examples": [
          "Tenant1-LAN-VR"
        ]
      }
    },
    {
      "$id": "appliances",
      "type": "array",
      "items": {
        "type": "string",
        "examples": [
          "New"
        ]
      }
    }
  ],
  "outgoing": [
    {
      "$id": "formData2",
      "type": "object",
      "properties": {
        "vrfs": {
          "type": "array",
          "items": {
            "type": "object",
            "properties": {
              "hubs": {
                "type": "array",
                "items": {
                  "type": "object",
                  "properties": {
                    "name": {
                      "type": "string",
                      "examples": [
                        "New"
                      ]
                    },
                    "priority": {
                      "type": "string",
                      "examples": [
                        "2"
                      ]
                    }
                  },
                  "required": []
                }
              },
              "name": {
                "type": "string",
                "examples": [
                  "Tenant1-LAN-VR"
                ]
              },
              "groupType": {
                "type": "string",
                "examples": [
                  "HubAndSpoke"
                ]
              }
            },
            "required": []
          }
        }
      },
      "required": []
    }
  ],
  "steps": [
    {
      "id": 2,
      "type": "assign",
      "from": {
        "location": "incoming",
        "name": "vrfs",
        "ptr": ""
      },
      "to": {
        "location": "method",
        "name": 1,
        "ptr": "/args/0/value"
      }
    },
    {
      "id": 4,
      "type": "assign",
      "from": {
        "location": "incoming",
        "name": "appliances",
        "ptr": ""
      },
      "to": {
        "location": "method",
        "name": 3,
        "ptr": "/args/0/value"
      }
    },
    {
      "id": 3,
      "type": "method",
      "library": "Array",
      "method": "map",
      "args": [
        null,
        "ƒ_map_2"
      ],
      "view": {
        "row": 2,
        "col": 1
      }
    },
    {
      "id": 6,
      "type": "assign",
      "from": {
        "location": "method",
        "name": 3,
        "ptr": "/return"
      },
      "to": {
        "location": "method",
        "name": 1,
        "ptr": "/args/2/value"
      }
    },
    {
      "id": 1,
      "type": "method",
      "library": "Array",
      "method": "map",
      "args": [
        null,
        "ƒ_map_1",
        null
      ],
      "view": {
        "row": 1,
        "col": 1
      }
    },
    {
      "id": 5,
      "type": "assign",
      "from": {
        "location": "method",
        "name": 1,
        "ptr": "/return"
      },
      "to": {
        "location": "outgoing",
        "name": "formData2",
        "ptr": "/vrfs"
      }
    }
  ],
  "functions": [
    {
      "incoming": [
        {
          "type": "string",
          "examples": [
            "Tenant1-LAN-VR"
          ],
          "$id": "currentValue"
        },
        {
          "title": "index",
          "type": "number",
          "optional": true,
          "$id": "index"
        },
        {
          "$id": "array",
          "type": "array",
          "items": {
            "type": "string",
            "examples": [
              "Tenant1-LAN-VR"
            ]
          },
          "optional": true
        },
        {
          "$id": "thisArg",
          "type": "object",
          "properties": {
            "map return": {
              "type": "array"
            }
          },
          "isContext": true
        }
      ],
      "outgoing": [
        {
          "title": "newValue",
          "type": [
            "array",
            "boolean",
            "number",
            "integer",
            "string",
            "object",
            "null"
          ],
          "editable": true,
          "$id": "newValue"
        }
      ],
      "functions": [],
      "name": "ƒ_map_1",
      "steps": [
        {
          "id": 1,
          "type": "declaration",
          "library": "Object",
          "method": "new Object",
          "args": [
            null
          ],
          "view": {
            "row": 1,
            "col": 1
          }
        },
        {
          "id": 2,
          "type": "method",
          "library": "Object",
          "method": "setProperty",
          "args": [
            null,
            "name",
            null
          ],
          "view": {
            "row": 1,
            "col": 2
          }
        },
        {
          "id": 3,
          "type": "assign",
          "from": {
            "location": "declaration",
            "name": 1,
            "ptr": "/return"
          },
          "to": {
            "location": "method",
            "name": 2,
            "ptr": "/args/0/value"
          }
        },
        {
          "id": 4,
          "type": "assign",
          "from": {
            "location": "incoming",
            "name": "currentValue",
            "ptr": ""
          },
          "to": {
            "location": "method",
            "name": 2,
            "ptr": "/args/2/value"
          }
        },
        {
          "id": 6,
          "type": "method",
          "library": "Object",
          "method": "setProperty",
          "args": [
            null,
            "hubs",
            null
          ],
          "view": {
            "row": 2,
            "col": 2
          }
        },
        {
          "id": 7,
          "type": "assign",
          "from": {
            "location": "method",
            "name": 2,
            "ptr": "/return"
          },
          "to": {
            "location": "method",
            "name": 6,
            "ptr": "/args/0/value"
          }
        },
        {
          "id": 8,
          "type": "assign",
          "from": {
            "location": "incoming",
            "name": "thisArg",
            "ptr": "/map return"
          },
          "to": {
            "location": "method",
            "name": 6,
            "ptr": "/args/2/value"
          }
        },
        {
          "id": 9,
          "type": "assign",
          "from": {
            "location": "method",
            "name": 6,
            "ptr": "/return"
          },
          "to": {
            "location": "outgoing",
            "name": "newValue",
            "ptr": ""
          }
        }
      ],
      "view": {
        "col": 2,
        "row": 4
      },
      "id": "ƒ_map_1",
      "comments": []
    },
    {
      "incoming": [
        {
          "type": "string",
          "examples": [
            "New"
          ],
          "$id": "currentValue"
        },
        {
          "title": "index",
          "type": "number",
          "optional": true,
          "$id": "index"
        },
        {
          "$id": "array",
          "type": "array",
          "items": {
            "type": "string",
            "examples": [
              "New"
            ]
          },
          "optional": true
        },
        {
          "$id": "thisArg",
          "type": "object",
          "properties": {},
          "isContext": true,
          "isThis": true
        }
      ],
      "outgoing": [
        {
          "title": "newValue",
          "type": [
            "array",
            "boolean",
            "number",
            "integer",
            "string",
            "object",
            "null"
          ],
          "editable": true,
          "$id": "newValue"
        }
      ],
      "functions": [],
      "name": "ƒ_map_2",
      "steps": [
        {
          "id": 1,
          "type": "method",
          "library": "Object",
          "method": "setProperty",
          "args": [
            null,
            "name",
            null
          ],
          "view": {
            "row": 1,
            "col": 2
          }
        },
        {
          "id": 2,
          "type": "declaration",
          "library": "Object",
          "method": "new Object",
          "args": [
            null
          ],
          "view": {
            "row": 1,
            "col": 1
          }
        },
        {
          "id": 3,
          "type": "assign",
          "from": {
            "location": "declaration",
            "name": 2,
            "ptr": "/return"
          },
          "to": {
            "location": "method",
            "name": 1,
            "ptr": "/args/0/value"
          }
        },
        {
          "id": 4,
          "type": "assign",
          "from": {
            "location": "incoming",
            "name": "currentValue",
            "ptr": ""
          },
          "to": {
            "location": "method",
            "name": 1,
            "ptr": "/args/2/value"
          }
        },
        {
          "id": 5,
          "type": "assign",
          "from": {
            "location": "method",
            "name": 1,
            "ptr": "/return"
          },
          "to": {
            "location": "outgoing",
            "name": "newValue",
            "ptr": ""
          }
        }
      ],
      "view": {
        "col": 2,
        "row": 4
      },
      "id": "ƒ_map_2",
      "comments": []
    }
  ],
  "comments": [],
  "view": {
    "col": 1,
    "row": 5
  },
  "created": "2021-03-09T16:16:11.056Z",
  "createdBy": {
    "_id": "5fce5f28854473e9785d17da",
    "provenance": "local_aaa",
    "username": "admin@pronghorn"
  },
  "lastUpdated": "2021-03-09T16:16:11.056Z",
  "lastUpdatedBy": {
    "_id": "5fce5f28854473e9785d17da",
    "provenance": "local_aaa",
    "username": "admin@pronghorn"
  },
  "version": "3.13.0"
}