{
  "_id": "60412b2da6273e023dc0717d",
  "name": "Versa Create Spoke Group",
  "description": "",
  "incoming": [
    {
      "$id": "formData1",
      "type": "object",
      "properties": {
        "name": {
          "type": "string",
          "examples": [
            "ZackTestSG"
          ]
        },
        "org": {
          "type": "string",
          "examples": [
            "Tenant1"
          ]
        },
        "hubType": {
          "type": "string",
          "examples": [
            "hub"
          ]
        },
        "region": {
          "type": "string",
          "examples": [
            "reg2"
          ]
        }
      },
      "required": []
    }
  ],
  "outgoing": [
    {
      "$id": "name",
      "type": "string",
      "examples": [
        "ZackTestSG"
      ]
    },
    {
      "$id": "org",
      "type": "string",
      "examples": [
        "Tenant1"
      ]
    },
    {
      "$id": "hubType",
      "type": "string",
      "examples": [
        "hub"
      ]
    },
    {
      "$id": "region",
      "type": "string",
      "examples": [
        "reg2"
      ]
    }
  ],
  "steps": [
    {
      "id": 1,
      "type": "assign",
      "from": {
        "location": "incoming",
        "name": "formData1",
        "ptr": "/name"
      },
      "to": {
        "location": "outgoing",
        "name": "name",
        "ptr": ""
      }
    },
    {
      "id": 2,
      "type": "assign",
      "from": {
        "location": "incoming",
        "name": "formData1",
        "ptr": "/org"
      },
      "to": {
        "location": "outgoing",
        "name": "org",
        "ptr": ""
      }
    },
    {
      "id": 3,
      "type": "assign",
      "from": {
        "location": "incoming",
        "name": "formData1",
        "ptr": "/hubType"
      },
      "to": {
        "location": "outgoing",
        "name": "hubType",
        "ptr": ""
      }
    },
    {
      "id": 5,
      "type": "method",
      "library": "Equality",
      "method": "equality",
      "args": [
        "No Region",
        null
      ],
      "view": {
        "row": 2,
        "col": 1
      }
    },
    {
      "id": 6,
      "type": "assign",
      "from": {
        "location": "incoming",
        "name": "formData1",
        "ptr": "/region"
      },
      "to": {
        "location": "method",
        "name": 5,
        "ptr": "/args/1/value"
      }
    },
    {
      "id": 7,
      "type": "method",
      "library": "Conditional",
      "method": "ternary",
      "args": [
        null,
        null,
        null
      ],
      "view": {
        "row": 2,
        "col": 2
      }
    },
    {
      "id": 8,
      "type": "assign",
      "from": {
        "location": "method",
        "name": 5,
        "ptr": "/return"
      },
      "to": {
        "location": "method",
        "name": 7,
        "ptr": "/args/0/value"
      }
    },
    {
      "id": 9,
      "type": "assign",
      "from": {
        "location": "incoming",
        "name": "formData1",
        "ptr": "/region"
      },
      "to": {
        "location": "method",
        "name": 7,
        "ptr": "/args/2/value"
      }
    },
    {
      "id": 10,
      "type": "declaration",
      "library": "String",
      "method": "new String",
      "args": [
        null
      ],
      "view": {
        "row": 3,
        "col": 1
      }
    },
    {
      "id": 11,
      "type": "assign",
      "from": {
        "location": "declaration",
        "name": 10,
        "ptr": "/return"
      },
      "to": {
        "location": "method",
        "name": 7,
        "ptr": "/args/1/value"
      }
    },
    {
      "id": 12,
      "type": "assign",
      "from": {
        "location": "method",
        "name": 7,
        "ptr": "/return"
      },
      "to": {
        "location": "outgoing",
        "name": "region",
        "ptr": ""
      }
    }
  ],
  "functions": [],
  "comments": [],
  "view": {
    "col": 2,
    "row": 5
  },
  "created": "2021-03-09T16:16:10.963Z",
  "createdBy": {
    "_id": "5fce5f28854473e9785d17da",
    "provenance": "local_aaa",
    "username": "admin@pronghorn"
  },
  "lastUpdated": "2021-03-09T16:16:10.963Z",
  "lastUpdatedBy": {
    "_id": "5fce5f28854473e9785d17da",
    "provenance": "local_aaa",
    "username": "admin@pronghorn"
  },
  "version": "3.13.0"
}