{
  "_id": "6054f10a91de4104438de048",
  "name": "Versa Create New Organization",
  "description": "",
  "incoming": [
    {
      "$id": "formData1",
      "type": "object",
      "properties": {
        "ikeAuthentication": {
          "type": "string",
          "examples": [
            "PSK"
          ]
        },
        "routingInstanceVpn": {
          "type": "boolean",
          "examples": [
            true,
            false
          ]
        },
        "scp": {
          "type": "boolean",
          "examples": [
            true,
            false
          ]
        },
        "supportedUserRoles": {
          "type": "array",
          "items": {
            "type": "object",
            "properties": {
              "Selected": {
                "type": "boolean",
                "examples": [
                  true,
                  false
                ]
              },
              "Role Name": {
                "type": "string",
                "examples": [
                  "TenantDashboardOperator"
                ]
              }
            },
            "required": []
          }
        },
        "analyticsCluster": {
          "type": "array",
          "items": {
            "type": "object",
            "properties": {
              "Selected": {
                "type": "boolean",
                "examples": [
                  true,
                  false
                ]
              },
              "Cluster Name": {
                "type": "string",
                "examples": [
                  "Itential-VAN"
                ]
              }
            },
            "required": []
          }
        },
        "cmsConnectors": {
          "type": "array",
          "items": {
            "type": "object",
            "properties": {
              "Selected": {
                "type": "boolean",
                "examples": [
                  true,
                  false
                ]
              },
              "Connector Name": {
                "type": "string",
                "examples": [
                  "AWS1"
                ]
              }
            },
            "required": []
          }
        },
        "parentOrganization": {
          "type": "string",
          "examples": [
            "ahmedTest"
          ]
        },
        "organizationName": {
          "type": "string",
          "examples": [
            "Tenant1123213"
          ]
        },
        "deploymentType": {
          "type": "string",
          "examples": [
            "vCPE"
          ]
        }
      },
      "required": []
    },
    {
      "$id": "formData2",
      "type": "object",
      "properties": {
        "controllers": {
          "type": "array",
          "items": {
            "type": "object",
            "properties": {
              "Selected": {
                "type": "boolean",
                "examples": [
                  true,
                  false
                ]
              },
              "Controller Name": {
                "type": "string",
                "examples": [
                  "Controller1"
                ]
              }
            },
            "required": []
          }
        }
      },
      "required": []
    },
    {
      "$id": "nextAvailableOrganizationId",
      "type": "object",
      "properties": {
        "icode": {
          "type": "string",
          "examples": [
            "AD%2E200"
          ]
        },
        "response": {
          "type": "object",
          "properties": {
            "SdwanGlobalIds": {
              "type": "object",
              "properties": {
                "globalIds": {
                  "type": "array",
                  "items": {
                    "type": "integer",
                    "examples": [
                      14
                    ]
                  }
                }
              },
              "required": []
            }
          },
          "required": []
        },
        "headers": {
          "type": "object",
          "properties": {
            "set-cookie": {
              "type": "array",
              "items": {
                "type": "string",
                "examples": [
                  "JSESSIONID=572E7B68622300377895BDDE197FD738; Path=/; Secure; HttpOnly"
                ]
              }
            },
            "x-content-type-options": {
              "type": "string",
              "examples": [
                "nosniff"
              ]
            },
            "x-xss-protection": {
              "type": "string",
              "examples": [
                "1; mode=block"
              ]
            },
            "cache-control": {
              "type": "string",
              "examples": [
                "no-cache, no-store, max-age=0, must-revalidate"
              ]
            },
            "pragma": {
              "type": "string",
              "examples": [
                "no-cache"
              ]
            },
            "expires": {
              "type": "string",
              "examples": [
                "0"
              ]
            },
            "strict-transport-security": {
              "type": "string",
              "examples": [
                "max-age=31536000 ; includeSubDomains"
              ]
            },
            "x-frame-options": {
              "type": "string",
              "examples": [
                "DENY"
              ]
            },
            "content-type": {
              "type": "string",
              "examples": [
                "application/json;charset=UTF-8"
              ]
            },
            "transfer-encoding": {
              "type": "string",
              "examples": [
                "chunked"
              ]
            },
            "date": {
              "type": "string",
              "examples": [
                "Fri, 19 Mar 2021 18:31:40 GMT"
              ]
            },
            "connection": {
              "type": "string",
              "examples": [
                "close"
              ]
            }
          },
          "required": []
        },
        "metrics": {
          "type": "object",
          "properties": {
            "code": {
              "type": "integer",
              "examples": [
                200
              ]
            },
            "timeouts": {
              "type": "integer",
              "examples": [
                0
              ]
            },
            "redirects": {
              "type": "integer",
              "examples": [
                0
              ]
            },
            "retries": {
              "type": "integer",
              "examples": [
                0
              ]
            },
            "tripTime": {
              "type": "integer",
              "examples": [
                122
              ]
            },
            "isThrottling": {
              "type": "boolean",
              "examples": [
                true,
                false
              ]
            },
            "capabilityTime": {
              "type": "string",
              "examples": [
                "127ms"
              ]
            }
          },
          "required": []
        }
      },
      "required": []
    },
    {
      "$id": "nextAvailableVrfId",
      "type": "object",
      "properties": {
        "icode": {
          "type": "string",
          "examples": [
            "AD%2E200"
          ]
        },
        "response": {
          "type": "object",
          "properties": {
            "SdwanGlobalIds": {
              "type": "object",
              "properties": {
                "globalIds": {
                  "type": "array",
                  "items": {
                    "type": "integer",
                    "examples": [
                      10
                    ]
                  }
                }
              },
              "required": []
            }
          },
          "required": []
        },
        "headers": {
          "type": "object",
          "properties": {
            "set-cookie": {
              "type": "array",
              "items": {
                "type": "string",
                "examples": [
                  "JSESSIONID=5E455C97585BEDBD8C60845298FF0C97; Path=/; Secure; HttpOnly"
                ]
              }
            },
            "x-content-type-options": {
              "type": "string",
              "examples": [
                "nosniff"
              ]
            },
            "x-xss-protection": {
              "type": "string",
              "examples": [
                "1; mode=block"
              ]
            },
            "cache-control": {
              "type": "string",
              "examples": [
                "no-cache, no-store, max-age=0, must-revalidate"
              ]
            },
            "pragma": {
              "type": "string",
              "examples": [
                "no-cache"
              ]
            },
            "expires": {
              "type": "string",
              "examples": [
                "0"
              ]
            },
            "strict-transport-security": {
              "type": "string",
              "examples": [
                "max-age=31536000 ; includeSubDomains"
              ]
            },
            "x-frame-options": {
              "type": "string",
              "examples": [
                "DENY"
              ]
            },
            "content-type": {
              "type": "string",
              "examples": [
                "application/json;charset=UTF-8"
              ]
            },
            "transfer-encoding": {
              "type": "string",
              "examples": [
                "chunked"
              ]
            },
            "date": {
              "type": "string",
              "examples": [
                "Fri, 19 Mar 2021 18:31:40 GMT"
              ]
            },
            "connection": {
              "type": "string",
              "examples": [
                "close"
              ]
            }
          },
          "required": []
        },
        "metrics": {
          "type": "object",
          "properties": {
            "code": {
              "type": "integer",
              "examples": [
                200
              ]
            },
            "timeouts": {
              "type": "integer",
              "examples": [
                0
              ]
            },
            "redirects": {
              "type": "integer",
              "examples": [
                0
              ]
            },
            "retries": {
              "type": "integer",
              "examples": [
                0
              ]
            },
            "tripTime": {
              "type": "integer",
              "examples": [
                112
              ]
            },
            "isThrottling": {
              "type": "boolean",
              "examples": [
                true,
                false
              ]
            },
            "capabilityTime": {
              "type": "string",
              "examples": [
                "114ms"
              ]
            }
          },
          "required": []
        }
      },
      "required": []
    }
  ],
  "outgoing": [
    {
      "$id": "orgPayload",
      "type": "object",
      "properties": {
        "cpeDeploymentType": {
          "type": "string",
          "examples": [
            "vCPE"
          ]
        },
        "globalId": {
          "type": "integer",
          "examples": [
            15
          ]
        },
        "ikeAuthType": {
          "type": "string",
          "examples": [
            "psk"
          ]
        },
        "orgName": {
          "type": "string",
          "examples": [
            "zackUI"
          ]
        },
        "sharedControlPlane": {
          "type": "boolean",
          "examples": [
            true,
            false
          ]
        },
        "analyticsClusters": {
          "type": "array",
          "items": {
            "type": "string",
            "examples": [
              "Itential-VAN"
            ]
          }
        },
        "supportedRoles": {
          "type": "array",
          "items": {
            "type": "string",
            "examples": [
              "TenantDashboardOperator"
            ]
          }
        },
        "vrfs": {
          "type": "array",
          "items": {
            "type": "object",
            "properties": {
              "name": {
                "type": "string",
                "examples": [
                  "zackUI-LAN-VR"
                ]
              },
              "id": {
                "type": "integer",
                "examples": [
                  11
                ]
              },
              "description": {
                "type": "string"
              },
              "enableVPN": {
                "type": "boolean",
                "examples": [
                  true,
                  false
                ]
              },
              "mode": {
                "type": "string",
                "examples": [
                  "edit"
                ]
              }
            },
            "required": []
          }
        },
        "controllers": {
          "type": "array",
          "items": {
            "type": "string",
            "examples": [
              "Controller1"
            ]
          }
        },
        "parentOrg": {
          "type": "string",
          "examples": [
            "Parent"
          ]
        },
        "cmsConnectors": {
          "type": "array",
          "items": {
            "type": "string",
            "examples": [
              "AWS2"
            ]
          }
        }
      },
      "required": []
    }
  ],
  "steps": [
    {
      "id": 6,
      "type": "method",
      "library": "Array",
      "method": "getIndex",
      "args": [
        null,
        0
      ],
      "view": {
        "row": 5,
        "col": 1
      }
    },
    {
      "id": 7,
      "type": "assign",
      "from": {
        "location": "incoming",
        "name": "nextAvailableOrganizationId",
        "ptr": "/response/SdwanGlobalIds/globalIds"
      },
      "to": {
        "location": "method",
        "name": 6,
        "ptr": "/args/0/value"
      }
    },
    {
      "id": 9,
      "type": "function",
      "function": "accumulateNames",
      "args": [
        "Role Name",
        null
      ],
      "view": {
        "row": 2,
        "col": 1
      }
    },
    {
      "id": 10,
      "type": "assign",
      "from": {
        "location": "incoming",
        "name": "formData1",
        "ptr": "/supportedUserRoles"
      },
      "to": {
        "location": "function",
        "name": 9,
        "ptr": "/args/1/value"
      }
    },
    {
      "id": 12,
      "type": "function",
      "function": "accumulateNames",
      "args": [
        "Cluster Name",
        null
      ],
      "view": {
        "row": 1,
        "col": 1
      }
    },
    {
      "id": 13,
      "type": "assign",
      "from": {
        "location": "incoming",
        "name": "formData1",
        "ptr": "/analyticsCluster"
      },
      "to": {
        "location": "function",
        "name": 12,
        "ptr": "/args/1/value"
      }
    },
    {
      "id": 22,
      "type": "function",
      "function": "accumulateNames",
      "args": [
        "Connector Name",
        null
      ],
      "view": {
        "row": 3,
        "col": 1
      }
    },
    {
      "id": 23,
      "type": "assign",
      "from": {
        "location": "incoming",
        "name": "formData1",
        "ptr": "/cmsConnectors"
      },
      "to": {
        "location": "function",
        "name": 22,
        "ptr": "/args/1/value"
      }
    },
    {
      "id": 25,
      "type": "function",
      "function": "accumulateNames",
      "args": [
        "Controller Name",
        null
      ],
      "view": {
        "row": 4,
        "col": 1
      }
    },
    {
      "id": 26,
      "type": "assign",
      "from": {
        "location": "incoming",
        "name": "formData2",
        "ptr": "/controllers"
      },
      "to": {
        "location": "function",
        "name": 25,
        "ptr": "/args/1/value"
      }
    },
    {
      "id": 28,
      "type": "function",
      "function": "buildVrfObj",
      "args": [
        null,
        null,
        null
      ],
      "view": {
        "row": 7,
        "col": 1
      }
    },
    {
      "id": 29,
      "type": "assign",
      "from": {
        "location": "incoming",
        "name": "formData1",
        "ptr": "/organizationName"
      },
      "to": {
        "location": "function",
        "name": 28,
        "ptr": "/args/1/value"
      }
    },
    {
      "id": 30,
      "type": "assign",
      "from": {
        "location": "incoming",
        "name": "formData1",
        "ptr": "/routingInstanceVpn"
      },
      "to": {
        "location": "function",
        "name": 28,
        "ptr": "/args/2/value"
      }
    },
    {
      "id": 31,
      "type": "method",
      "library": "Array",
      "method": "getIndex",
      "args": [
        null,
        0
      ],
      "view": {
        "row": 6,
        "col": 1
      }
    },
    {
      "id": 32,
      "type": "assign",
      "from": {
        "location": "incoming",
        "name": "nextAvailableVrfId",
        "ptr": "/response/SdwanGlobalIds/globalIds"
      },
      "to": {
        "location": "method",
        "name": 31,
        "ptr": "/args/0/value"
      }
    },
    {
      "id": 33,
      "type": "assign",
      "from": {
        "location": "method",
        "name": 31,
        "ptr": "/return"
      },
      "to": {
        "location": "function",
        "name": 28,
        "ptr": "/args/0/value"
      }
    },
    {
      "id": 34,
      "type": "declaration",
      "library": "Array",
      "method": "new Array",
      "args": [],
      "view": {
        "row": 8,
        "col": 1
      },
      "polymorphIndex": 0
    },
    {
      "id": 35,
      "type": "method",
      "library": "Array",
      "method": "push",
      "args": [
        null,
        null
      ],
      "view": {
        "row": 5,
        "col": 2
      }
    },
    {
      "id": 36,
      "type": "assign",
      "from": {
        "location": "declaration",
        "name": 34,
        "ptr": "/return"
      },
      "to": {
        "location": "method",
        "name": 35,
        "ptr": "/args/0/value"
      }
    },
    {
      "id": 37,
      "type": "assign",
      "from": {
        "location": "function",
        "name": 28,
        "ptr": "/return/vrfArray"
      },
      "to": {
        "location": "method",
        "name": 35,
        "ptr": "/args/1/value"
      }
    },
    {
      "id": 39,
      "type": "assign",
      "from": {
        "location": "incoming",
        "name": "formData1",
        "ptr": "/deploymentType"
      },
      "to": {
        "location": "outgoing",
        "name": "orgPayload",
        "ptr": "/cpeDeploymentType"
      }
    },
    {
      "id": 40,
      "type": "assign",
      "from": {
        "location": "method",
        "name": 6,
        "ptr": "/return"
      },
      "to": {
        "location": "outgoing",
        "name": "orgPayload",
        "ptr": "/globalId"
      }
    },
    {
      "id": 41,
      "type": "assign",
      "from": {
        "location": "incoming",
        "name": "formData1",
        "ptr": "/ikeAuthentication"
      },
      "to": {
        "location": "outgoing",
        "name": "orgPayload",
        "ptr": "/ikeAuthType"
      }
    },
    {
      "id": 42,
      "type": "assign",
      "from": {
        "location": "incoming",
        "name": "formData1",
        "ptr": "/organizationName"
      },
      "to": {
        "location": "outgoing",
        "name": "orgPayload",
        "ptr": "/orgName"
      }
    },
    {
      "id": 43,
      "type": "assign",
      "from": {
        "location": "incoming",
        "name": "formData1",
        "ptr": "/scp"
      },
      "to": {
        "location": "outgoing",
        "name": "orgPayload",
        "ptr": "/sharedControlPlane"
      }
    },
    {
      "id": 44,
      "type": "assign",
      "from": {
        "location": "function",
        "name": 9,
        "ptr": "/return/selectedNames"
      },
      "to": {
        "location": "outgoing",
        "name": "orgPayload",
        "ptr": "/supportedRoles"
      }
    },
    {
      "id": 45,
      "type": "assign",
      "from": {
        "location": "method",
        "name": 35,
        "ptr": "/return"
      },
      "to": {
        "location": "outgoing",
        "name": "orgPayload",
        "ptr": "/vrfs"
      }
    },
    {
      "id": 46,
      "type": "assign",
      "from": {
        "location": "function",
        "name": 25,
        "ptr": "/return/selectedNames"
      },
      "to": {
        "location": "outgoing",
        "name": "orgPayload",
        "ptr": "/controllers"
      }
    },
    {
      "id": 47,
      "type": "assign",
      "from": {
        "location": "incoming",
        "name": "formData1",
        "ptr": "/parentOrganization"
      },
      "to": {
        "location": "outgoing",
        "name": "orgPayload",
        "ptr": "/parentOrg"
      }
    },
    {
      "id": 48,
      "type": "assign",
      "from": {
        "location": "function",
        "name": 22,
        "ptr": "/return/selectedNames"
      },
      "to": {
        "location": "outgoing",
        "name": "orgPayload",
        "ptr": "/cmsConnectors"
      }
    },
    {
      "id": 49,
      "type": "assign",
      "from": {
        "location": "function",
        "name": 12,
        "ptr": "/return/selectedNames"
      },
      "to": {
        "location": "outgoing",
        "name": "orgPayload",
        "ptr": "/analyticsClusters"
      }
    }
  ],
  "functions": [
    {
      "incoming": [
        {
          "$id": "fieldName",
          "type": "string",
          "examples": [
            "Role Name"
          ]
        },
        {
          "$id": "array",
          "type": "array",
          "items": {
            "type": "object",
            "properties": {
              "Selected": {
                "type": "boolean",
                "examples": [
                  true,
                  false
                ]
              },
              "Role Name": {
                "type": "string",
                "examples": [
                  "TenantDashboardOperator"
                ]
              }
            },
            "required": []
          }
        }
      ],
      "outgoing": [
        {
          "$id": "selectedNames",
          "type": "array"
        }
      ],
      "functions": [
        {
          "incoming": [
            {
              "type": [
                "array",
                "boolean",
                "number",
                "integer",
                "string",
                "object",
                "null"
              ],
              "$id": "accumulator"
            },
            {
              "type": "object",
              "properties": {
                "Selected": {
                  "type": "boolean",
                  "examples": [
                    true,
                    false
                  ]
                },
                "Role Name": {
                  "type": "string",
                  "examples": [
                    "TenantDashboardOperator"
                  ]
                }
              },
              "required": [],
              "$id": "currentValue"
            },
            {
              "title": "index",
              "type": "number",
              "optional": true,
              "$id": "index"
            },
            {
              "$id": "array",
              "type": "array",
              "items": {
                "type": "object",
                "properties": {
                  "Selected": {
                    "type": "boolean",
                    "examples": [
                      true,
                      false
                    ]
                  },
                  "Role Name": {
                    "type": "string",
                    "examples": [
                      "TenantDashboardOperator"
                    ]
                  }
                },
                "required": []
              },
              "optional": true
            },
            {
              "$id": "thisArg",
              "type": "object",
              "properties": {
                "fieldName": {
                  "$id": "fieldName",
                  "type": "string",
                  "examples": [
                    "Role Name"
                  ]
                }
              },
              "isContext": true,
              "isThis": true
            }
          ],
          "outgoing": [
            {
              "title": "accumulator",
              "type": [
                "array",
                "boolean",
                "number",
                "integer",
                "string",
                "object",
                "null"
              ],
              "$id": "accumulator"
            }
          ],
          "functions": [],
          "name": "ƒ_reduce_1",
          "steps": [
            {
              "id": 1,
              "type": "method",
              "library": "Object",
              "method": "getProperty",
              "args": [
                null,
                null
              ],
              "view": {
                "row": 1,
                "col": 1
              }
            },
            {
              "id": 2,
              "type": "assign",
              "from": {
                "location": "incoming",
                "name": "currentValue",
                "ptr": ""
              },
              "to": {
                "location": "method",
                "name": 1,
                "ptr": "/args/0/value"
              }
            },
            {
              "id": 3,
              "type": "assign",
              "from": {
                "location": "incoming",
                "name": "thisArg",
                "ptr": "/fieldName"
              },
              "to": {
                "location": "method",
                "name": 1,
                "ptr": "/args/1/value"
              }
            },
            {
              "id": 4,
              "type": "method",
              "library": "Array",
              "method": "push",
              "args": [
                null,
                null
              ],
              "view": {
                "row": 2,
                "col": 2
              }
            },
            {
              "id": 5,
              "type": "assign",
              "from": {
                "location": "incoming",
                "name": "accumulator",
                "ptr": ""
              },
              "to": {
                "location": "method",
                "name": 4,
                "ptr": "/args/0/value"
              }
            },
            {
              "id": 6,
              "type": "assign",
              "from": {
                "location": "method",
                "name": 1,
                "ptr": "/return"
              },
              "to": {
                "location": "method",
                "name": 4,
                "ptr": "/args/1/value"
              }
            },
            {
              "id": 7,
              "type": "method",
              "library": "Conditional",
              "method": "ternary",
              "args": [
                null,
                null,
                null
              ],
              "view": {
                "row": 1,
                "col": 3
              }
            },
            {
              "id": 8,
              "type": "assign",
              "from": {
                "location": "method",
                "name": 4,
                "ptr": "/return"
              },
              "to": {
                "location": "method",
                "name": 7,
                "ptr": "/args/1/value"
              }
            },
            {
              "id": 9,
              "type": "assign",
              "from": {
                "location": "incoming",
                "name": "accumulator",
                "ptr": ""
              },
              "to": {
                "location": "method",
                "name": 7,
                "ptr": "/args/2/value"
              }
            },
            {
              "id": 10,
              "type": "assign",
              "from": {
                "location": "incoming",
                "name": "currentValue",
                "ptr": "/Selected"
              },
              "to": {
                "location": "method",
                "name": 7,
                "ptr": "/args/0/value"
              }
            },
            {
              "id": 11,
              "type": "assign",
              "from": {
                "location": "method",
                "name": 7,
                "ptr": "/return"
              },
              "to": {
                "location": "outgoing",
                "name": "accumulator",
                "ptr": ""
              }
            }
          ],
          "view": {
            "col": 3,
            "row": 4
          },
          "id": "ƒ_reduce_1",
          "comments": []
        }
      ],
      "name": "accumulateNames",
      "steps": [
        {
          "id": 1,
          "type": "method",
          "library": "Array",
          "method": "reduce",
          "args": [
            null,
            "ƒ_reduce_1",
            null,
            null
          ],
          "view": {
            "row": 1,
            "col": 2
          }
        },
        {
          "id": 2,
          "type": "assign",
          "from": {
            "location": "incoming",
            "name": "array",
            "ptr": ""
          },
          "to": {
            "location": "method",
            "name": 1,
            "ptr": "/args/0/value"
          }
        },
        {
          "id": 3,
          "type": "declaration",
          "library": "Array",
          "method": "new Array",
          "args": [],
          "view": {
            "row": 1,
            "col": 1
          },
          "polymorphIndex": 0
        },
        {
          "id": 4,
          "type": "assign",
          "from": {
            "location": "declaration",
            "name": 3,
            "ptr": "/return"
          },
          "to": {
            "location": "method",
            "name": 1,
            "ptr": "/args/2/value"
          }
        },
        {
          "id": 5,
          "type": "assign",
          "from": {
            "location": "incoming",
            "name": "fieldName",
            "ptr": ""
          },
          "to": {
            "location": "method",
            "name": 1,
            "ptr": "/args/3/value"
          }
        },
        {
          "id": 6,
          "type": "assign",
          "from": {
            "location": "method",
            "name": 1,
            "ptr": "/return"
          },
          "to": {
            "location": "outgoing",
            "name": "selectedNames",
            "ptr": ""
          }
        }
      ],
      "view": {
        "col": 2,
        "row": 4
      },
      "id": "accumulateNames",
      "comments": []
    },
    {
      "incoming": [
        {
          "$id": "id",
          "type": "integer",
          "examples": [
            12
          ]
        },
        {
          "$id": "orgName",
          "type": "string",
          "examples": [
            "zackUI"
          ]
        },
        {
          "$id": "enableVPN",
          "type": "boolean",
          "examples": [
            true,
            false
          ]
        }
      ],
      "outgoing": [
        {
          "$id": "vrfArray",
          "type": "object",
          "properties": {
            "name": {
              "type": "string",
              "examples": [
                "zackUI-LAN-VR"
              ]
            },
            "id": {
              "type": "integer",
              "examples": [
                11
              ]
            },
            "description": {
              "type": "string"
            },
            "enableVPN": {
              "type": "boolean",
              "examples": [
                true,
                false
              ]
            },
            "mode": {
              "type": "string",
              "examples": [
                "edit"
              ]
            }
          },
          "required": []
        }
      ],
      "functions": [],
      "name": "buildVrfObj",
      "steps": [
        {
          "id": 1,
          "type": "method",
          "library": "String",
          "method": "concat",
          "args": [
            null,
            "LAN-VR"
          ],
          "view": {
            "row": 1,
            "col": 2
          }
        },
        {
          "id": 2,
          "type": "assign",
          "from": {
            "location": "incoming",
            "name": "orgName",
            "ptr": ""
          },
          "to": {
            "location": "method",
            "name": 1,
            "ptr": "/args/0/value"
          }
        },
        {
          "id": 3,
          "type": "assign",
          "from": {
            "location": "method",
            "name": 1,
            "ptr": "/return"
          },
          "to": {
            "location": "outgoing",
            "name": "vrfArray",
            "ptr": "/name"
          }
        },
        {
          "id": 4,
          "type": "assign",
          "from": {
            "location": "incoming",
            "name": "id",
            "ptr": ""
          },
          "to": {
            "location": "outgoing",
            "name": "vrfArray",
            "ptr": "/id"
          }
        },
        {
          "id": 5,
          "type": "declaration",
          "library": "String",
          "method": "new String",
          "args": [
            null
          ],
          "view": {
            "row": 2,
            "col": 2
          }
        },
        {
          "id": 6,
          "type": "assign",
          "from": {
            "location": "declaration",
            "name": 5,
            "ptr": "/return"
          },
          "to": {
            "location": "outgoing",
            "name": "vrfArray",
            "ptr": "/description"
          }
        },
        {
          "id": 7,
          "type": "assign",
          "from": {
            "location": "incoming",
            "name": "enableVPN",
            "ptr": ""
          },
          "to": {
            "location": "outgoing",
            "name": "vrfArray",
            "ptr": "/enableVPN"
          }
        },
        {
          "id": 8,
          "type": "declaration",
          "library": "String",
          "method": "new String",
          "args": [
            "edit"
          ],
          "view": {
            "row": 2,
            "col": 3
          }
        },
        {
          "id": 9,
          "type": "assign",
          "from": {
            "location": "declaration",
            "name": 8,
            "ptr": "/return"
          },
          "to": {
            "location": "outgoing",
            "name": "vrfArray",
            "ptr": "/mode"
          }
        }
      ],
      "view": {
        "col": 3,
        "row": 4
      },
      "id": "buildVrfObj",
      "comments": []
    }
  ],
  "comments": [],
  "view": {
    "col": 2,
    "row": 9
  },
  "created": "2021-03-19T18:44:26.310Z",
  "createdBy": {
    "_id": "5feb7ed952f96642216a7348",
    "provenance": "local_aaa",
    "username": "admin@pronghorn"
  },
  "lastUpdated": "2021-03-19T20:06:47.341Z",
  "lastUpdatedBy": {
    "_id": "5feb7ed952f96642216a7348",
    "provenance": "local_aaa",
    "username": "admin@pronghorn"
  },
  "version": "3.13.0"
}