{
  "metadata": {
    "name": "@itentialopensource/versa-check-organization",
    "version": "0.0.10",
    "description": "[Deprecated] Versa Check Organization",
    "license": "Apache-2.0",
    "repository": {
      "type": "gitlab",
      "hostname": "gitlab.com",
      "path": "itentialopensource/pre-built-automations"
    },
    "keywords": [
      "Itential",
      "IAP",
      "artifacts",
      "Versa Networks",
      "Versa",
      "Versa Director"
    ],
    "author": "Itential Artifacts",
    "IAPDependencies": {
      "@itential/app-workflow_engine": "",
      "@itentialopensource/adapter-versa_director": ""
    },
    "gitlabId": 25000957
  },
  "manifest": {
    "bundleName": "Versa Check Organization",
    "fingerprint": "6047a682c110b000c44ad5c0",
    "createdEpoch": "1615308418362",
    "artifacts": [
      {
        "id": "Versa Check Organization",
        "name": "Versa Check Organization",
        "type": "workflow",
        "location": "/bundles/workflows/Versa Check Organization.json",
        "properties": {
          "entryPoint": false
        }
      }
    ]
  },
  "bundles": [
    {
      "type": "workflow",
      "data": {
        "name": "Versa Check Organization",
        "tasks": {
          "1830": {
            "name": "newVariable",
            "canvasName": "newVariable",
            "summary": "Create a Job Variable",
            "description": "Create a new Job variable by Job ID and assign it a value.",
            "location": "Application",
            "locationType": null,
            "app": "WorkFlowEngine",
            "type": "operation",
            "displayName": "WorkFlowEngine",
            "variables": {
              "incoming": {
                "name": "orgNameExists",
                "value": "error"
              },
              "outgoing": {
                "value": null
              }
            },
            "deprecated": false,
            "matched": [
              {
                "key": "canvasName",
                "highlightString": "<span class='highlight-string'>newVar</span>iable"
              }
            ],
            "groups": [],
            "x": 0.07549019607843137,
            "y": 0.8703427719821163
          },
          "8114": {
            "name": "evaluation",
            "canvasName": "evaluation",
            "summary": "Evaluation Organization Name",
            "description": "Run an evaluation to check organization name",
            "location": "Application",
            "locationType": null,
            "app": "WorkFlowEngine",
            "type": "operation",
            "displayName": "WorkFlowEngine",
            "variables": {
              "incoming": {
                "all_true_flag": false,
                "evaluation_groups": [
                  {
                    "all_true_flag": false,
                    "evaluations": [
                      {
                        "query": "",
                        "operand_1": {
                          "variable": "result",
                          "task": "6a5"
                        },
                        "operator": "contains",
                        "operand_2": {
                          "variable": true,
                          "task": "static"
                        }
                      }
                    ]
                  }
                ]
              },
              "outgoing": {
                "return_value": null
              }
            },
            "deprecated": false,
            "matched": [
              {
                "key": "canvasName",
                "highlightString": "<span class='highlight-string'>eval</span>uation"
              },
              {
                "key": "summary",
                "highlightString": "Run <span class='highlight-string'>Eval</span>uation Task"
              },
              {
                "key": "description",
                "highlightString": "Run an <span class='highlight-string'>eval</span>uation"
              }
            ],
            "groups": [],
            "x": 0.6105354058721935,
            "y": 0.5058479532163743
          },
          "workflow_start": {
            "name": "workflow_start",
            "groups": [],
            "x": -0.3229706390328152,
            "y": 0.5029239766081871
          },
          "workflow_end": {
            "name": "workflow_end",
            "groups": [],
            "x": 1.0323529411764707,
            "y": 0.8718330849478391
          },
          "ceda": {
            "name": "updateJobDescription",
            "canvasName": "updateJobDescription",
            "summary": "Update Job Description",
            "description": "Overwrite the job description with a new one",
            "location": "Application",
            "locationType": null,
            "app": "WorkFlowEngine",
            "type": "operation",
            "displayName": "WorkFlowEngine",
            "variables": {
              "incoming": {
                "description": "Check Versa Organization"
              },
              "outgoing": {
                "description": null
              },
              "error": ""
            },
            "deprecated": false,
            "matched": [
              {
                "key": "canvasName",
                "highlightString": "update<span class='highlight-string'>JobDesc</span>ription"
              }
            ],
            "groups": [],
            "x": -0.12694300518134716,
            "y": 0.5058479532163743,
            "scheduled": false
          },
          "990c": {
            "name": "newVariable",
            "canvasName": "newVariable",
            "summary": "Create a Job Variable",
            "description": "Create a new Job variable by Job ID and assign it a value.",
            "location": "Application",
            "locationType": null,
            "app": "WorkFlowEngine",
            "type": "operation",
            "displayName": "WorkFlowEngine",
            "variables": {
              "incoming": {
                "name": "orgNameExists",
                "value": false
              },
              "outgoing": {
                "value": null
              }
            },
            "deprecated": false,
            "matched": [
              {
                "key": "canvasName",
                "highlightString": "<span class='highlight-string'>newVar</span>iable"
              }
            ],
            "groups": [],
            "x": 0.8343137254901961,
            "y": 0.27123695976154993
          },
          "bb19": {
            "name": "newVariable",
            "canvasName": "newVariable",
            "summary": "Create a Job Variable",
            "description": "Create a new Job variable by Job ID and assign it a value.",
            "location": "Application",
            "locationType": null,
            "app": "WorkFlowEngine",
            "type": "operation",
            "displayName": "WorkFlowEngine",
            "variables": {
              "incoming": {
                "name": "orgNameExists",
                "value": true
              },
              "outgoing": {
                "value": null
              }
            },
            "deprecated": false,
            "matched": [
              {
                "key": "canvasName",
                "highlightString": "<span class='highlight-string'>newVar</span>iable"
              }
            ],
            "groups": [],
            "x": 0.8372549019607843,
            "y": 0.7332339791356185
          },
          "74f": {
            "name": "query",
            "canvasName": "query",
            "summary": "Query List of Names",
            "description": "Query list of all organization names",
            "location": "Application",
            "locationType": null,
            "app": "WorkFlowEngine",
            "type": "operation",
            "displayName": "WorkFlowEngine",
            "variables": {
              "incoming": {
                "pass_on_null": false,
                "query": "response.organizations[*name]",
                "obj": "$var.5f28.result"
              },
              "outgoing": {
                "return_data": null
              },
              "error": ""
            },
            "deprecated": false,
            "matched": [
              {
                "key": "canvasName",
                "highlightString": "<span class='highlight-string'>query</span>"
              },
              {
                "key": "summary",
                "highlightString": "<span class='highlight-string'>Query</span> Data Using 'json-query' Format"
              },
              {
                "key": "description",
                "highlightString": "<span class='highlight-string'>Query</span> data using a dot/bracket notation string and a matching key/value pair."
              }
            ],
            "groups": [],
            "x": 0.26770293609671847,
            "y": 0.5014619883040936,
            "scheduled": false
          },
          "6a5": {
            "name": "arrayIncludes",
            "canvasName": "includes",
            "summary": "Check Organization in Versa",
            "description": "Check if an organization in versa response",
            "location": "Application",
            "locationType": null,
            "app": "WorkFlowEngine",
            "type": "automatic",
            "displayName": "Array",
            "variables": {
              "incoming": {
                "arr": "$var.74f.return_data",
                "searchElement": "$var.job.organizationName",
                "fromIndex": ""
              },
              "outgoing": {
                "result": null
              },
              "error": ""
            },
            "deprecated": false,
            "matched": [
              {
                "key": "canvasName",
                "highlightString": "<span class='highlight-string'>includes</span>"
              },
              {
                "key": "description",
                "highlightString": "Determines whether an array <span class='highlight-string'>includes</span> a certain element, returning true or false as appropriate."
              }
            ],
            "groups": [],
            "actor": "Pronghorn",
            "x": 0.45509499136442144,
            "y": 0.5043859649122807,
            "scheduled": false
          },
          "5f28": {
            "name": "getOrganizations",
            "canvasName": "getOrganizations",
            "summary": "Get organizations",
            "description": "Finds all the organizations",
            "location": "Adapter",
            "locationType": "VersaDirector",
            "app": "VersaDirector",
            "type": "automatic",
            "displayName": "VersaDirector",
            "variables": {
              "incoming": {
                "deep": false,
                "filters": "",
                "limit": "",
                "offset": 0,
                "adapter_id": "$var.job.adapter_id"
              },
              "outgoing": {
                "result": null
              },
              "error": ""
            },
            "deprecated": false,
            "matched": [
              {
                "key": "canvasName",
                "highlightString": "<span class='highlight-string'>getOrg</span>anizations"
              }
            ],
            "groups": [],
            "actor": "Pronghorn",
            "x": 0.08798283261802575,
            "y": 0.5050761421319797,
            "scheduled": false
          }
        },
        "transitions": {
          "1830": {
            "workflow_end": {
              "type": "standard",
              "state": "success"
            }
          },
          "8114": {
            "bb19": {
              "type": "standard",
              "state": "success"
            },
            "990c": {
              "type": "standard",
              "state": "failure"
            }
          },
          "workflow_start": {
            "ceda": {
              "type": "standard",
              "state": "success"
            }
          },
          "workflow_end": {},
          "ceda": {
            "5f28": {
              "type": "standard",
              "state": "success"
            }
          },
          "990c": {
            "workflow_end": {
              "type": "standard",
              "state": "success"
            }
          },
          "bb19": {
            "workflow_end": {
              "type": "standard",
              "state": "success"
            }
          },
          "74f": {
            "6a5": {
              "type": "standard",
              "state": "success"
            }
          },
          "6a5": {
            "8114": {
              "type": "standard",
              "state": "success"
            }
          },
          "5f28": {
            "1830": {
              "type": "standard",
              "state": "error"
            },
            "74f": {
              "type": "standard",
              "state": "success"
            }
          }
        },
        "font_size": 12,
        "created": "2020-09-21T16:22:32.384Z",
        "created_by": {
          "provenance": "Local AAA",
          "username": "admin@pronghorn",
          "firstname": "admin",
          "inactive": true,
          "email": ""
        },
        "createdVersion": "5.10.4-2020.1.28.0",
        "last_updated": "2021-03-09T16:16:09.172Z",
        "last_updated_by": {
          "provenance": "local_aaa",
          "username": "admin@pronghorn",
          "firstname": "admin",
          "inactive": false,
          "email": "rahul.chakraborty@itential.com"
        },
        "lastUpdatedVersion": "5.29.14-2020.2.9",
        "type": "automation",
        "description": null,
        "canvasVersion": 1,
        "inputSchema": {
          "type": "object",
          "properties": {
            "organizationName": {
              "type": [
                "array",
                "string",
                "boolean",
                "integer",
                "number",
                "object"
              ],
              "title": "searchElement",
              "examples": [
                "Device3"
              ]
            },
            "adapter_id": {
              "type": [
                "array",
                "boolean",
                "null",
                "number",
                "object",
                "string"
              ]
            }
          },
          "required": [
            "organizationName",
            "adapter_id"
          ]
        },
        "outputSchema": {
          "type": "object",
          "properties": {
            "organizationName": {
              "type": [
                "array",
                "string",
                "boolean",
                "integer",
                "number",
                "object"
              ],
              "title": "searchElement",
              "examples": [
                "Device3"
              ]
            },
            "adapter_id": {
              "type": [
                "array",
                "boolean",
                "null",
                "number",
                "object",
                "string"
              ]
            },
            "_id": {
              "type": "string",
              "pattern": "^[0-9a-f]{24}$"
            },
            "initiator": {
              "type": "string"
            },
            "orgNameExists": {
              "anyOf": [
                {
                  "type": "string"
                },
                {
                  "type": "boolean"
                }
              ]
            }
          }
        },
        "tags": [],
        "groups": []
      }
    }
  ],
  "readme": "## _Deprecation Notice_\nThis Pre-Built has been deprecated as of 09-01-2024 and will be end of life on 09-01-2025. The capabilities of this Pre-Built have been replaced by the [Versa - REST](https://gitlab.com/itentialopensource/pre-built-automations/versa-rest)\n\n<!-- This is a comment in md (Markdown) format, it will not be visible to the end user -->\n\n<!-- Update the below line with your Pre-Built name -->\n# Versa Check Organization\n\n<!-- Leave TOC intact unless you've added or removed headers -->\n## Table of Contents\n\n* [Overview](#overview)\n* [Requirements](#requirements)\n* [Features](#features)\n* [How to Install](#how-to-install)\n* [How to Run](#how-to-run)\n* [Additional Information](#additional-information)\n\n## Overview\n\nThis pre-built is used to check if the organization name provided is present in the Versa Director.\n<!-- Write a few sentences about the Pre-Built and explain the use case(s) -->\n<!-- Avoid using the word Artifact. Please use Pre-Built, Pre-Built Transformation or Pre-Built Automation -->\n<!-- Ex.: The Migration Wizard enables IAP users to conveniently move their automation use cases between different IAP environments -->\n<!-- (e.g. from Dev to Pre-Production or from Lab to Production). -->\n\n<!-- Workflow(s) Image Placeholder - TO BE ADDED DIRECTLY TO GitLab -->\n<!-- REPLACE COMMENT BELOW WITH IMAGE OF YOUR MAIN WORKFLOW -->\n<!--\n\n-->\n<!-- ADD ESTIMATED RUN TIME HERE -->\n<!-- e.g. Estimated Run Time: 34 min. -->\n_Estimated Run Time_: 1 minute\n\n## Requirements\n\nThis Pre-Built requires the following:\n\n<!-- Unordered list highlighting the requirements of the Pre-Built -->\n<!-- EXAMPLE -->\n<!-- * cisco ios device -->\n<!-- * Ansible or NSO (with F5 NED) * -->\n* Itential Automation Platform\n  * `^2022.1`\n* A running instance of the Itential OpenSource Versa Director adapter, which can be installed from [here](https://gitlab.com/itentialopensource/adapters/controller-orchestrator/adapter-versa_director).\n\n## Features\n\nThe main benefits and features of the Pre-Built are outlined below.\n\nEvery Itential Pre-built is designed to optimize network performance and configuration by focusing on reliability, flexibility and coordination of network changes with applications and IT processes. As the network evolves, Pre-builts allow customers to focus on effective management and compliance to minimize risks of disruption and outage that can negatively impact quality of service.\n\n<!-- Unordered list highlighting the most exciting features of the Pre-Built -->\n<!-- EXAMPLE -->\n<!-- * Automatically checks for device type -->\n<!-- * Displays dry-run to user (asking for confirmation) prior to pushing config to the device -->\n<!-- * Verifies downloaded file integrity (using md5), will try to download again if failed -->\n\n\n## How to Install\n\n* Verify you are running a supported version of the Itential Automation Platform (IAP) as listed above in the [Requirements](#requirements) section in order to install the Pre-Built. \n* The Pre-Built can be installed from within App-Admin_Essential. Simply search for the name of your desired Pre-Built and click the install button (as shown below).\n\n<!-- OPTIONAL - Explain if external components are required outside of IAP -->\n<!-- Ex.: The Ansible roles required for this Pre-Built can be found in the repository located at https://gitlab.com/itentialopensource/pre-built-automations/hello-world -->\n\n## How to Run\n\nUse the following to run the Pre-Built:\n\nThe pre-built can be run as part of a parent job by including or calling the workflow with fewer changes. \n\nThe required values to be passed on to the pre-built are:\n- Adapter ID (The id from the configuration of the Versa Adapter instance in IAP)\n- Organization Name (The name of the organization to be checked in the Versa Director)\n\n**Tasks**\n\n- The getOrganizations task takes the adapter id and gets the details of all the organizations in the Versa director package. After further querying the names of the organizations from the response as shown below, the workflow then checks if the provided organization name input is present in the list of organization names obtained from the getOrganizations task and returns a boolean value.\n\n## Additional Information\n\nPlease use your Itential Customer Success account if you need support when using this Pre-Built.\n"
}