{
  "name": "SD-WAN using Velocloud Orchestration",
  "tasks": {
    "1988": {
      "name": "deepmerge",
      "summary": "Edge Vars",
      "description": "deep merge for edge vars",
      "location": "Application",
      "locationType": null,
      "app": "WorkFlowEngine",
      "displayName": "WorkFlowEngine",
      "type": "operation",
      "variables": {
        "incoming": {
          "data_to_merge": [
            {
              "key": "",
              "value": {
                "task": "82ec",
                "variable": "current_item"
              }
            },
            {
              "key": "",
              "value": {
                "task": "92d",
                "variable": "merged_object"
              }
            }
          ]
        },
        "outgoing": {
          "merged_object": null
        }
      },
      "deprecated": false,
      "matched": [
        {
          "key": "name",
          "highlightString": "<span class='highlight-string'>deep</span>merge"
        },
        {
          "key": "summary",
          "highlightString": "<span class='highlight-string'>Deep</span> Merge Data"
        }
      ],
      "groups": [],
      "x": 0.5729885057471265,
      "y": 0.6979166666666666
    },
    "4501": {
      "name": "query",
      "summary": "Query Configuration ID",
      "description": "query the configuration ID",
      "location": "Application",
      "locationType": null,
      "app": "WorkFlowEngine",
      "displayName": "WorkFlowEngine",
      "type": "operation",
      "variables": {
        "incoming": {
          "pass_on_null": false,
          "query": "response[0].id",
          "obj": "$var.d548.result"
        },
        "outgoing": {
          "return_data": null
        },
        "error": ""
      },
      "deprecated": false,
      "matched": [
        {
          "key": "name",
          "highlightString": "<span class='highlight-string'>query</span>"
        },
        {
          "key": "summary",
          "highlightString": "<span class='highlight-string'>Query</span> Data Using 'json-query' Format"
        },
        {
          "key": "description",
          "highlightString": "<span class='highlight-string'>Query</span> data using a dot/bracket notation string and a matching key/value pair."
        }
      ],
      "groups": [],
      "x": 0.4235632183908046,
      "y": 0.3346354166666667,
      "scheduled": false
    },
    "5038": {
      "name": "merge",
      "summary": "Enterprise ID JSON",
      "description": "Merge data into a single object for enterprise ID",
      "location": "Application",
      "locationType": null,
      "app": "WorkFlowEngine",
      "displayName": "WorkFlowEngine",
      "type": "operation",
      "variables": {
        "incoming": {
          "data_to_merge": [
            {
              "key": "enterpriseId",
              "value": {
                "task": "ae0",
                "variable": "return_data"
              }
            }
          ]
        },
        "outgoing": {
          "merged_object": null
        }
      },
      "deprecated": false,
      "matched": [
        {
          "key": "name",
          "highlightString": "<span class='highlight-string'>merge</span>"
        },
        {
          "key": "summary",
          "highlightString": "<span class='highlight-string'>Merge</span> Data"
        },
        {
          "key": "description",
          "highlightString": "<span class='highlight-string'>Merge</span> data into a single object"
        }
      ],
      "groups": [],
      "x": 0.3442028985507246,
      "y": 0.49801324503311256
    },
    "5516": {
      "name": "enterpriseInsertEnterprise",
      "canvasName": "enterpriseInsertEnterprise",
      "summary": "Create enterprise",
      "description": "Creates a new enterprise, which is owned by the operator.\n\nPrivileges required:\n\n`CREATE` `ENTERPRISE`",
      "location": "Adapter",
      "locationType": "VelocloudOrchestrator",
      "app": "VelocloudOrchestrator",
      "type": "automatic",
      "displayName": "VelocloudOrchestrator",
      "variables": {
        "incoming": {
          "body": "$var.e758.output",
          "adapter_id": "VCO"
        },
        "outgoing": {
          "result": null
        },
        "error": ""
      },
      "deprecated": false,
      "matched": [
        {
          "key": "canvasName",
          "highlightString": "enterprise<span class='highlight-string'>InsertEnterprise</span>"
        }
      ],
      "groups": [],
      "actor": "Pronghorn",
      "x": 0.1619718309859155,
      "y": 0.5130208333333334,
      "scheduled": false
    },
    "5850": {
      "name": "query",
      "summary": "Query Edge List",
      "description": "query the list of edges to provision",
      "location": "Application",
      "locationType": null,
      "app": "WorkFlowEngine",
      "displayName": "WorkFlowEngine",
      "type": "operation",
      "variables": {
        "incoming": {
          "pass_on_null": false,
          "query": "edgeList",
          "obj": "$var.job.formData"
        },
        "outgoing": {
          "return_data": null
        },
        "error": ""
      },
      "deprecated": false,
      "matched": [
        {
          "key": "name",
          "highlightString": "<span class='highlight-string'>query</span>"
        },
        {
          "key": "summary",
          "highlightString": "<span class='highlight-string'>Query</span> Data Using 'json-query' Format"
        },
        {
          "key": "description",
          "highlightString": "<span class='highlight-string'>Query</span> data using a dot/bracket notation string and a matching key/value pair."
        }
      ],
      "groups": [],
      "x": 0.5666666666666667,
      "y": 0.3294270833333333,
      "scheduled": false
    },
    "workflow_start": {
      "name": "workflow_start",
      "groups": [],
      "x": -0.6557471264367816,
      "y": 0.5572916666666666
    },
    "workflow_end": {
      "name": "workflow_end",
      "groups": [],
      "x": 0.7505747126436781,
      "y": 0.1796875
    },
    "ae0": {
      "name": "query",
      "summary": "Query Enterprise ID",
      "description": "query the enterprise ID",
      "location": "Application",
      "locationType": null,
      "app": "WorkFlowEngine",
      "displayName": "WorkFlowEngine",
      "type": "operation",
      "variables": {
        "incoming": {
          "pass_on_null": false,
          "query": "response.id",
          "obj": "$var.5516.result"
        },
        "outgoing": {
          "return_data": null
        },
        "error": ""
      },
      "deprecated": false,
      "matched": [
        {
          "key": "name",
          "highlightString": "<span class='highlight-string'>query</span>"
        },
        {
          "key": "summary",
          "highlightString": "<span class='highlight-string'>Query</span> Data Using 'json-query' Format"
        },
        {
          "key": "description",
          "highlightString": "<span class='highlight-string'>Query</span> data using a dot/bracket notation string and a matching key/value pair."
        }
      ],
      "groups": [],
      "x": 0.28043478260869564,
      "y": 0.49933774834437084,
      "scheduled": false
    },
    "4e7c": {
      "name": "makeData",
      "summary": "Provision Edge Payload",
      "description": "Make Data for the provision edge payload",
      "location": "Application",
      "locationType": null,
      "app": "WorkFlowEngine",
      "displayName": "Tools",
      "type": "automatic",
      "variables": {
        "incoming": {
          "input": "{\n  \"enterpriseId\": <!enterpriseId!>,\n  \"configurationId\": <!configurationId!>,\n  \"name\": \"<!edgeName!>\",\n  \"serialNumber\": null,\n  \"modelNumber\": \"<!modelNumber!>\",\n  \"description\": \"<!description!>\",\n  \"site\": {\n    \"city\": \"<!city!>\",\n    \"contactEmail\": \"<!contactEmail!>\",\n    \"contactMobile\": \"<!contactMobile!>\",\n    \"contactName\": \"<!contactName!>\",\n    \"contactPhone\": \"<!contactPhone!>\",\n    \"country\": \"<!country!>\",\n    \"lat\": <!lat!>,\n    \"lon\": <!lon!>,\n    \"name\": \"<!siteName!>\",\n    \"postalCode\": \"<!postalCode!>\",\n    \"state\": \"<!state!>\",\n    \"streetAddress\": \"<!streetAddress!>\",\n    \"streetAddress2\": \"null\",\n    \"timezone\": null,\n    \"locale\": null,\n    \"shippingSameAsLocation\": 1,\n    \"shippingContactName\": null,\n    \"shippingAddress\": null,\n    \"shippingAddress2\": null,\n    \"shippingCity\": null,\n    \"shippingState\": null,\n    \"shippingPostalCode\": null,\n    \"shippingCountry\": null,\n    \"modified\": null\n  },\n  \"haEnabled\": true,\n  \"generateCertificate\": false\n}",
          "outputType": "json",
          "variables": "$var.1988.merged_object"
        },
        "outgoing": {
          "output": null
        },
        "error": ""
      },
      "deprecated": false,
      "matched": [
        {
          "key": "name",
          "highlightString": "<span class='highlight-string'>makeDat</span>a"
        }
      ],
      "groups": [],
      "actor": "Pronghorn",
      "x": 0.5666666666666667,
      "y": 0.8736979166666666,
      "scheduled": false
    },
    "92d": {
      "name": "merge",
      "summary": "Enterprise Vars",
      "description": "Merge data into a single object for configuration ID and enterpriseId",
      "location": "Application",
      "locationType": null,
      "app": "WorkFlowEngine",
      "displayName": "WorkFlowEngine",
      "type": "operation",
      "variables": {
        "incoming": {
          "data_to_merge": [
            {
              "key": "configurationId",
              "value": {
                "task": "4501",
                "variable": "return_data"
              }
            },
            {
              "key": "enterpriseId",
              "value": {
                "task": "ae0",
                "variable": "return_data"
              }
            }
          ]
        },
        "outgoing": {
          "merged_object": null
        }
      },
      "deprecated": false,
      "matched": [
        {
          "key": "name",
          "highlightString": "<span class='highlight-string'>merge</span>"
        },
        {
          "key": "summary",
          "highlightString": "<span class='highlight-string'>Merge</span> Data"
        },
        {
          "key": "description",
          "highlightString": "<span class='highlight-string'>Merge</span> data into a single object"
        }
      ],
      "groups": [],
      "x": 0.496551724137931,
      "y": 0.3333333333333333
    },
    "d28e": {
      "name": "query",
      "summary": "Query Activation Key",
      "description": "Query activation key for new edge",
      "location": "Application",
      "locationType": null,
      "app": "WorkFlowEngine",
      "displayName": "WorkFlowEngine",
      "type": "operation",
      "variables": {
        "incoming": {
          "pass_on_null": false,
          "query": "response.activationKey",
          "obj": "$var.cf91.result"
        },
        "outgoing": {
          "return_data": null
        },
        "error": ""
      },
      "deprecated": false,
      "matched": [
        {
          "key": "name",
          "highlightString": "<span class='highlight-string'>query</span>"
        },
        {
          "key": "summary",
          "highlightString": "<span class='highlight-string'>Query</span> Data Using 'json-query' Format"
        },
        {
          "key": "description",
          "highlightString": "<span class='highlight-string'>Query</span> data using a dot/bracket notation string and a matching key/value pair."
        }
      ],
      "groups": [],
      "x": 0.6718390804597701,
      "y": 1.0325520833333333,
      "scheduled": false
    },
    "9f2d": {
      "name": "evaluation",
      "summary": "Eval Site Does Not Exist",
      "description": "Eval to precheck that the site does not exist",
      "location": "Application",
      "locationType": null,
      "app": "WorkFlowEngine",
      "displayName": "WorkFlowEngine",
      "type": "operation",
      "variables": {
        "incoming": {
          "all_true_flag": false,
          "evaluation_groups": [
            {
              "all_true_flag": false,
              "evaluations": [
                {
                  "query": "",
                  "operand_1": {
                    "variable": "return_data",
                    "task": "2ffe"
                  },
                  "operator": "!contains",
                  "operand_2": {
                    "variable": "id",
                    "task": "static"
                  }
                }
              ]
            }
          ]
        },
        "outgoing": {
          "return_value": null
        }
      },
      "deprecated": false,
      "matched": [
        {
          "key": "name",
          "highlightString": "<span class='highlight-string'>eval</span>uation"
        },
        {
          "key": "summary",
          "highlightString": "Run <span class='highlight-string'>Eval</span>uation Task"
        },
        {
          "key": "description",
          "highlightString": "Run an <span class='highlight-string'>eval</span>uation"
        }
      ],
      "groups": [],
      "x": 0.02753623188405797,
      "y": 0.49403973509933774
    },
    "85fa": {
      "name": "makeData",
      "summary": "Name Validation Payload",
      "description": "Make Data for name validation Payload",
      "location": "Application",
      "locationType": null,
      "app": "WorkFlowEngine",
      "displayName": "Tools",
      "type": "automatic",
      "variables": {
        "incoming": {
          "input": "response[name=<!enterpriseName!>]",
          "outputType": "string",
          "variables": "$var.2bc5.return_data"
        },
        "outgoing": {
          "output": null
        },
        "error": ""
      },
      "deprecated": false,
      "matched": [
        {
          "key": "name",
          "highlightString": "<span class='highlight-string'>makeDa</span>ta"
        }
      ],
      "groups": [],
      "actor": "Pronghorn",
      "x": -0.28563218390804596,
      "y": 0.3763020833333333,
      "scheduled": false
    },
    "2ffe": {
      "name": "query",
      "summary": "Query Name Validation",
      "description": "Query for name validation",
      "location": "Application",
      "locationType": null,
      "app": "WorkFlowEngine",
      "displayName": "WorkFlowEngine",
      "type": "operation",
      "variables": {
        "incoming": {
          "pass_on_null": false,
          "query": "$var.85fa.output",
          "obj": "$var.38b1.result"
        },
        "outgoing": {
          "return_data": null
        },
        "error": ""
      },
      "deprecated": false,
      "matched": [
        {
          "key": "name",
          "highlightString": "<span class='highlight-string'>query</span>"
        },
        {
          "key": "summary",
          "highlightString": "<span class='highlight-string'>Query</span> Data Using 'json-query' Format"
        },
        {
          "key": "description",
          "highlightString": "<span class='highlight-string'>Query</span> data using a dot/bracket notation string and a matching key/value pair."
        }
      ],
      "groups": [],
      "x": -0.030434782608695653,
      "y": 0.49403973509933774,
      "scheduled": false
    },
    "47fe": {
      "name": "ViewData",
      "summary": "Enterprise Already Exists",
      "description": "Failure on duplicate enterprise",
      "location": "Application",
      "app": "WorkFlowEngine",
      "displayName": "Tools",
      "type": "manual",
      "variables": {
        "incoming": {
          "header": "Enterprise Already Exists",
          "message": "",
          "body": "The enterprise that you are trying to create already exists.",
          "variables": {},
          "btn_success": "Abort Job",
          "btn_failure": ""
        },
        "outgoing": {},
        "error": ""
      },
      "view": "/workflow_engine/task/ViewData",
      "deprecated": false,
      "matched": [
        {
          "key": "name",
          "highlightString": "<span class='highlight-string'>ViewDa</span>ta"
        }
      ],
      "groups": [
        {
          "provenance": "Local AAA",
          "name": "pronghorn_admin",
          "description": "pronghorn_admin"
        }
      ],
      "x": 0.03985507246376811,
      "y": 0.3125827814569536,
      "scheduled": false
    },
    "6eb4": {
      "name": "makeData",
      "summary": "Get Networks Payload",
      "description": "Make Data for get networks",
      "location": "Application",
      "locationType": null,
      "app": "WorkFlowEngine",
      "displayName": "Tools",
      "type": "automatic",
      "variables": {
        "incoming": {
          "input": "{\"networkId\":<!networkId!>}",
          "outputType": "json",
          "variables": "$var.2bc5.return_data"
        },
        "outgoing": {
          "output": null
        },
        "error": ""
      },
      "deprecated": false,
      "matched": [
        {
          "key": "name",
          "highlightString": "<span class='highlight-string'>makeDa</span>ta"
        }
      ],
      "groups": [],
      "actor": "Pronghorn",
      "x": -0.26839080459770115,
      "y": 0.5729166666666666,
      "scheduled": false
    },
    "e758": {
      "name": "makeData",
      "summary": "Insert Enterprise Site Payload",
      "description": "Make Data for insert enterprise site",
      "location": "Application",
      "locationType": null,
      "app": "WorkFlowEngine",
      "displayName": "Tools",
      "type": "automatic",
      "variables": {
        "incoming": {
          "input": "{\n  \"user\": {\n    \"username\": \"<!username!>\",\n    \"password\": \"<!password!>\",\n    \"email\": \"<!email!>\",\n    \"password2\": \"<!password!>\"\n  },\n  \"enableEnterpriseDelegationToOperator\": true,\n  \"enableEnterpriseUserManagementDelegationToOperator\": true,\n  \"licenses\": {\n    \"ids\": []\n  },\n  \"gatewayPoolId\": <!gatewayPoolId!>,\n  \"name\": \"<!enterpriseName!>\",\n  \"accountNumber\": \"<!accountNumber!>\",\n  \"configurationId\": <!configurationId!>\n}",
          "outputType": "json",
          "variables": "$var.2bc5.return_data"
        },
        "outgoing": {
          "output": null
        },
        "error": ""
      },
      "deprecated": false,
      "matched": [
        {
          "key": "name",
          "highlightString": "<span class='highlight-string'>makeDa</span>ta"
        }
      ],
      "groups": [],
      "actor": "Pronghorn",
      "x": -0.25632183908045975,
      "y": 0.7604166666666666,
      "scheduled": false
    },
    "82ec": {
      "name": "forEach",
      "summary": "Loop Edges",
      "description": "Iterate over each item in an array to provision edges",
      "location": "Application",
      "locationType": null,
      "app": "WorkFlowEngine",
      "displayName": "WorkFlowEngine",
      "type": "operation",
      "variables": {
        "incoming": {
          "data_array": "$var.5850.return_data"
        },
        "outgoing": {
          "current_item": null
        },
        "error": ""
      },
      "deprecated": false,
      "matched": [
        {
          "key": "name",
          "highlightString": "<span class='highlight-string'>for</span><span class='highlight-string'>Each</span>"
        },
        {
          "key": "summary",
          "highlightString": "<span class='highlight-string'>For</span> <span class='highlight-string'>Each</span> Loop"
        },
        {
          "key": "description",
          "highlightString": "Iterate over <span class='highlight-string'>each</span> item in an array"
        }
      ],
      "groups": [],
      "x": 0.5758620689655173,
      "y": 0.5143229166666666,
      "scheduled": false
    },
    "38b1": {
      "name": "networkGetNetworkEnterprises",
      "canvasName": "networkGetNetworkEnterprises",
      "summary": "Get enterprises on network",
      "description": "Gets all enterprises existing on a network, optionally including all Edges or Edge counts. The `edgeConfigUpdate` \"with\" option may also be passed to check whether the application of configuration updates to Edges is enabled for each enterprise.\n\nPrivileges required:\n\n`READ` `ENTERPRISE`",
      "location": "Adapter",
      "locationType": "VelocloudOrchestrator",
      "app": "VelocloudOrchestrator",
      "type": "automatic",
      "displayName": "VelocloudOrchestrator",
      "variables": {
        "incoming": {
          "body": "$var.6eb4.output",
          "adapter_id": "VCO"
        },
        "outgoing": {
          "result": null
        },
        "error": ""
      },
      "deprecated": false,
      "matched": [
        {
          "key": "canvasName",
          "highlightString": "network<span class='highlight-string'>GetNetwork</span>Enterprises"
        }
      ],
      "groups": [],
      "actor": "Pronghorn",
      "x": -0.12126436781609196,
      "y": 0.56640625,
      "scheduled": false
    },
    "d548": {
      "name": "enterpriseGetEnterpriseConfigurations",
      "canvasName": "enterpriseGetEnterpriseConfigurations",
      "summary": "Get enterprise configuration profiles",
      "description": "Gets all configuration profiles, with optional Edge and/or module details, for the specified enterprise.\n\nPrivileges required:\n\n`READ` `ENTERPRISE_PROFILE`",
      "location": "Adapter",
      "locationType": "VelocloudOrchestrator",
      "app": "VelocloudOrchestrator",
      "type": "automatic",
      "displayName": "VelocloudOrchestrator",
      "variables": {
        "incoming": {
          "body": "$var.5038.merged_object",
          "adapter_id": "VCO"
        },
        "outgoing": {
          "result": null
        },
        "error": ""
      },
      "deprecated": false,
      "matched": [
        {
          "key": "canvasName",
          "highlightString": "enterpriseGet<span class='highlight-string'>EnterpriseConf</span>igurations"
        }
      ],
      "groups": [],
      "actor": "Pronghorn",
      "x": 0.4413793103448276,
      "y": 0.5169270833333334,
      "scheduled": false
    },
    "cf91": {
      "name": "edgeEdgeProvision",
      "canvasName": "edgeEdgeProvision",
      "summary": "Provision Edge",
      "description": "Provisions an Edge before activation.\n\nPrivileges required:\n\n`CREATE` `EDGE`",
      "location": "Adapter",
      "locationType": "VelocloudOrchestrator",
      "app": "VelocloudOrchestrator",
      "type": "automatic",
      "displayName": "VelocloudOrchestrator",
      "variables": {
        "incoming": {
          "body": "$var.4e7c.output",
          "adapter_id": "VCO"
        },
        "outgoing": {
          "result": null
        },
        "error": ""
      },
      "deprecated": false,
      "matched": [
        {
          "key": "canvasName",
          "highlightString": "<span class='highlight-string'>edgeEdgeProvision</span>"
        }
      ],
      "groups": [],
      "actor": "Pronghorn",
      "x": 0.6919540229885057,
      "y": 0.8815104166666666,
      "scheduled": false
    },
    "261a": {
      "name": "RenderJsonSchema",
      "canvasName": "RenderJsonSchema",
      "summary": "Render JSON Schema",
      "description": "Render JSON Schema",
      "location": "Application",
      "app": "JsonForms",
      "displayName": "JsonForms",
      "type": "manual",
      "variables": {
        "incoming": {
          "jsonSchema": {
            "title": "Velocloud Orchestration Order Form",
            "description": "An order form which will support to create an enterprise and multiple edges",
            "type": "object",
            "required": [],
            "properties": {
              "enterpriseInfo": {
                "title": "Enterprise Information",
                "type": "object",
                "properties": {
                  "enterpriseName": {
                    "type": "string",
                    "examples": [
                      "Itential, LLC"
                    ]
                  },
                  "accountNumber": {
                    "type": "string",
                    "examples": [
                      "12345678"
                    ]
                  },
                  "username": {
                    "type": "string",
                    "examples": [
                      "ItentialHQ"
                    ]
                  },
                  "password": {
                    "type": "string",
                    "examples": [
                      "SWKFYCP8Ma"
                    ]
                  },
                  "email": {
                    "type": "string",
                    "examples": [
                      "Itential, LLC"
                    ]
                  },
                  "gatewayPoolId": {
                    "type": "integer",
                    "examples": [
                      5
                    ]
                  },
                  "configurationId": {
                    "type": "integer",
                    "examples": [
                      109
                    ]
                  },
                  "networkId": {
                    "type": "integer",
                    "examples": [
                      1
                    ]
                  }
                },
                "required": []
              },
              "edgeList": {
                "title": "Edge Information",
                "type": "array",
                "items": {
                  "type": "object",
                  "properties": {
                    "edgeName": {
                      "type": "string",
                      "examples": [
                        "Edge1"
                      ]
                    },
                    "modelNumber": {
                      "type": "string",
                      "examples": [
                        "edge500"
                      ]
                    },
                    "description": {
                      "type": "string",
                      "examples": [
                        "new edge"
                      ]
                    },
                    "siteName": {
                      "type": "string",
                      "examples": [
                        "New Site"
                      ]
                    },
                    "contactName": {
                      "type": "string",
                      "examples": [
                        "Jane Smith"
                      ]
                    },
                    "contactEmail": {
                      "type": "string",
                      "examples": [
                        "janesmith@test.com"
                      ],
                      "format": "email"
                    },
                    "contactPhone": {
                      "type": "string",
                      "examples": [
                        "8005551213"
                      ]
                    },
                    "contactMobile": {
                      "type": "string",
                      "examples": [
                        "8005551213"
                      ]
                    },
                    "streetAddress": {
                      "type": "string",
                      "examples": [
                        "123 Test Site Street"
                      ]
                    },
                    "city": {
                      "type": "string",
                      "examples": [
                        "Las Vegas"
                      ]
                    },
                    "state": {
                      "type": "string",
                      "examples": [
                        "NV"
                      ]
                    },
                    "postalCode": {
                      "type": "string",
                      "examples": [
                        "12345"
                      ]
                    },
                    "country": {
                      "type": "string",
                      "examples": [
                        "US"
                      ]
                    },
                    "lat": {
                      "type": "number",
                      "examples": [
                        0
                      ]
                    },
                    "lon": {
                      "type": "number",
                      "examples": [
                        0
                      ]
                    }
                  },
                  "required": []
                }
              }
            }
          },
          "uiSchema": {},
          "bindingSchema": {},
          "validationSchema": {},
          "formData": {
            "enterpriseInfo": {
              "enterpriseName": "Itential, LLC",
              "accountNumber": "72119222",
              "username": "itentialLLC",
              "password": "123456789##Za",
              "email": "itentialServices@itential.com",
              "gatewayPoolId": 5,
              "configurationId": 109,
              "networkId": 1
            },
            "edgeList": [
              {
                "edgeName": "site-atl",
                "modelNumber": "edge6X0",
                "description": "edge 6x0 example",
                "siteName": "atl-office",
                "contactName": "engg1",
                "contactEmail": "aaa@itentail.com",
                "contactPhone": "2013332222",
                "streetAddress": "1350 Spring St NW",
                "city": "ATLANTA",
                "state": "GA",
                "postalCode": "30309",
                "country": "United States",
                "lat": 33.79157,
                "lon": -84.38951,
                "contactMobile": "2013332222"
              },
              {
                "edgeName": "site-nyc",
                "modelNumber": "edge1000qat",
                "description": "edge 2000 example",
                "siteName": "nyc-office",
                "contactName": "engg2",
                "contactEmail": "aaa@itentail.com",
                "contactPhone": "2013332222",
                "streetAddress": "20 W 34th St",
                "city": "New York",
                "state": "NY",
                "postalCode": "10001",
                "country": "United States",
                "lat": 40.74872,
                "lon": -73.98535,
                "contactMobile": "2013332222"
              },
              {
                "edgeName": "site-la",
                "modelNumber": "edge3X00",
                "description": "edge 3000 example",
                "siteName": "la-office",
                "contactName": "engg3",
                "contactEmail": "aaa@itentail.com",
                "contactPhone": "2013332222",
                "streetAddress": "Hollywood Sign",
                "city": "Los Angeles",
                "state": "CA",
                "postalCode": "90068",
                "country": "United States",
                "lat": 34.134113,
                "lon": -118.321548,
                "contactMobile": "2013332222"
              }
            ]
          }
        },
        "outgoing": {
          "export": "$var.job.formData"
        },
        "error": "",
        "decorators": []
      },
      "view": "/json-forms/task/RenderJsonSchema",
      "deprecated": false,
      "matched": [
        {
          "key": "displayName",
          "highlightString": "<span class='highlight-string'>Json</span>Forms"
        },
        {
          "key": "canvasName",
          "highlightString": "Render<span class='highlight-string'>Json</span>Schema"
        },
        {
          "key": "summary",
          "highlightString": "Render <span class='highlight-string'>JSON</span> Schema"
        },
        {
          "key": "description",
          "highlightString": "Render <span class='highlight-string'>JSON</span> Schema"
        }
      ],
      "groups": [],
      "x": -0.5350574712643679,
      "y": 0.5559895833333334,
      "scheduled": false
    },
    "2bc5": {
      "name": "query",
      "summary": "Query enterpriseInfo",
      "description": "Query enterpriseInfo",
      "location": "Application",
      "locationType": null,
      "app": "WorkFlowEngine",
      "displayName": "WorkFlowEngine",
      "type": "operation",
      "variables": {
        "incoming": {
          "pass_on_null": false,
          "query": "enterpriseInfo",
          "obj": "$var.job.formData"
        },
        "outgoing": {
          "return_data": null
        },
        "error": ""
      },
      "deprecated": false,
      "matched": [
        {
          "key": "name",
          "highlightString": "<span class='highlight-string'>query</span>"
        },
        {
          "key": "summary",
          "highlightString": "<span class='highlight-string'>Query</span> Data Using 'json-query' Format"
        },
        {
          "key": "description",
          "highlightString": "<span class='highlight-string'>Query</span> data using a dot/bracket notation string and a matching key/value pair."
        }
      ],
      "groups": [],
      "x": -0.432183908045977,
      "y": 0.5546875,
      "scheduled": false
    },
    "30e9": {
      "name": "ViewData",
      "canvasName": "ViewData",
      "summary": "View Edge Activation Keys",
      "description": "View data in a pretty format",
      "location": "Application",
      "app": "WorkFlowEngine",
      "displayName": "Tools",
      "type": "manual",
      "variables": {
        "incoming": {
          "header": "Edge Activation Key",
          "message": "All the edges have been provision. \nBelow are the keys used for activation of edge.",
          "body": "$var.job.edgeKeys",
          "variables": {},
          "btn_success": "End",
          "btn_failure": ""
        },
        "outgoing": {},
        "error": ""
      },
      "view": "/workflow_engine/task/ViewData",
      "deprecated": false,
      "matched": [
        {
          "key": "canvasName",
          "highlightString": "<span class='highlight-string'>ViewData</span>"
        }
      ],
      "groups": [
        {
          "provenance": "Local AAA",
          "name": "pronghorn_admin",
          "description": "pronghorn_admin"
        }
      ],
      "x": 0.7396551724137931,
      "y": 0.4934895833333333,
      "scheduled": false
    },
    "289e": {
      "name": "newVariable",
      "canvasName": "newVariable",
      "summary": "Create a Job Variable",
      "description": "Create a new Job variable by Job ID and assign it a value.",
      "location": "Application",
      "locationType": null,
      "app": "WorkFlowEngine",
      "type": "operation",
      "displayName": "WorkFlowEngine",
      "variables": {
        "incoming": {
          "name": "edgeKeys",
          "value": []
        },
        "outgoing": {
          "value": null
        }
      },
      "deprecated": false,
      "matched": [
        {
          "key": "canvasName",
          "highlightString": "<span class='highlight-string'>newVa</span>riable"
        }
      ],
      "groups": [],
      "x": -0.43505747126436783,
      "y": 0.40234375
    },
    "8bad": {
      "name": "push",
      "canvasName": "push",
      "summary": "Push Item to Array",
      "description": "Push item to a job variable array",
      "location": "Application",
      "locationType": null,
      "app": "WorkFlowEngine",
      "type": "operation",
      "displayName": "WorkFlowEngine",
      "variables": {
        "incoming": {
          "job_variable": "edgeKeys",
          "item_to_push": "$var.3bd4.merged_object"
        },
        "outgoing": {
          "job_variable_value": null
        }
      },
      "deprecated": false,
      "matched": [
        {
          "key": "canvasName",
          "highlightString": "<span class='highlight-string'>push</span>"
        },
        {
          "key": "summary",
          "highlightString": "<span class='highlight-string'>Push</span> Item to Array"
        },
        {
          "key": "description",
          "highlightString": "<span class='highlight-string'>Push</span> item to a job variable array"
        }
      ],
      "groups": [],
      "x": 0.7149425287356321,
      "y": 1.3151041666666667
    },
    "3bd4": {
      "name": "merge",
      "canvasName": "merge",
      "summary": "Merge Data",
      "description": "Merge data into a single object",
      "location": "Application",
      "locationType": null,
      "app": "WorkFlowEngine",
      "type": "operation",
      "displayName": "WorkFlowEngine",
      "variables": {
        "incoming": {
          "data_to_merge": [
            {
              "key": "edgeName",
              "value": {
                "task": "444c",
                "variable": "return_data"
              }
            },
            {
              "key": "key",
              "value": {
                "task": "d28e",
                "variable": "return_data"
              }
            }
          ]
        },
        "outgoing": {
          "merged_object": null
        }
      },
      "deprecated": false,
      "matched": [
        {
          "key": "canvasName",
          "highlightString": "<span class='highlight-string'>merge</span>"
        },
        {
          "key": "summary",
          "highlightString": "<span class='highlight-string'>Merge</span> Data"
        },
        {
          "key": "description",
          "highlightString": "<span class='highlight-string'>Merge</span> data into a single object"
        }
      ],
      "groups": [],
      "x": 0.7080459770114943,
      "y": 1.1588541666666667
    },
    "444c": {
      "name": "query",
      "summary": "Query edgeName",
      "description": "Query edgeName",
      "location": "Application",
      "locationType": null,
      "app": "WorkFlowEngine",
      "displayName": "WorkFlowEngine",
      "type": "operation",
      "variables": {
        "incoming": {
          "pass_on_null": false,
          "query": "edgeName",
          "obj": "$var.82ec.current_item"
        },
        "outgoing": {
          "return_data": null
        },
        "error": ""
      },
      "deprecated": false,
      "matched": [
        {
          "key": "name",
          "highlightString": "<span class='highlight-string'>query</span>"
        },
        {
          "key": "summary",
          "highlightString": "<span class='highlight-string'>Query</span> Data Using 'json-query' Format"
        },
        {
          "key": "description",
          "highlightString": "<span class='highlight-string'>Query</span> data using a dot/bracket notation string and a matching key/value pair."
        }
      ],
      "groups": [],
      "x": 0.7126436781609196,
      "y": 1.0286458333333333,
      "scheduled": false
    }
  },
  "transitions": {
    "1988": {
      "4e7c": {
        "type": "standard",
        "state": "success"
      }
    },
    "4501": {
      "92d": {
        "type": "standard",
        "state": "success"
      }
    },
    "5038": {
      "d548": {
        "type": "standard",
        "state": "success"
      }
    },
    "5516": {
      "ae0": {
        "type": "standard",
        "state": "success"
      }
    },
    "5850": {
      "82ec": {
        "type": "standard",
        "state": "success"
      }
    },
    "9419": {},
    "workflow_start": {
      "261a": {
        "type": "standard",
        "state": "success"
      }
    },
    "workflow_end": {},
    "ae0": {
      "5038": {
        "type": "standard",
        "state": "success"
      }
    },
    "4e7c": {
      "cf91": {
        "type": "standard",
        "state": "success"
      }
    },
    "92d": {
      "5850": {
        "type": "standard",
        "state": "success"
      }
    },
    "d28e": {
      "3bd4": {
        "type": "standard",
        "state": "success"
      }
    },
    "9f2d": {
      "5516": {
        "type": "standard",
        "state": "success"
      },
      "47fe": {
        "type": "standard",
        "state": "failure"
      }
    },
    "85fa": {
      "38b1": {
        "type": "standard",
        "state": "success"
      }
    },
    "2ffe": {
      "9f2d": {
        "type": "standard",
        "state": "success"
      }
    },
    "47fe": {
      "workflow_end": {
        "type": "standard",
        "state": "success"
      }
    },
    "6eb4": {
      "38b1": {
        "type": "standard",
        "state": "success"
      }
    },
    "e758": {
      "38b1": {
        "type": "standard",
        "state": "success"
      }
    },
    "82ec": {
      "1988": {
        "type": "standard",
        "state": "loop"
      },
      "30e9": {
        "type": "standard",
        "state": "success"
      }
    },
    "38b1": {
      "2ffe": {
        "type": "standard",
        "state": "success"
      }
    },
    "149d": {},
    "6e92": {},
    "d7bb": {},
    "fcc3": {},
    "d548": {
      "4501": {
        "type": "standard",
        "state": "success"
      }
    },
    "cf91": {
      "d28e": {
        "type": "standard",
        "state": "success"
      },
      "444c": {
        "type": "standard",
        "state": "success"
      }
    },
    "261a": {
      "2bc5": {
        "type": "standard",
        "state": "success"
      },
      "289e": {
        "type": "standard",
        "state": "success"
      }
    },
    "2bc5": {
      "6eb4": {
        "type": "standard",
        "state": "success"
      },
      "85fa": {
        "type": "standard",
        "state": "success"
      },
      "e758": {
        "type": "standard",
        "state": "success"
      }
    },
    "30e9": {
      "workflow_end": {
        "type": "standard",
        "state": "success"
      }
    },
    "289e": {
      "2bc5": {
        "type": "standard",
        "state": "success"
      }
    },
    "8bad": {},
    "3bd4": {
      "8bad": {
        "type": "standard",
        "state": "success"
      }
    },
    "444c": {
      "3bd4": {
        "type": "standard",
        "state": "success"
      }
    }
  },
  "font_size": 12,
  "created": "2020-03-02T02:03:48.911Z",
  "created_by": {
    "provenance": "Local AAA",
    "username": "admin@pronghorn",
    "firstname": "admin",
    "inactive": true,
    "email": ""
  },
  "createdVersion": "4.5.3-2019.2.9.0",
  "last_updated": "2021-12-27T16:15:19.067Z",
  "last_updated_by": {
    "provenance": "Itential-Okta",
    "username": "nick.andreano@itential.com",
    "firstname": "Nick",
    "inactive": false
  },
  "lastUpdatedVersion": "5.44.8-2021.2.0",
  "type": "automation",
  "description": null,
  "canvasVersion": 1,
  "inputSchema": {
    "type": "object",
    "properties": {}
  },
  "outputSchema": {
    "type": "object",
    "properties": {
      "_id": {
        "type": "string",
        "pattern": "^[0-9a-f]{24}$"
      },
      "initiator": {
        "type": "string"
      },
      "formData": {
        "type": [
          "array",
          "boolean",
          "null",
          "number",
          "object",
          "string"
        ]
      },
      "edgeKeys": {
        "type": [
          "array",
          "boolean",
          "null",
          "number",
          "object",
          "string"
        ]
      }
    }
  },
  "tags": [],
  "groups": [],
  "migrationVersion": 1
}