{
  "metadata": {
    "name": "@itentialopensource/to-special-case",
    "version": "0.0.8",
    "description": "[Deprecated] Pre-built to convert words separated by spaces to alternate cases.",
    "license": "Apache-2.0",
    "repository": {
      "type": "gitlab",
      "hostname": "gitlab.com",
      "path": "itentialopensource/pre-built-automations"
    },
    "keywords": [
      "Itential",
      "IAP",
      "artifacts"
    ],
    "author": "Itential Artifacts",
    "IAPDependencies": {
      "@itential/app-workflow_engine": ""
    },
    "gitlabId": 31401985
  },
  "manifest": {
    "bundleName": "To Special Case",
    "fingerprint": "61954668ecd65d007b024409",
    "createdEpoch": "1637172840483",
    "artifacts": [
      {
        "id": "619541edc165aa00de7d8bae",
        "name": "toSpecialCase",
        "type": "transformation",
        "location": "/bundles/transformations/toSpecialCase.json",
        "properties": {
          "entryPoint": false
        }
      }
    ]
  },
  "bundles": [
    {
      "type": "transformation",
      "data": {
        "_id": "619541edc165aa00de7d8bae",
        "name": "toSpecialCase",
        "description": "",
        "incoming": [
          {
            "$id": "incomingString",
            "type": "string",
            "examples": [
              "foo-bar-foobar"
            ]
          }
        ],
        "outgoing": [
          {
            "$id": "toCamelCase",
            "type": "string",
            "examples": [
              "fooBarFoobar"
            ]
          },
          {
            "$id": "toSnakeCase",
            "type": "string"
          },
          {
            "$id": "toKebabCase",
            "type": "string"
          },
          {
            "$id": "toPascalCase",
            "type": "string"
          }
        ],
        "steps": [
          {
            "id": 1,
            "type": "method",
            "library": "String",
            "method": "split",
            "args": [
              null,
              " ",
              null
            ],
            "view": {
              "row": 2,
              "col": 1
            }
          },
          {
            "id": 3,
            "type": "method",
            "library": "Array",
            "method": "map",
            "args": [
              null,
              "camelCaseFunction"
            ],
            "view": {
              "row": 1,
              "col": 2
            }
          },
          {
            "id": 4,
            "type": "assign",
            "from": {
              "location": "method",
              "name": 1,
              "ptr": "/return"
            },
            "to": {
              "location": "method",
              "name": 3,
              "ptr": "/args/0/value"
            }
          },
          {
            "id": 27,
            "type": "method",
            "library": "Array",
            "method": "join",
            "args": [
              null,
              null
            ],
            "view": {
              "row": 1,
              "col": 3
            }
          },
          {
            "id": 29,
            "type": "assign",
            "from": {
              "location": "method",
              "name": 27,
              "ptr": "/return"
            },
            "to": {
              "location": "outgoing",
              "name": "toCamelCase",
              "ptr": ""
            }
          },
          {
            "id": 30,
            "type": "assign",
            "from": {
              "location": "method",
              "name": 3,
              "ptr": "/return"
            },
            "to": {
              "location": "method",
              "name": 27,
              "ptr": "/args/0/value"
            }
          },
          {
            "id": 31,
            "type": "declaration",
            "library": "String",
            "method": "new String",
            "args": [
              null
            ],
            "view": {
              "row": 2,
              "col": 2
            }
          },
          {
            "id": 32,
            "type": "assign",
            "from": {
              "location": "declaration",
              "name": 31,
              "ptr": "/return"
            },
            "to": {
              "location": "method",
              "name": 27,
              "ptr": "/args/1/value"
            }
          },
          {
            "id": 33,
            "type": "method",
            "library": "Array",
            "method": "join",
            "args": [
              null,
              "_"
            ],
            "view": {
              "row": 2,
              "col": 3
            }
          },
          {
            "id": 34,
            "type": "method",
            "library": "Array",
            "method": "join",
            "args": [
              null,
              "-"
            ],
            "view": {
              "row": 3,
              "col": 3
            }
          },
          {
            "id": 35,
            "type": "method",
            "library": "Array",
            "method": "join",
            "args": [
              null,
              null
            ],
            "view": {
              "row": 4,
              "col": 3
            }
          },
          {
            "id": 36,
            "type": "assign",
            "from": {
              "location": "method",
              "name": 33,
              "ptr": "/return"
            },
            "to": {
              "location": "outgoing",
              "name": "toSnakeCase",
              "ptr": ""
            }
          },
          {
            "id": 37,
            "type": "assign",
            "from": {
              "location": "method",
              "name": 34,
              "ptr": "/return"
            },
            "to": {
              "location": "outgoing",
              "name": "toKebabCase",
              "ptr": ""
            }
          },
          {
            "id": 38,
            "type": "method",
            "library": "String",
            "method": "toLowerCase",
            "args": [
              null
            ],
            "view": {
              "row": 1,
              "col": 1
            }
          },
          {
            "id": 39,
            "type": "assign",
            "from": {
              "location": "incoming",
              "name": "incomingString",
              "ptr": ""
            },
            "to": {
              "location": "method",
              "name": 38,
              "ptr": "/args/0/value"
            }
          },
          {
            "id": 40,
            "type": "assign",
            "from": {
              "location": "method",
              "name": 38,
              "ptr": "/return"
            },
            "to": {
              "location": "method",
              "name": 1,
              "ptr": "/args/0/value"
            }
          },
          {
            "id": 41,
            "type": "assign",
            "from": {
              "location": "method",
              "name": 1,
              "ptr": "/return"
            },
            "to": {
              "location": "method",
              "name": 33,
              "ptr": "/args/0/value"
            }
          },
          {
            "id": 42,
            "type": "assign",
            "from": {
              "location": "method",
              "name": 1,
              "ptr": "/return"
            },
            "to": {
              "location": "method",
              "name": 34,
              "ptr": "/args/0/value"
            }
          },
          {
            "id": 43,
            "type": "assign",
            "from": {
              "location": "declaration",
              "name": 31,
              "ptr": "/return"
            },
            "to": {
              "location": "method",
              "name": 35,
              "ptr": "/args/1/value"
            }
          },
          {
            "id": 44,
            "type": "method",
            "library": "Array",
            "method": "map",
            "args": [
              null,
              "pascalCaseFunction"
            ],
            "view": {
              "row": 3,
              "col": 2
            }
          },
          {
            "id": 45,
            "type": "assign",
            "from": {
              "location": "method",
              "name": 1,
              "ptr": "/return"
            },
            "to": {
              "location": "method",
              "name": 44,
              "ptr": "/args/0/value"
            }
          },
          {
            "id": 46,
            "type": "assign",
            "from": {
              "location": "method",
              "name": 44,
              "ptr": "/return"
            },
            "to": {
              "location": "method",
              "name": 35,
              "ptr": "/args/0/value"
            }
          },
          {
            "id": 47,
            "type": "assign",
            "from": {
              "location": "method",
              "name": 35,
              "ptr": "/return"
            },
            "to": {
              "location": "outgoing",
              "name": "toPascalCase",
              "ptr": ""
            }
          }
        ],
        "functions": [
          {
            "incoming": [
              {
                "type": [
                  "array",
                  "boolean",
                  "number",
                  "integer",
                  "string",
                  "object",
                  "null"
                ],
                "$id": "currentValue"
              },
              {
                "title": "index",
                "type": "number",
                "optional": true,
                "$id": "index"
              },
              {
                "type": "array",
                "$id": "array",
                "optional": true
              },
              {
                "$id": "thisArg",
                "type": "object",
                "properties": {},
                "isContext": true,
                "isThis": true,
                "isIndexed": true
              }
            ],
            "outgoing": [
              {
                "title": "newValue",
                "type": [
                  "array",
                  "boolean",
                  "number",
                  "integer",
                  "string",
                  "object",
                  "null"
                ],
                "editable": true,
                "$id": "newValue"
              }
            ],
            "functions": [],
            "name": "camelCaseFunction",
            "steps": [
              {
                "id": 1,
                "type": "method",
                "library": "Relational",
                "method": "greaterThan",
                "args": [
                  null,
                  0
                ],
                "view": {
                  "row": 1,
                  "col": 2
                }
              },
              {
                "id": 2,
                "type": "assign",
                "from": {
                  "location": "incoming",
                  "name": "index",
                  "ptr": ""
                },
                "to": {
                  "location": "method",
                  "name": 1,
                  "ptr": "/args/0/value"
                }
              },
              {
                "id": 3,
                "type": "method",
                "library": "Conditional",
                "method": "ternary",
                "args": [
                  null,
                  null,
                  null
                ],
                "view": {
                  "row": 1,
                  "col": 7
                }
              },
              {
                "id": 4,
                "type": "assign",
                "from": {
                  "location": "method",
                  "name": 1,
                  "ptr": "/return"
                },
                "to": {
                  "location": "method",
                  "name": 3,
                  "ptr": "/args/0/value"
                }
              },
              {
                "id": 5,
                "type": "assign",
                "from": {
                  "location": "incoming",
                  "name": "currentValue",
                  "ptr": ""
                },
                "to": {
                  "location": "method",
                  "name": 3,
                  "ptr": "/args/2/value"
                }
              },
              {
                "id": 9,
                "type": "assign",
                "from": {
                  "location": "method",
                  "name": 3,
                  "ptr": "/return"
                },
                "to": {
                  "location": "outgoing",
                  "name": "newValue",
                  "ptr": ""
                }
              },
              {
                "id": 10,
                "type": "declaration",
                "library": "String",
                "method": "new String",
                "args": [
                  null
                ],
                "view": {
                  "row": 3,
                  "col": 1
                }
              },
              {
                "id": 11,
                "type": "method",
                "library": "String",
                "method": "split",
                "args": [
                  null,
                  null,
                  255
                ],
                "view": {
                  "row": 2,
                  "col": 2
                }
              },
              {
                "id": 12,
                "type": "assign",
                "from": {
                  "location": "incoming",
                  "name": "currentValue",
                  "ptr": ""
                },
                "to": {
                  "location": "method",
                  "name": 11,
                  "ptr": "/args/0/value"
                }
              },
              {
                "id": 13,
                "type": "assign",
                "from": {
                  "location": "declaration",
                  "name": 10,
                  "ptr": "/return"
                },
                "to": {
                  "location": "method",
                  "name": 11,
                  "ptr": "/args/1/value"
                }
              },
              {
                "id": 14,
                "type": "method",
                "library": "Array",
                "method": "getIndex",
                "args": [
                  null,
                  0
                ],
                "view": {
                  "row": 3,
                  "col": 3
                }
              },
              {
                "id": 15,
                "type": "assign",
                "from": {
                  "location": "method",
                  "name": 11,
                  "ptr": "/return"
                },
                "to": {
                  "location": "method",
                  "name": 14,
                  "ptr": "/args/0/value"
                }
              },
              {
                "id": 16,
                "type": "method",
                "library": "String",
                "method": "toUpperCase",
                "args": [
                  null
                ],
                "view": {
                  "row": 3,
                  "col": 4
                }
              },
              {
                "id": 17,
                "type": "assign",
                "from": {
                  "location": "method",
                  "name": 14,
                  "ptr": "/return"
                },
                "to": {
                  "location": "method",
                  "name": 16,
                  "ptr": "/args/0/value"
                }
              },
              {
                "id": 18,
                "type": "method",
                "library": "Array",
                "method": "setIndex",
                "args": [
                  null,
                  0,
                  null
                ],
                "view": {
                  "row": 2,
                  "col": 5
                }
              },
              {
                "id": 19,
                "type": "assign",
                "from": {
                  "location": "method",
                  "name": 16,
                  "ptr": "/return"
                },
                "to": {
                  "location": "method",
                  "name": 18,
                  "ptr": "/args/2/value"
                }
              },
              {
                "id": 20,
                "type": "assign",
                "from": {
                  "location": "method",
                  "name": 11,
                  "ptr": "/return"
                },
                "to": {
                  "location": "method",
                  "name": 18,
                  "ptr": "/args/0/value"
                }
              },
              {
                "id": 21,
                "type": "method",
                "library": "Array",
                "method": "join",
                "args": [
                  null,
                  null
                ],
                "view": {
                  "row": 2,
                  "col": 6
                }
              },
              {
                "id": 22,
                "type": "assign",
                "from": {
                  "location": "method",
                  "name": 18,
                  "ptr": "/return"
                },
                "to": {
                  "location": "method",
                  "name": 21,
                  "ptr": "/args/0/value"
                }
              },
              {
                "id": 23,
                "type": "assign",
                "from": {
                  "location": "declaration",
                  "name": 10,
                  "ptr": "/return"
                },
                "to": {
                  "location": "method",
                  "name": 21,
                  "ptr": "/args/1/value"
                }
              },
              {
                "id": 24,
                "type": "assign",
                "from": {
                  "location": "method",
                  "name": 21,
                  "ptr": "/return"
                },
                "to": {
                  "location": "method",
                  "name": 3,
                  "ptr": "/args/1/value"
                }
              }
            ],
            "view": {
              "col": 7,
              "row": 5
            },
            "id": "camelCaseFunction",
            "comments": []
          },
          {
            "incoming": [
              {
                "type": [
                  "array",
                  "boolean",
                  "number",
                  "integer",
                  "string",
                  "object",
                  "null"
                ],
                "$id": "currentValue"
              },
              {
                "title": "index",
                "type": "number",
                "optional": true,
                "$id": "index"
              },
              {
                "type": "array",
                "$id": "array",
                "optional": true
              },
              {
                "$id": "thisArg",
                "type": "object",
                "properties": {},
                "isContext": true,
                "isIndexed": true
              }
            ],
            "outgoing": [
              {
                "title": "newValue",
                "type": [
                  "array",
                  "boolean",
                  "number",
                  "integer",
                  "string",
                  "object",
                  "null"
                ],
                "editable": true,
                "$id": "newValue"
              }
            ],
            "functions": [],
            "name": "pascalCaseFunction",
            "steps": [
              {
                "id": 10,
                "type": "declaration",
                "library": "String",
                "method": "new String",
                "args": [
                  null
                ],
                "view": {
                  "row": 3,
                  "col": 1
                }
              },
              {
                "id": 11,
                "type": "method",
                "library": "String",
                "method": "split",
                "args": [
                  null,
                  null,
                  255
                ],
                "view": {
                  "row": 2,
                  "col": 2
                }
              },
              {
                "id": 12,
                "type": "assign",
                "from": {
                  "location": "incoming",
                  "name": "currentValue",
                  "ptr": ""
                },
                "to": {
                  "location": "method",
                  "name": 11,
                  "ptr": "/args/0/value"
                }
              },
              {
                "id": 13,
                "type": "assign",
                "from": {
                  "location": "declaration",
                  "name": 10,
                  "ptr": "/return"
                },
                "to": {
                  "location": "method",
                  "name": 11,
                  "ptr": "/args/1/value"
                }
              },
              {
                "id": 14,
                "type": "method",
                "library": "Array",
                "method": "getIndex",
                "args": [
                  null,
                  0
                ],
                "view": {
                  "row": 3,
                  "col": 3
                }
              },
              {
                "id": 15,
                "type": "assign",
                "from": {
                  "location": "method",
                  "name": 11,
                  "ptr": "/return"
                },
                "to": {
                  "location": "method",
                  "name": 14,
                  "ptr": "/args/0/value"
                }
              },
              {
                "id": 16,
                "type": "method",
                "library": "String",
                "method": "toUpperCase",
                "args": [
                  null
                ],
                "view": {
                  "row": 3,
                  "col": 4
                }
              },
              {
                "id": 17,
                "type": "assign",
                "from": {
                  "location": "method",
                  "name": 14,
                  "ptr": "/return"
                },
                "to": {
                  "location": "method",
                  "name": 16,
                  "ptr": "/args/0/value"
                }
              },
              {
                "id": 18,
                "type": "method",
                "library": "Array",
                "method": "setIndex",
                "args": [
                  null,
                  0,
                  null
                ],
                "view": {
                  "row": 2,
                  "col": 5
                }
              },
              {
                "id": 19,
                "type": "assign",
                "from": {
                  "location": "method",
                  "name": 16,
                  "ptr": "/return"
                },
                "to": {
                  "location": "method",
                  "name": 18,
                  "ptr": "/args/2/value"
                }
              },
              {
                "id": 20,
                "type": "assign",
                "from": {
                  "location": "method",
                  "name": 11,
                  "ptr": "/return"
                },
                "to": {
                  "location": "method",
                  "name": 18,
                  "ptr": "/args/0/value"
                }
              },
              {
                "id": 21,
                "type": "method",
                "library": "Array",
                "method": "join",
                "args": [
                  null,
                  null
                ],
                "view": {
                  "row": 2,
                  "col": 6
                }
              },
              {
                "id": 22,
                "type": "assign",
                "from": {
                  "location": "method",
                  "name": 18,
                  "ptr": "/return"
                },
                "to": {
                  "location": "method",
                  "name": 21,
                  "ptr": "/args/0/value"
                }
              },
              {
                "id": 23,
                "type": "assign",
                "from": {
                  "location": "declaration",
                  "name": 10,
                  "ptr": "/return"
                },
                "to": {
                  "location": "method",
                  "name": 21,
                  "ptr": "/args/1/value"
                }
              },
              {
                "id": 24,
                "type": "assign",
                "from": {
                  "location": "method",
                  "name": 21,
                  "ptr": "/return"
                },
                "to": {
                  "location": "outgoing",
                  "name": "newValue",
                  "ptr": ""
                }
              }
            ],
            "view": {
              "col": 6,
              "row": 5
            },
            "id": "pascalCaseFunction",
            "comments": []
          }
        ],
        "comments": [],
        "view": {
          "col": 3,
          "row": 5
        },
        "created": "2021-11-17T17:54:53.983Z",
        "createdBy": {
          "_id": "6144f0469d8eacfa15f87756",
          "provenance": "local_aaa",
          "username": "admin@pronghorn"
        },
        "lastUpdated": "2021-11-17T18:11:04.976Z",
        "lastUpdatedBy": {
          "_id": "6144f0469d8eacfa15f87756",
          "provenance": "local_aaa",
          "username": "admin@pronghorn"
        },
        "version": "3.17.7-2021.1.7",
        "tags": []
      }
    }
  ],
  "readme": "<!-- This is a comment in md (Markdown) format, it will not be visible to the end user -->\n## _Deprecation Notice_\nThis Pre-Built has been deprecated as of 01-15-2024 and will be end of life on 01-15-2025. The capabilities of this Pre-Built have been replaced by the [IAP - Data Manipulation](https://gitlab.com/itentialopensource/pre-built-automations/iap-data-manipulation)\n\n<!-- Update the below line with your Pre-Built name -->\n# To Special Case\n\n<!-- Leave TOC intact unless you've added or removed headers -->\n## Table of Contents\n\n* [Overview](#overview)\n* [Installation Prerequisites](#installation-prerequisites)\n* [Future Enhancements](#future-enhancements)\n* [How to Install](#how-to-install)\n* [How to Run](#how-to-run)\n* [Examples](#examples)\n* [Additional Information](#additional-information)\n\n## Overview\n\n<!-- Write a few sentences about the Pre-Built and explain the use case(s) -->\n<!-- Avoid using the word Artifact. Please use Pre-Built, Pre-Built Transformation or Pre-Built Automation -->\n<!-- Ex.: The Migration Wizard enables IAP users to conveniently move their automation use cases between different IAP environments -->\n<!-- (e.g. from Dev to Pre-Production or from Lab to Production). -->\nThis Pre-Built consists of a JST that takes in words separated by whitespace and converts them to camelCase, PascalCase, kebab-case, and snake_case. \n\n## Installation Prerequisites\n\nUsers must satisfy the following pre-requisites:\n\n<!-- Include any other required apps or adapters in this list -->\n<!-- Ex.: EC2 Adapter -->\n* Itential Automation Platform\n  * `^2022.1.x`\n\n\n## Future Enhancements\n\n<!-- OPTIONAL - Mention if the Pre-Built will be enhanced with additional features on the road map -->\n<!-- Ex.: This Pre-Built would support Cisco XR and F5 devices -->\n* Converting words with a non-whitespace seperator into alternate cases\n\n## How to Install\n\nTo install the Pre-Built:\n\n* Verify you are running a supported version of the Itential Automation Platform (IAP) as listed above in the [Requirements](#requirements) section in order to install the Pre-Built. \n* The Pre-Built can be installed from within App-Admin_Essential. Simply search for the name of your desired Pre-Built and click the install button.\n\n<!-- OPTIONAL - Explain if external components are required outside of IAP -->\n<!-- Ex.: The Ansible roles required for this Pre-Built can be found in the repository located at https://gitlab.com/itentialopensource/pre-built-automations/hello-world -->\n\n## How to Run\n\nIn order to run this JST, add the appropriate JST task onto the workflow, then search for \"toSpecialCase\" and\nassign values to the incoming variable, incomingString. \n\n\n<!-- Explain the main entrypoint(s) for this Pre-Built: Automation Catalog item, Workflow, Postman, etc. -->\n\n## Examples\n\n***Input***\n\n```\n{\n  \"incomingString\": \"foo bar foobar\"\n}\n```\n\n***Output***\n```\n{\n  \"toCamelCase\": \"fooBarFoobar\",\n  \"toSnakeCase\": \"foo_bar_foobar\",\n  \"toKebabCase\": \"foo-bar-foobar\",\n  \"toPascalCase\": \"FooBarFoobar\"\n}\n```\n\n## Additional Information\n\nPlease use your Itential Customer Success account if you need support when using this Pre-Built.\n"
}