{
  "id": "5fe0d56ed6ba6057109f8863",
  "created": "2020-12-17T18:24:22.396Z",
  "createdBy": "clarisa.colton@itential.com",
  "lastUpdated": "2022-01-18T21:29:35.977Z",
  "lastUpdatedBy": "clarisa.colton@itential.com",
  "name": "SolarWinds-Orion-AddNode",
  "description": null,
  "struct": {
    "type": "array",
    "items": [
      {
        "nodeId": "39b32ba9-d832-4519-ad55-ab92559556e5",
        "type": "string",
        "title": "Adapter Instance",
        "description": "",
        "placeholder": "Select an Adapter",
        "required": true,
        "enum": [
          {
            "id": "d0d57b31-67db-4784-a1ce-a11ca7638311",
            "value": "Adpater"
          }
        ],
        "binding": true,
        "rel": "collection",
        "targetPointer": "/enum",
        "method": "GET",
        "base": "/admin",
        "href": "/services/health",
        "sourcePointer": "/results",
        "sourceKeyPointer": "/id"
      },
      {
        "nodeId": "8d71b05a-2dce-4a60-8e6d-fe51f3da2e7b",
        "type": "boolean",
        "title": "Zero Touch WorkFlow",
        "description": "",
        "default": false,
        "enum": [
          {
            "id": "efb2b67a-a22a-410f-a49b-63889ca8ac0b",
            "value": true
          },
          {
            "id": "a2385e4b-f52f-44fc-b09d-393f3b7c5e5a",
            "value": false
          }
        ]
      },
      {
        "nodeId": "51994f36-9878-4284-86f7-80c94c8402d2",
        "type": "object",
        "description": "",
        "items": [
          {
            "nodeId": "1491d69f-cd1b-4934-8364-b061e34e52cb",
            "type": "string",
            "title": "IPAddress",
            "description": "",
            "placeholder": "10.10.10.40",
            "required": true,
            "pattern": "^(([0-9]|[1-9][0-9]|1[0-9]{2}|2[0-4][0-9]|25[0-5])\\.){3}([0-9]|[1-9][0-9]|1[0-9]{2}|2[0-4][0-9]|25[0-5])$"
          },
          {
            "nodeId": "91cd3da6-9eca-453c-bc27-297e18ba9ba1",
            "type": "number",
            "widget": "updown",
            "title": "EngineID",
            "description": "",
            "placeholder": "1",
            "required": true
          },
          {
            "nodeId": "46957974-21dc-4a03-a448-2093db0f6e56",
            "type": "string",
            "title": "ObjectSubType",
            "description": "",
            "placeholder": "Select an item",
            "required": true,
            "enum": [
              {
                "id": "9ebba2f0-b9b4-463b-b2ec-7b12cf8c00ee",
                "value": "SNMP"
              }
            ],
            "binding": false,
            "rel": "collection",
            "targetPointer": "/enum"
          },
          {
            "nodeId": "e0a603c3-48d8-4bab-869e-12d0d1acd9b4",
            "type": "number",
            "widget": "updown",
            "title": "SNMPVersion",
            "description": "",
            "placeholder": "2",
            "required": true
          },
          {
            "nodeId": "4e7f25ce-a61a-4926-9925-bed6243b8f55",
            "type": "string",
            "title": "Community",
            "description": "",
            "placeholder": "Select an item",
            "required": true,
            "enum": [
              {
                "id": "4e47c493-14f9-4a5b-8e8c-244e62b2d6f4",
                "value": "public"
              }
            ],
            "binding": false,
            "rel": "collection",
            "targetPointer": "/enum"
          },
          {
            "nodeId": "ffdf2939-431a-42a0-be84-ca7bd5f57a16",
            "type": "string",
            "title": "DNS",
            "description": "",
            "placeholder": "DNS",
            "required": true
          },
          {
            "nodeId": "851458cd-963e-48f1-8def-eea25c6b984f",
            "type": "string",
            "title": "SysName",
            "description": "",
            "placeholder": "System Name",
            "required": true
          }
        ],
        "title": "Node Payload "
      }
    ]
  },
  "schema": {
    "title": "SolarWinds-Orion-AddNode",
    "description": "",
    "type": "object",
    "required": [
      "adapterInstance"
    ],
    "properties": {
      "adapterInstance": {
        "type": "string",
        "title": "Adapter Instance",
        "_id": "/properties/adapterInstance",
        "description": "",
        "enum": []
      },
      "zeroTouchWorkFlow": {
        "type": "boolean",
        "title": "Zero Touch WorkFlow",
        "_id": "/properties/zeroTouchWorkFlow",
        "description": "",
        "default": false,
        "enum": [
          true,
          false
        ]
      },
      "nodePayload": {
        "type": "object",
        "title": "Node Payload ",
        "description": "",
        "required": [
          "ipAddress",
          "engineId",
          "objectSubType",
          "snmpVersion",
          "community",
          "dns",
          "sysName"
        ],
        "properties": {
          "ipAddress": {
            "type": "string",
            "title": "IPAddress",
            "_id": "/properties/nodePayload/properties/ipAddress",
            "description": "",
            "pattern": "^(([0-9]|[1-9][0-9]|1[0-9]{2}|2[0-4][0-9]|25[0-5])\\.){3}([0-9]|[1-9][0-9]|1[0-9]{2}|2[0-4][0-9]|25[0-5])$"
          },
          "engineId": {
            "type": "number",
            "title": "EngineID",
            "_id": "/properties/nodePayload/properties/engineId",
            "description": ""
          },
          "objectSubType": {
            "type": "string",
            "title": "ObjectSubType",
            "_id": "/properties/nodePayload/properties/objectSubType",
            "description": "",
            "enum": [
              "SNMP"
            ]
          },
          "snmpVersion": {
            "type": "number",
            "title": "SNMPVersion",
            "_id": "/properties/nodePayload/properties/snmpVersion",
            "description": ""
          },
          "community": {
            "type": "string",
            "title": "Community",
            "_id": "/properties/nodePayload/properties/community",
            "description": "",
            "enum": [
              "public"
            ]
          },
          "dns": {
            "type": "string",
            "title": "DNS",
            "_id": "/properties/nodePayload/properties/dns",
            "description": ""
          },
          "sysName": {
            "type": "string",
            "title": "SysName",
            "_id": "/properties/nodePayload/properties/sysName",
            "description": ""
          }
        }
      }
    }
  },
  "uiSchema": {
    "adapterInstance": {
      "ui:placeholder": "Select an Adapter"
    },
    "nodePayload": {
      "ui:collapseByDefault": false,
      "items": {
        "ipAddress": {
          "ui:placeholder": "10.10.10.40"
        },
        "engineId": {
          "ui:placeholder": "1",
          "ui:widget": "updown"
        },
        "objectSubType": {
          "ui:placeholder": "Select an item"
        },
        "snmpVersion": {
          "ui:placeholder": "2",
          "ui:widget": "updown"
        },
        "community": {
          "ui:placeholder": "Select an item"
        },
        "dns": {
          "ui:placeholder": "DNS"
        },
        "sysName": {
          "ui:placeholder": "System Name"
        }
      }
    }
  },
  "bindingSchema": {
    "properties": {
      "adapterInstance": {
        "binding:method": "GET",
        "binding:link": {
          "$ref": "/links",
          "rel": "collection"
        },
        "binding:target": {
          "propertyPointer": "/enum"
        },
        "binding:hyperSchema": {
          "type": "object",
          "base": "/admin",
          "links": [
            {
              "rel": "collection",
              "href": "/services/health",
              "targetMediaType": "application/json",
              "targetSchema": {
                "$ref": "#"
              },
              "variables": []
            }
          ]
        },
        "binding:source": {
          "propertyPointer": "/results",
          "keyPointer": "/id"
        }
      },
      "nodePayload": {
        "properties": {}
      }
    }
  },
  "validationSchema": {
    "nodePayload": {}
  },
  "version": "2020.1"
}