{
  "_id": "61af8f08719db901a2f4fb3c",
  "name": "Slack Notification",
  "description": "Send a notification using Slack API",
  "componentName": "Slack Notification",
  "componentType": "workflows",
  "gbac": {
    "write": [],
    "read": []
  },
  "created": "2021-12-07T16:42:48.966Z",
  "createdBy": "nick.andreano@itential.com",
  "lastUpdated": "2021-12-07T16:42:48.966Z",
  "lastUpdatedBy": "nick.andreano@itential.com",
  "triggers": [
    {
      "_id": "61af8f09719db901a2f4fb3d",
      "created": "2021-12-07T16:42:49.342Z",
      "createdBy": "nick.andreano@itential.com",
      "lastUpdated": "2021-12-07T16:42:49.342Z",
      "lastUpdatedBy": "nick.andreano@itential.com",
      "name": "Manual Trigger (migrated from Slack Notification)",
      "type": "manual",
      "enabled": true,
      "actionType": "automations",
      "actionId": "61af8f08719db901a2f4fb3c",
      "formId": "Slack Notification",
      "formData": {
        "message": "`IAP Job Automation Status`\nIAP Job Link: <http://www.itential.com|IAP-Job-Status>\nServiceNOW Link: <http://www.servicenow.com|SNOW-Ticket-Status>\nJira Link: <http://www.jira.com|JIRA-Ticket-Status>",
        "channelName": "se-demo-notification"
      },
      "migrationVersion": 1
    }
  ]
}