{
  "name": "ServiceNow Create Change Request",
  "webName": "ServiceNow Create Change Request Workflow",
  "vendor": "ServiceNow",
  "product": "Change Management",
  "osVersions": [
    "Istanbul",
    "Jakarta",
    "Kingston",
    "London",
    "Madrid",
    "New York",
    "Orlando",
    "Paris",
    "Quebec",
    "Rome",
    "San Diego",
    "Tokyo",
    "Utah"
  ],
  "apiVersions": [
    "Istanbul",
    "Madrid"
  ],
  "iapVersions": [
    "2021.1.x",
    "2021.2.x",
    "2022.1.x",
    "2023.1.x"
  ],
  "method": "REST",
  "type": "Workflow Project",
  "domains": [
    "Service Assurance",
    "ITSM (Service Management)"
  ],
  "tags": [
    "Change Management"
  ],
  "useCases": [
    "Create, update, complete or cancel Change Management Requests"
  ],
  "deprecated": {
    "isDeprecated": true,
    "deprecatedOn": "2023-08-24",
    "endOfLife": "2024-06-30",
    "replacedBy": {
      "name": "ServiceNow - Now Platform - REST",
      "webName": "ServiceNow Platform Modular Automations",
      "isProductFeature": false,
      "overview": "Project with workflows for the Now Platform from ServiceNow",
      "repoLink": "https://gitlab.com/itentialopensource/pre-built-automations/servicenow-now-platform-rest",
      "docLink": "",
      "webLink": ""
    }
  },
  "brokerSince": "",
  "documentation": {
    "storeLink": "",
    "npmLink": "",
    "repoLink": "https://gitlab.com/itentialopensource/pre-built-automations/servicenow-create-change-request",
    "docLink": "",
    "demoLinks": [],
    "faqLink": "",
    "contributeLink": "",
    "issueLink": "",
    "webLink": "https://www.itential.com/automations/servicenow-create-change-request/",
    "vendorLink": "https://www.servicenow.com/",
    "productLink": "https://www.servicenow.com/products/itsm.html",
    "apiLinks": [
      "https://developer.servicenow.com/dev.do#!/learn/learning-plans/tokyo/new_to_servicenow/app_store_learnv2_scripting_tokyo_servicenow_apis"
    ]
  },
  "relatedItems": {
    "adapters": [
      {
        "name": "adapter-servicenow",
        "webName": "Adapter for Integration to ServiceNow",
        "overview": "Adapter for Integration to ServiceNow",
        "isDependency": true,
        "versions": [
          "^0.9.0"
        ],
        "repoLink": "https://gitlab.com/itentialopensource/adapters/itsm-testing/adapter-servicenow",
        "docLink": "https://docs.itential.com/opensource/docs/servicenow",
        "webLink": "https://www.itential.com/adapters/servicenow/"
      }
    ],
    "integrations": [],
    "ecosystemApplications": [
      {
        "name": "Itential ServiceNow App",
        "webName": "Itential ServiceNow App",
        "overview": "Start automations in the Itential Platform from ServiceNow",
        "isDependency": false,
        "versions": [
          "^0.1.0"
        ],
        "storeLink": "https://store.servicenow.com/sn_appstore_store.do#!/store/application/f2ba728813da041032813092e144b01f",
        "docLink": "https://docs.itential.com/opensource/docs/servicenow-application",
        "webLink": ""
      }
    ],
    "workflowProjects": [
      {
        "name": "ServiceNow - Now Platform - REST",
        "webName": "ServiceNow Platform Modular Automations",
        "overview": "Project with workflows for the Now Platform from ServiceNow",
        "isDependency": false,
        "versions": [
          "^1.0.0"
        ],
        "repoLink": "https://gitlab.com/itentialopensource/pre-built-automations/servicenow-now-platform-rest",
        "docLink": "",
        "webLink": ""
      }
    ],
    "transformationProjects": [],
    "exampleProjects": []
  }
}