{
  "_id": "60f08f0b12135420c1a87a81",
  "name": "version_bump_patch",
  "description": "",
  "incoming": [
    {
      "$id": "current_version",
      "type": "array"
    }
  ],
  "outgoing": [
    {
      "$id": "new_version",
      "type": "string"
    }
  ],
  "steps": [
    {
      "id": 30,
      "type": "function",
      "function": "increase_version_num",
      "args": [
        null,
        2
      ],
      "view": {
        "row": 1,
        "col": 1
      }
    },
    {
      "id": 64,
      "type": "method",
      "library": "Array",
      "method": "join",
      "args": [
        null,
        "."
      ],
      "view": {
        "row": 1,
        "col": 2
      }
    },
    {
      "id": 67,
      "type": "assign",
      "from": {
        "location": "function",
        "name": 30,
        "ptr": "/return/version"
      },
      "to": {
        "location": "method",
        "name": 64,
        "ptr": "/args/0/value"
      }
    },
    {
      "id": 70,
      "type": "assign",
      "from": {
        "location": "method",
        "name": 64,
        "ptr": "/return"
      },
      "to": {
        "location": "outgoing",
        "name": "new_version",
        "ptr": ""
      }
    },
    {
      "id": 71,
      "type": "assign",
      "from": {
        "location": "incoming",
        "name": "current_version",
        "ptr": ""
      },
      "to": {
        "location": "function",
        "name": 30,
        "ptr": "/args/0/value"
      }
    }
  ],
  "functions": [
    {
      "incoming": [
        {
          "$id": "version",
          "type": "array"
        },
        {
          "$id": "idx",
          "type": "number"
        }
      ],
      "outgoing": [
        {
          "$id": "version",
          "type": "array"
        }
      ],
      "functions": [],
      "name": "increase_version_num",
      "steps": [
        {
          "id": 1,
          "type": "method",
          "library": "Array",
          "method": "getIndex",
          "args": [
            null,
            null
          ],
          "view": {
            "row": 1,
            "col": 1
          }
        },
        {
          "id": 2,
          "type": "method",
          "library": "Number",
          "method": "toString",
          "args": [
            null,
            null
          ],
          "view": {
            "row": 1,
            "col": 4
          }
        },
        {
          "id": 3,
          "type": "method",
          "library": "Number",
          "method": "parseInt",
          "args": [
            null,
            null
          ],
          "view": {
            "row": 1,
            "col": 2
          }
        },
        {
          "id": 4,
          "type": "method",
          "library": "Math",
          "method": "add",
          "args": [
            null,
            1
          ],
          "view": {
            "row": 1,
            "col": 3
          }
        },
        {
          "id": 5,
          "type": "assign",
          "from": {
            "location": "incoming",
            "name": "version",
            "ptr": ""
          },
          "to": {
            "location": "method",
            "name": 1,
            "ptr": "/args/0/value"
          }
        },
        {
          "id": 6,
          "type": "assign",
          "from": {
            "location": "method",
            "name": 1,
            "ptr": "/return"
          },
          "to": {
            "location": "method",
            "name": 3,
            "ptr": "/args/0/value"
          }
        },
        {
          "id": 7,
          "type": "assign",
          "from": {
            "location": "method",
            "name": 3,
            "ptr": "/return"
          },
          "to": {
            "location": "method",
            "name": 4,
            "ptr": "/args/0/value"
          }
        },
        {
          "id": 8,
          "type": "assign",
          "from": {
            "location": "method",
            "name": 4,
            "ptr": "/return"
          },
          "to": {
            "location": "method",
            "name": 2,
            "ptr": "/args/0/value"
          }
        },
        {
          "id": 9,
          "type": "assign",
          "from": {
            "location": "incoming",
            "name": "idx",
            "ptr": ""
          },
          "to": {
            "location": "method",
            "name": 1,
            "ptr": "/args/1/value"
          }
        },
        {
          "id": 11,
          "type": "method",
          "library": "Array",
          "method": "setIndex",
          "args": [
            null,
            null,
            null
          ],
          "view": {
            "row": 2,
            "col": 5
          }
        },
        {
          "id": 12,
          "type": "assign",
          "from": {
            "location": "incoming",
            "name": "version",
            "ptr": ""
          },
          "to": {
            "location": "method",
            "name": 11,
            "ptr": "/args/0/value"
          }
        },
        {
          "id": 13,
          "type": "assign",
          "from": {
            "location": "incoming",
            "name": "idx",
            "ptr": ""
          },
          "to": {
            "location": "method",
            "name": 11,
            "ptr": "/args/1/value"
          }
        },
        {
          "id": 14,
          "type": "assign",
          "from": {
            "location": "method",
            "name": 2,
            "ptr": "/return"
          },
          "to": {
            "location": "method",
            "name": 11,
            "ptr": "/args/2/value"
          }
        },
        {
          "id": 15,
          "type": "assign",
          "from": {
            "location": "method",
            "name": 11,
            "ptr": "/return"
          },
          "to": {
            "location": "outgoing",
            "name": "version",
            "ptr": ""
          }
        }
      ],
      "view": {
        "col": 5,
        "row": 4
      },
      "id": "increase_version_num",
      "comments": []
    }
  ],
  "comments": [],
  "view": {
    "col": 2,
    "row": 6
  },
  "created": "2021-07-15T19:39:55.503Z",
  "createdBy": {
    "_id": "60f08ee6b38d5e2006732c5b",
    "provenance": "Itential-Okta",
    "username": "uday.soni@itential.com"
  },
  "lastUpdated": "2021-07-16T14:20:58.992Z",
  "lastUpdatedBy": {
    "_id": "60f08ee6b38d5e2006732c5b",
    "provenance": "Itential-Okta",
    "username": "uday.soni@itential.com"
  },
  "version": "3.17.7-2021.1.0"
}