{
  "type": "automation",
  "tasks": {
    "4149": {
      "name": "transformation",
      "canvasName": "transformation",
      "summary": "semver_validator",
      "description": "Perform a JSON Transformation using the JST library.",
      "location": "Application",
      "locationType": null,
      "app": "WorkFlowEngine",
      "type": "operation",
      "displayName": "WorkFlowEngine",
      "variables": {
        "incoming": {
          "tr_id": "60f1a3fb12135420c1a87a84",
          "variableMap": {
            "version": "$var.6066.value"
          },
          "options": {
            "extractOutput": false,
            "validateIncoming": true,
            "revertToDefaultValue": true
          }
        },
        "outgoing": {
          "check": null
        }
      },
      "deprecated": false,
      "matched": [
        {
          "key": "description",
          "highlightString": "Perform a JSON Transformation using the <span class='highlight-string'>JST</span> library."
        }
      ],
      "groups": [],
      "x": 0.4211764705882353,
      "y": 0.501813784764208,
      "task_name": "semver_validator"
    },
    "6066": {
      "name": "newVariable",
      "canvasName": "newVariable",
      "summary": "Create a Job Variable",
      "description": "Create a new Job variable by Job ID and assign it a value.",
      "location": "Application",
      "locationType": null,
      "app": "WorkFlowEngine",
      "type": "operation",
      "displayName": "WorkFlowEngine",
      "variables": {
        "incoming": {
          "name": "version",
          "value": "0.4.2"
        },
        "outgoing": {
          "value": null
        }
      },
      "deprecated": false,
      "matched": [
        {
          "key": "canvasName",
          "highlightString": "<span class='highlight-string'>newVar</span>iable"
        }
      ],
      "groups": [],
      "x": 0.2203921568627451,
      "y": 0.4957678355501814
    },
    "workflow_start": {
      "name": "workflow_start",
      "groups": [],
      "x": 0,
      "y": 0.5
    },
    "workflow_end": {
      "name": "workflow_end",
      "groups": [],
      "x": 0.6698039215686274,
      "y": 0.49939540507859737
    }
  },
  "transitions": {
    "4149": {
      "workflow_end": {
        "type": "standard",
        "state": "success"
      }
    },
    "6066": {
      "4149": {
        "type": "standard",
        "state": "success"
      }
    },
    "workflow_start": {
      "6066": {
        "type": "standard",
        "state": "success"
      }
    },
    "workflow_end": {}
  },
  "font_size": 12,
  "name": "semver_validator",
  "description": "",
  "last_updated": "2021-07-20T18:39:35.628Z",
  "last_updated_by": {
    "provenance": "Itential-Okta",
    "username": "uday.soni@itential.com",
    "firstname": "Uday",
    "inactive": false
  },
  "lastUpdatedVersion": "5.40.5-2021.1.8.0",
  "inputSchema": {
    "type": "object"
  },
  "outputSchema": {
    "type": "object",
    "properties": {
      "_id": {
        "type": "string",
        "pattern": "^[0-9a-f]{24}$"
      },
      "initiator": {
        "type": "string"
      },
      "version": {
        "type": "string"
      }
    }
  },
  "created": "2021-07-20T18:37:41.181Z",
  "created_by": {
    "provenance": "Itential-Okta",
    "username": "uday.soni@itential.com",
    "firstname": "Uday",
    "inactive": false
  },
  "createdVersion": "5.40.5-2021.1.8.0",
  "tags": [],
  "groups": []
}