{
  "_id": "5f89ade4b361ea190ea1cac8",
  "name": "Remove element from array by value",
  "description": "",
  "incoming": [
    {
      "$id": "array",
      "type": "array"
    },
    {
      "$id": "value",
      "type": "integer"
    },
    {
      "$id": "removeMany",
      "type": "boolean"
    }
  ],
  "outgoing": [
    {
      "$id": "newArray",
      "type": "array"
    },
    {
      "$id": "noOfRemovedItems",
      "type": "number"
    }
  ],
  "steps": [
    {
      "id": 18,
      "type": "assign",
      "from": {
        "location": "incoming",
        "name": "removeMany",
        "ptr": ""
      },
      "to": {
        "location": "method",
        "name": 17,
        "ptr": "/args/0/value"
      }
    },
    {
      "id": 22,
      "type": "assign",
      "from": {
        "location": "incoming",
        "name": "array",
        "ptr": ""
      },
      "to": {
        "location": "method",
        "name": 21,
        "ptr": "/args/0/value"
      }
    },
    {
      "id": 23,
      "type": "assign",
      "from": {
        "location": "incoming",
        "name": "value",
        "ptr": ""
      },
      "to": {
        "location": "method",
        "name": 21,
        "ptr": "/args/1/value"
      }
    },
    {
      "id": 25,
      "type": "assign",
      "from": {
        "location": "incoming",
        "name": "array",
        "ptr": ""
      },
      "to": {
        "location": "method",
        "name": 24,
        "ptr": "/args/0/value"
      }
    },
    {
      "id": 31,
      "type": "assign",
      "from": {
        "location": "incoming",
        "name": "array",
        "ptr": ""
      },
      "to": {
        "location": "method",
        "name": 30,
        "ptr": "/args/0/value"
      }
    },
    {
      "id": 39,
      "type": "assign",
      "from": {
        "location": "incoming",
        "name": "array",
        "ptr": ""
      },
      "to": {
        "location": "method",
        "name": 13,
        "ptr": "/args/0/value"
      }
    },
    {
      "id": 40,
      "type": "assign",
      "from": {
        "location": "incoming",
        "name": "value",
        "ptr": ""
      },
      "to": {
        "location": "method",
        "name": 13,
        "ptr": "/args/2/value"
      }
    },
    {
      "id": 44,
      "type": "assign",
      "from": {
        "location": "incoming",
        "name": "removeMany",
        "ptr": ""
      },
      "to": {
        "location": "method",
        "name": 35,
        "ptr": "/args/0/value"
      }
    },
    {
      "id": 30,
      "type": "method",
      "library": "Array",
      "method": "length",
      "args": [
        null
      ],
      "view": {
        "row": 3,
        "col": 1
      }
    },
    {
      "id": 13,
      "type": "method",
      "library": "Array",
      "method": "filter",
      "args": [
        null,
        "ƒ_query_1",
        null
      ],
      "view": {
        "row": 3,
        "col": 2
      }
    },
    {
      "id": 21,
      "type": "method",
      "library": "Array",
      "method": "indexOf",
      "args": [
        null,
        null,
        null
      ],
      "view": {
        "row": 1,
        "col": 2
      }
    },
    {
      "id": 33,
      "type": "assign",
      "from": {
        "location": "method",
        "name": 30,
        "ptr": "/return"
      },
      "to": {
        "location": "method",
        "name": 32,
        "ptr": "/args/0/value"
      }
    },
    {
      "id": 26,
      "type": "assign",
      "from": {
        "location": "method",
        "name": 21,
        "ptr": "/return"
      },
      "to": {
        "location": "method",
        "name": 24,
        "ptr": "/args/1/value"
      }
    },
    {
      "id": 29,
      "type": "assign",
      "from": {
        "location": "method",
        "name": 13,
        "ptr": "/return"
      },
      "to": {
        "location": "method",
        "name": 28,
        "ptr": "/args/0/value"
      }
    },
    {
      "id": 41,
      "type": "assign",
      "from": {
        "location": "method",
        "name": 13,
        "ptr": "/return"
      },
      "to": {
        "location": "method",
        "name": 17,
        "ptr": "/args/1/value"
      }
    },
    {
      "id": 46,
      "type": "assign",
      "from": {
        "location": "method",
        "name": 21,
        "ptr": "/return"
      },
      "to": {
        "location": "method",
        "name": 45,
        "ptr": "/args/0/value"
      }
    },
    {
      "id": 28,
      "type": "method",
      "library": "Array",
      "method": "length",
      "args": [
        null
      ],
      "view": {
        "row": 3,
        "col": 3
      }
    },
    {
      "id": 45,
      "type": "method",
      "library": "Math",
      "method": "add",
      "args": [
        null,
        1
      ],
      "view": {
        "row": 2,
        "col": 2
      }
    },
    {
      "id": 24,
      "type": "method",
      "library": "Array",
      "method": "splice",
      "args": [
        null,
        null,
        1
      ],
      "view": {
        "row": 1,
        "col": 3
      }
    },
    {
      "id": 34,
      "type": "assign",
      "from": {
        "location": "method",
        "name": 28,
        "ptr": "/return"
      },
      "to": {
        "location": "method",
        "name": 32,
        "ptr": "/args/1/value"
      }
    },
    {
      "id": 48,
      "type": "assign",
      "from": {
        "location": "method",
        "name": 45,
        "ptr": "/return"
      },
      "to": {
        "location": "declaration",
        "name": 47,
        "ptr": "/args/0/value"
      }
    },
    {
      "id": 42,
      "type": "assign",
      "from": {
        "location": "method",
        "name": 24,
        "ptr": "/return/array"
      },
      "to": {
        "location": "method",
        "name": 17,
        "ptr": "/args/2/value"
      }
    },
    {
      "id": 47,
      "type": "declaration",
      "library": "Boolean",
      "method": "new Boolean",
      "args": [
        null
      ],
      "view": {
        "row": 2,
        "col": 3
      }
    },
    {
      "id": 50,
      "type": "assign",
      "from": {
        "location": "declaration",
        "name": 47,
        "ptr": "/return"
      },
      "to": {
        "location": "method",
        "name": 49,
        "ptr": "/args/0/value"
      }
    },
    {
      "id": 49,
      "type": "method",
      "library": "Conditional",
      "method": "ternary",
      "args": [
        null,
        "1",
        "0"
      ],
      "view": {
        "row": 3,
        "col": 4
      }
    },
    {
      "id": 32,
      "type": "method",
      "library": "Math",
      "method": "subtract",
      "args": [
        null,
        null
      ],
      "view": {
        "row": 1,
        "col": 7
      }
    },
    {
      "id": 53,
      "type": "assign",
      "from": {
        "location": "method",
        "name": 49,
        "ptr": "/return"
      },
      "to": {
        "location": "method",
        "name": 52,
        "ptr": "/args/0/value"
      }
    },
    {
      "id": 43,
      "type": "assign",
      "from": {
        "location": "method",
        "name": 32,
        "ptr": "/return"
      },
      "to": {
        "location": "method",
        "name": 35,
        "ptr": "/args/1/value"
      }
    },
    {
      "id": 52,
      "type": "method",
      "library": "Number",
      "method": "parseInt",
      "args": [
        null,
        null
      ],
      "view": {
        "row": 3,
        "col": 5
      }
    },
    {
      "id": 54,
      "type": "assign",
      "from": {
        "location": "method",
        "name": 52,
        "ptr": "/return"
      },
      "to": {
        "location": "method",
        "name": 35,
        "ptr": "/args/2/value"
      }
    },
    {
      "id": 17,
      "type": "method",
      "library": "Conditional",
      "method": "ternary",
      "args": [
        null,
        null,
        null
      ],
      "view": {
        "row": 1,
        "col": 4
      }
    },
    {
      "id": 20,
      "type": "assign",
      "from": {
        "location": "method",
        "name": 17,
        "ptr": "/return"
      },
      "to": {
        "location": "outgoing",
        "name": "newArray",
        "ptr": ""
      }
    },
    {
      "id": 35,
      "type": "method",
      "library": "Conditional",
      "method": "ternary",
      "args": [
        null,
        null,
        null
      ],
      "view": {
        "row": 2,
        "col": 4
      }
    },
    {
      "id": 38,
      "type": "assign",
      "from": {
        "location": "method",
        "name": 35,
        "ptr": "/return"
      },
      "to": {
        "location": "outgoing",
        "name": "noOfRemovedItems",
        "ptr": ""
      }
    }
  ],
  "functions": [
    {
      "incoming": [
        {
          "type": [
            "array",
            "boolean",
            "number",
            "integer",
            "string",
            "object",
            "null"
          ],
          "$id": "element"
        },
        {
          "title": "index",
          "type": "number",
          "optional": true,
          "$id": "index"
        },
        {
          "$id": "array",
          "type": "array",
          "optional": true
        },
        {
          "$id": "thisArg",
          "type": "object",
          "properties": {
            "value": {
              "$id": "value",
              "type": "integer"
            }
          },
          "isContext": true
        }
      ],
      "outgoing": [
        {
          "title": "return",
          "type": "boolean",
          "$id": "return"
        }
      ],
      "functions": [],
      "name": "ƒ_query_1",
      "steps": [
        {
          "id": 2,
          "type": "assign",
          "from": {
            "location": "incoming",
            "name": "element",
            "ptr": ""
          },
          "to": {
            "location": "method",
            "name": 1,
            "ptr": "/args/0/value"
          }
        },
        {
          "id": 3,
          "type": "assign",
          "from": {
            "location": "incoming",
            "name": "thisArg",
            "ptr": "/value"
          },
          "to": {
            "location": "method",
            "name": 1,
            "ptr": "/args/1/value"
          }
        },
        {
          "id": 1,
          "type": "method",
          "library": "Equality",
          "method": "inequality",
          "args": [
            null,
            null
          ],
          "view": {
            "row": 1,
            "col": 2
          }
        },
        {
          "id": 4,
          "type": "assign",
          "from": {
            "location": "method",
            "name": 1,
            "ptr": "/return"
          },
          "to": {
            "location": "outgoing",
            "name": "return",
            "ptr": ""
          }
        }
      ],
      "view": {
        "col": 3,
        "row": 4
      },
      "id": "ƒ_query_1",
      "comments": []
    }
  ],
  "view": {
    "col": 8,
    "row": 5
  },
  "created": "2020-10-16T14:27:48.310Z",
  "createdBy": {
    "_id": "5f75ffa4b7a0a706e5b105c3",
    "provenance": "Itential AAA LDAP",
    "username": "apoorva.agarwal"
  },
  "lastUpdated": "2020-10-16T14:27:48.310Z",
  "lastUpdatedBy": {
    "_id": "5f75ffa4b7a0a706e5b105c3",
    "provenance": "Itential AAA LDAP",
    "username": "apoorva.agarwal"
  }
}