{
  "metadata": {
    "name": "@itentialopensource/regex-replace",
    "version": "0.0.7",
    "description": "Native JS Replace but with working regex",
    "license": "Apache-2.0",
    "repository": {
      "type": "gitlab",
      "hostname": "gitlab.com",
      "path": "itentialopensource/pre-built-automations"
    },
    "keywords": [
      "Itential",
      "IAP",
      "artifacts"
    ],
    "author": "Itential Artifacts",
    "IAPDependencies": {},
    "gitlabId": 19884638
  },
  "manifest": {
    "bundleName": "Regex Replace",
    "fingerprint": "5f08c885b8fd1b4dc810a23e",
    "createdEpoch": "1594411141613",
    "artifacts": [
      {
        "id": "5f08c773fd7aaf755869ff32",
        "name": "replace",
        "type": "transformation",
        "location": "/bundles/transformations/replace.json",
        "properties": {
          "entryPoint": false
        }
      }
    ]
  },
  "bundles": [
    {
      "type": "transformation",
      "data": {
        "_id": "5f08c773fd7aaf755869ff32",
        "name": "replace",
        "incoming": [
          {
            "$id": "str",
            "type": "string",
            "examples": [
              "Hello"
            ]
          },
          {
            "$id": "substr",
            "type": "string",
            "examples": [
              "o"
            ]
          },
          {
            "$id": "regex",
            "type": "string",
            "examples": [
              "/o/gm"
            ]
          },
          {
            "$id": "newSubstr",
            "type": "string",
            "examples": [
              "oo"
            ]
          }
        ],
        "outgoing": [
          {
            "$id": "newStr",
            "type": "string",
            "examples": [
              "Hallo"
            ]
          }
        ],
        "steps": [
          {
            "id": 38,
            "type": "assign",
            "from": {
              "location": "incoming",
              "name": "substr",
              "ptr": ""
            },
            "to": {
              "location": "method",
              "name": 4,
              "ptr": "/args/0/value"
            }
          },
          {
            "id": 41,
            "type": "assign",
            "from": {
              "location": "incoming",
              "name": "regex",
              "ptr": ""
            },
            "to": {
              "location": "method",
              "name": 29,
              "ptr": "/args/0/value"
            }
          },
          {
            "id": 42,
            "type": "assign",
            "from": {
              "location": "incoming",
              "name": "regex",
              "ptr": ""
            },
            "to": {
              "location": "method",
              "name": 22,
              "ptr": "/args/0/value"
            }
          },
          {
            "id": 43,
            "type": "assign",
            "from": {
              "location": "incoming",
              "name": "regex",
              "ptr": ""
            },
            "to": {
              "location": "method",
              "name": 14,
              "ptr": "/args/0/value"
            }
          },
          {
            "id": 44,
            "type": "assign",
            "from": {
              "location": "incoming",
              "name": "regex",
              "ptr": ""
            },
            "to": {
              "location": "method",
              "name": 19,
              "ptr": "/args/0/value"
            }
          },
          {
            "id": 45,
            "type": "assign",
            "from": {
              "location": "incoming",
              "name": "substr",
              "ptr": ""
            },
            "to": {
              "location": "method",
              "name": 9,
              "ptr": "/args/2/value"
            }
          },
          {
            "id": 69,
            "type": "assign",
            "from": {
              "location": "incoming",
              "name": "str",
              "ptr": ""
            },
            "to": {
              "location": "method",
              "name": 68,
              "ptr": "/args/0/value"
            }
          },
          {
            "id": 71,
            "type": "assign",
            "from": {
              "location": "incoming",
              "name": "newSubstr",
              "ptr": ""
            },
            "to": {
              "location": "method",
              "name": 68,
              "ptr": "/args/2/value"
            }
          },
          {
            "id": 4,
            "type": "method",
            "library": "String",
            "method": "length",
            "args": [
              null
            ],
            "view": {
              "row": 2,
              "col": 6
            }
          },
          {
            "id": 22,
            "type": "method",
            "library": "String",
            "method": "lastIndexOf",
            "args": [
              null,
              "/",
              null
            ],
            "view": {
              "row": 4,
              "col": 1
            }
          },
          {
            "id": 29,
            "type": "method",
            "library": "String",
            "method": "indexOf",
            "args": [
              null,
              "/",
              null
            ],
            "view": {
              "row": 3,
              "col": 1
            }
          },
          {
            "id": 8,
            "type": "assign",
            "from": {
              "location": "method",
              "name": 4,
              "ptr": "/return"
            },
            "to": {
              "location": "method",
              "name": 7,
              "ptr": "/args/0/value"
            }
          },
          {
            "id": 27,
            "type": "assign",
            "from": {
              "location": "method",
              "name": 22,
              "ptr": "/return"
            },
            "to": {
              "location": "method",
              "name": 14,
              "ptr": "/args/2/value"
            }
          },
          {
            "id": 36,
            "type": "assign",
            "from": {
              "location": "method",
              "name": 29,
              "ptr": "/return"
            },
            "to": {
              "location": "method",
              "name": 32,
              "ptr": "/args/0/value"
            }
          },
          {
            "id": 37,
            "type": "assign",
            "from": {
              "location": "method",
              "name": 22,
              "ptr": "/return"
            },
            "to": {
              "location": "method",
              "name": 33,
              "ptr": "/args/0/value"
            }
          },
          {
            "id": 7,
            "type": "method",
            "library": "Equality",
            "method": "equality",
            "args": [
              null,
              "0"
            ],
            "view": {
              "row": 2,
              "col": 7
            }
          },
          {
            "id": 32,
            "type": "method",
            "library": "Math",
            "method": "add",
            "args": [
              null,
              1
            ],
            "view": {
              "row": 3,
              "col": 2
            }
          },
          {
            "id": 33,
            "type": "method",
            "library": "Math",
            "method": "add",
            "args": [
              null,
              1
            ],
            "view": {
              "row": 5,
              "col": 2
            }
          },
          {
            "id": 10,
            "type": "assign",
            "from": {
              "location": "method",
              "name": 7,
              "ptr": "/return"
            },
            "to": {
              "location": "method",
              "name": 9,
              "ptr": "/args/0/value"
            }
          },
          {
            "id": 34,
            "type": "assign",
            "from": {
              "location": "method",
              "name": 32,
              "ptr": "/return"
            },
            "to": {
              "location": "method",
              "name": 14,
              "ptr": "/args/1/value"
            }
          },
          {
            "id": 35,
            "type": "assign",
            "from": {
              "location": "method",
              "name": 33,
              "ptr": "/return"
            },
            "to": {
              "location": "method",
              "name": 19,
              "ptr": "/args/1/value"
            }
          },
          {
            "id": 19,
            "type": "method",
            "library": "String",
            "method": "substring",
            "args": [
              null,
              null,
              null
            ],
            "view": {
              "row": 4,
              "col": 4
            }
          },
          {
            "id": 21,
            "type": "assign",
            "from": {
              "location": "method",
              "name": 19,
              "ptr": "/return"
            },
            "to": {
              "location": "declaration",
              "name": 1,
              "ptr": "/args/1/value"
            }
          },
          {
            "id": 14,
            "type": "method",
            "library": "String",
            "method": "substring",
            "args": [
              null,
              null,
              null
            ],
            "view": {
              "row": 3,
              "col": 4
            }
          },
          {
            "id": 18,
            "type": "assign",
            "from": {
              "location": "method",
              "name": 14,
              "ptr": "/return"
            },
            "to": {
              "location": "declaration",
              "name": 1,
              "ptr": "/args/0/value"
            }
          },
          {
            "id": 1,
            "type": "declaration",
            "library": "RegExp",
            "method": "new RegExp",
            "args": [
              null,
              null
            ],
            "view": {
              "row": 3,
              "col": 7
            }
          },
          {
            "id": 15,
            "type": "assign",
            "from": {
              "location": "declaration",
              "name": 1,
              "ptr": "/return"
            },
            "to": {
              "location": "method",
              "name": 9,
              "ptr": "/args/1/value"
            }
          },
          {
            "id": 9,
            "type": "method",
            "library": "Conditional",
            "method": "ternary",
            "args": [
              true,
              null,
              null
            ],
            "view": {
              "row": 3,
              "col": 8
            }
          },
          {
            "id": 70,
            "type": "assign",
            "from": {
              "location": "method",
              "name": 9,
              "ptr": "/return"
            },
            "to": {
              "location": "method",
              "name": 68,
              "ptr": "/args/1/value"
            }
          },
          {
            "id": 68,
            "type": "method",
            "library": "String",
            "method": "replace",
            "args": [
              null,
              null,
              null
            ],
            "view": {
              "row": 1,
              "col": 9
            }
          },
          {
            "id": 72,
            "type": "assign",
            "from": {
              "location": "method",
              "name": 68,
              "ptr": "/return"
            },
            "to": {
              "location": "outgoing",
              "name": "newStr",
              "ptr": ""
            }
          }
        ],
        "functions": [],
        "view": {
          "col": 9,
          "row": 7
        },
        "created": "2020-07-10T19:54:27.640Z",
        "createdBy": {
          "_id": "5ea891b0f698b67ebe7ef1e1",
          "provenance": "Itential LDAP",
          "username": "itential-artifacts"
        },
        "lastUpdated": "2020-07-10T19:54:27.640Z",
        "lastUpdatedBy": {
          "_id": "5ea891b0f698b67ebe7ef1e1",
          "provenance": "Itential LDAP",
          "username": "itential-artifacts"
        }
      }
    }
  ],
  "readme": "<!-- This is a comment in md (Markdown) format, it will not be visible to the end user -->\n\n<!-- Update the below line with your artifact name -->\n# Regex Replace\n\n<!-- Leave TOC intact unless you've added or removed headers -->\n## Table of Contents\n\n* [Overview](#overview)\n* [Installation Prerequisites](#installation-prerequisites)\n* [Requirements](#requirements)\n* [Features](#features)\n* [Future Enhancements](#future-enhancements)\n* [How to Install](#how-to-install)\n* [How to Run](#how-to-run)\n\n## Overview\n\nThis Pre-Built Transformation enables users to execute a search for a match in a string, and replaces the matched substring with a replacement substring. It closesly emulates the functionality of the [native JS String replace method](https://developer.mozilla.org/en-US/docs/Web/JavaScript/Reference/Global_Objects/String/replace). The only noticeable difference is that one must specify whether a Regex or String is used as the identifier (where string is the default). If a string is selected as the identifier, then only the first match is replaced (similar to the native method).\n\n\n\n## Installation Prerequisites\n\nUsers must satisfy the following pre-requisites:\n\n<!-- Include any other required apps or adapters in this list -->\n<!-- Ex.: EC2 Adapter -->\nItential Automation Platform\n* ^2022.1\n\n\n## How to Install\n\nTo install the artifact:\n\n* Verify you are running a supported version of the Itential Automation Platform (IAP) as listed above in the [Requirements](#requirements) section in order to install the artifact. \n* The artifact can be installed from within App-Admin_Essential. Simply search for the name of your desired artifact and click the install button (as shown below).\n\n<!-- REPLACE BELOW WITH IMAGE OF YOUR PUBLISHED ARTIFACT -->\n<table><tr><td>\n  <img src=\"https://gitlab.com/itentialopensource/pre-built-automations/regex-replace/-/raw/master/images/install.png\" alt=\"install\" width=\"600px\">\n</td></tr></table>\n<!-- REPLACE ABOVE WITH IMAGE OF YOUR PUBLISHED ARTIFACT -->\n\n<!-- OPTIONAL - Explain if external components are required outside of IAP -->\n<!-- Ex.: The Ansible roles required for this artifact can be found in the repository located at https://gitlab.com/itentialopensource/pre-built-automations/hello-world -->\n\n## How to Run\n\nUse the following to run the Pre-Built Transformation:\n\n1. Once the JST is installed as outlined in the [How to Install](#how-to-install) section above, navigate to the workflow where you would like to use `replace` and add a `JSON Transformation` task. \n2. Inside the `Transformation` task, search for and select `replace`.\n<!-- Explain the main entrypoint(s) for this artifact: Automation Catalog item, Workflow, Postman, etc. -->\n"
}