{
  "_id": "5f08cf9ffd7aaf755869ff3b",
  "name": "match",
  "incoming": [
    {
      "$id": "str",
      "type": "string",
      "examples": [
        "Hello"
      ]
    },
    {
      "$id": "regex",
      "type": "string",
      "examples": [
        "/o/gm"
      ]
    }
  ],
  "outgoing": [
    {
      "$id": "matchedArray",
      "type": "array",
      "items": {
        "type": "string",
        "examples": [
          "T"
        ]
      }
    }
  ],
  "steps": [
    {
      "id": 41,
      "type": "assign",
      "from": {
        "location": "incoming",
        "name": "regex",
        "ptr": ""
      },
      "to": {
        "location": "method",
        "name": 29,
        "ptr": "/args/0/value"
      }
    },
    {
      "id": 42,
      "type": "assign",
      "from": {
        "location": "incoming",
        "name": "regex",
        "ptr": ""
      },
      "to": {
        "location": "method",
        "name": 22,
        "ptr": "/args/0/value"
      }
    },
    {
      "id": 43,
      "type": "assign",
      "from": {
        "location": "incoming",
        "name": "regex",
        "ptr": ""
      },
      "to": {
        "location": "method",
        "name": 14,
        "ptr": "/args/0/value"
      }
    },
    {
      "id": 44,
      "type": "assign",
      "from": {
        "location": "incoming",
        "name": "regex",
        "ptr": ""
      },
      "to": {
        "location": "method",
        "name": 19,
        "ptr": "/args/0/value"
      }
    },
    {
      "id": 48,
      "type": "assign",
      "from": {
        "location": "incoming",
        "name": "str",
        "ptr": ""
      },
      "to": {
        "location": "method",
        "name": 46,
        "ptr": "/args/0/value"
      }
    },
    {
      "id": 22,
      "type": "method",
      "library": "String",
      "method": "lastIndexOf",
      "args": [
        null,
        "/",
        null
      ],
      "view": {
        "row": 4,
        "col": 1
      }
    },
    {
      "id": 29,
      "type": "method",
      "library": "String",
      "method": "indexOf",
      "args": [
        null,
        "/",
        null
      ],
      "view": {
        "row": 3,
        "col": 1
      }
    },
    {
      "id": 27,
      "type": "assign",
      "from": {
        "location": "method",
        "name": 22,
        "ptr": "/return"
      },
      "to": {
        "location": "method",
        "name": 14,
        "ptr": "/args/2/value"
      }
    },
    {
      "id": 36,
      "type": "assign",
      "from": {
        "location": "method",
        "name": 29,
        "ptr": "/return"
      },
      "to": {
        "location": "method",
        "name": 32,
        "ptr": "/args/0/value"
      }
    },
    {
      "id": 37,
      "type": "assign",
      "from": {
        "location": "method",
        "name": 22,
        "ptr": "/return"
      },
      "to": {
        "location": "method",
        "name": 33,
        "ptr": "/args/0/value"
      }
    },
    {
      "id": 32,
      "type": "method",
      "library": "Math",
      "method": "add",
      "args": [
        null,
        1
      ],
      "view": {
        "row": 3,
        "col": 2
      }
    },
    {
      "id": 33,
      "type": "method",
      "library": "Math",
      "method": "add",
      "args": [
        null,
        1
      ],
      "view": {
        "row": 5,
        "col": 2
      }
    },
    {
      "id": 34,
      "type": "assign",
      "from": {
        "location": "method",
        "name": 32,
        "ptr": "/return"
      },
      "to": {
        "location": "method",
        "name": 14,
        "ptr": "/args/1/value"
      }
    },
    {
      "id": 35,
      "type": "assign",
      "from": {
        "location": "method",
        "name": 33,
        "ptr": "/return"
      },
      "to": {
        "location": "method",
        "name": 19,
        "ptr": "/args/1/value"
      }
    },
    {
      "id": 19,
      "type": "method",
      "library": "String",
      "method": "substring",
      "args": [
        null,
        null,
        null
      ],
      "view": {
        "row": 3,
        "col": 4
      }
    },
    {
      "id": 21,
      "type": "assign",
      "from": {
        "location": "method",
        "name": 19,
        "ptr": "/return"
      },
      "to": {
        "location": "declaration",
        "name": 1,
        "ptr": "/args/1/value"
      }
    },
    {
      "id": 14,
      "type": "method",
      "library": "String",
      "method": "substring",
      "args": [
        null,
        null,
        null
      ],
      "view": {
        "row": 2,
        "col": 4
      }
    },
    {
      "id": 18,
      "type": "assign",
      "from": {
        "location": "method",
        "name": 14,
        "ptr": "/return"
      },
      "to": {
        "location": "declaration",
        "name": 1,
        "ptr": "/args/0/value"
      }
    },
    {
      "id": 1,
      "type": "declaration",
      "library": "RegExp",
      "method": "new RegExp",
      "args": [
        null,
        null
      ],
      "view": {
        "row": 2,
        "col": 5
      }
    },
    {
      "id": 47,
      "type": "assign",
      "from": {
        "location": "declaration",
        "name": 1,
        "ptr": "/return"
      },
      "to": {
        "location": "method",
        "name": 46,
        "ptr": "/args/1/value"
      }
    },
    {
      "id": 46,
      "type": "method",
      "library": "String",
      "method": "match",
      "args": [
        null,
        null
      ],
      "view": {
        "row": 1,
        "col": 7
      }
    },
    {
      "id": 49,
      "type": "assign",
      "from": {
        "location": "method",
        "name": 46,
        "ptr": "/return"
      },
      "to": {
        "location": "outgoing",
        "name": "matchedArray",
        "ptr": ""
      }
    }
  ],
  "functions": [],
  "view": {
    "col": 7,
    "row": 7
  },
  "created": "2020-07-10T20:29:19.222Z",
  "createdBy": {
    "_id": "5ea891b0f698b67ebe7ef1e1",
    "provenance": "Itential LDAP",
    "username": "itential-artifacts"
  },
  "lastUpdated": "2020-07-10T20:29:19.222Z",
  "lastUpdatedBy": {
    "_id": "5ea891b0f698b67ebe7ef1e1",
    "provenance": "Itential LDAP",
    "username": "itential-artifacts"
  }
}
