{
  "name": "Push Bundles to Gitlab Adapter Compliance Commit",
  "tasks": {
    "2602": {
      "name": "makeData",
      "canvasName": "makeData",
      "summary": "Convert input into a different data type",
      "description": "This task takes an input and converts it to a different data type. For example, converting a number into a string.",
      "location": "Application",
      "locationType": null,
      "app": "WorkFlowEngine",
      "type": "automatic",
      "displayName": "Tools",
      "variables": {
        "incoming": {
          "input": "$var.dc5c.return_data",
          "outputType": "json",
          "variables": ""
        },
        "outgoing": {
          "output": null
        },
        "error": ""
      },
      "deprecated": false,
      "matched": [
        {
          "key": "canvasName",
          "highlightString": "<span class='highlight-string'>makeData</span>"
        }
      ],
      "groups": [],
      "actor": "Pronghorn",
      "x": 0.5462735462735463,
      "y": 0.361228813559322,
      "scheduled": false
    },
    "9203": {
      "name": "transformation",
      "canvasName": "transformation",
      "summary": "JSON Transformation",
      "description": "Perform a JSON Transformation using the JST library.",
      "location": "Application",
      "locationType": null,
      "app": "WorkFlowEngine",
      "type": "operation",
      "displayName": "WorkFlowEngine",
      "variables": {
        "incoming": {
          "tr_id": "6075bf108c016f0098c7284b",
          "variableMap": {
            "filterableArray": "$var.7f36.return_data",
            "keyToFilterOn": "file_path",
            "valueToFind": "package.json",
            "discardMatching": false
          },
          "options": {
            "extractOutput": true,
            "validateIncoming": true,
            "revertToDefaultValue": true
          }
        },
        "outgoing": {
          "filteredArray": null,
          "firstFilteredElement": null
        }
      },
      "deprecated": false,
      "matched": [
        {
          "key": "description",
          "highlightString": "Perform a JSON Transformation using the <span class='highlight-string'>JST</span> library."
        }
      ],
      "groups": [],
      "x": 0.22194922194922195,
      "y": 0.4978813559322034,
      "task_name": "CompliancefilterArrayOfObjectsGitlab"
    },
    "workflow_start": {
      "name": "workflow_start",
      "groups": [],
      "x": -0.23177723177723178,
      "y": 0.4968220338983051
    },
    "workflow_end": {
      "name": "workflow_end",
      "groups": [],
      "x": 2.0106470106470105,
      "y": 0.4555084745762712
    },
    "6db": {
      "name": "makeData",
      "canvasName": "makeData",
      "summary": "Convert input into a different data type",
      "description": "This task takes an input and converts it to a different data type. For example, converting a number into a string.",
      "location": "Application",
      "locationType": null,
      "app": "WorkFlowEngine",
      "type": "automatic",
      "displayName": "Tools",
      "variables": {
        "incoming": {
          "input": "$var.job.artifact",
          "outputType": "json",
          "variables": ""
        },
        "outgoing": {
          "output": null
        },
        "error": ""
      },
      "deprecated": false,
      "matched": [
        {
          "key": "canvasName",
          "highlightString": "<span class='highlight-string'>makeData</span>"
        }
      ],
      "groups": [],
      "actor": "Pronghorn",
      "x": 0.021294021294021293,
      "y": 0.4915254237288136,
      "scheduled": false
    },
    "7f36": {
      "name": "query",
      "canvasName": "query",
      "summary": "Query Data Using 'json-query' Format",
      "description": "Query data using a dot/bracket notation string and a matching key/value pair.",
      "location": "Application",
      "locationType": null,
      "app": "WorkFlowEngine",
      "type": "operation",
      "displayName": "WorkFlowEngine",
      "variables": {
        "incoming": {
          "pass_on_null": false,
          "query": "actions",
          "obj": "$var.6db.output"
        },
        "outgoing": {
          "return_data": null
        },
        "error": ""
      },
      "deprecated": false,
      "matched": [
        {
          "key": "canvasName",
          "highlightString": "<span class='highlight-string'>query</span>"
        },
        {
          "key": "summary",
          "highlightString": "<span class='highlight-string'>Query</span> Data Using 'json-query' Format"
        },
        {
          "key": "description",
          "highlightString": "<span class='highlight-string'>Query</span> data using a dot/bracket notation string and a matching key/value pair."
        }
      ],
      "groups": [],
      "x": 0.1506961506961507,
      "y": 0.4894067796610169,
      "scheduled": false
    },
    "dc5c": {
      "name": "query",
      "canvasName": "query",
      "summary": "Query Data Using 'json-query' Format",
      "description": "Query data using a dot/bracket notation string and a matching key/value pair.",
      "location": "Application",
      "locationType": null,
      "app": "WorkFlowEngine",
      "type": "operation",
      "displayName": "WorkFlowEngine",
      "variables": {
        "incoming": {
          "pass_on_null": false,
          "query": "content",
          "obj": "$var.9203.firstFilteredElement"
        },
        "outgoing": {
          "return_data": null
        },
        "error": ""
      },
      "deprecated": false,
      "matched": [
        {
          "key": "canvasName",
          "highlightString": "<span class='highlight-string'>query</span>"
        },
        {
          "key": "summary",
          "highlightString": "<span class='highlight-string'>Query</span> Data Using 'json-query' Format"
        },
        {
          "key": "description",
          "highlightString": "<span class='highlight-string'>Query</span> data using a dot/bracket notation string and a matching key/value pair."
        }
      ],
      "groups": [],
      "x": 0.4168714168714169,
      "y": 0.3675847457627119,
      "scheduled": false
    },
    "6a80": {
      "name": "query",
      "canvasName": "query",
      "summary": "Get description",
      "description": "Query data using a dot/bracket notation string and a matching key/value pair.",
      "location": "Application",
      "locationType": null,
      "app": "WorkFlowEngine",
      "type": "operation",
      "displayName": "WorkFlowEngine",
      "variables": {
        "incoming": {
          "pass_on_null": false,
          "query": "description",
          "obj": "$var.2602.output"
        },
        "outgoing": {
          "return_data": null
        },
        "error": ""
      },
      "deprecated": false,
      "matched": [
        {
          "key": "canvasName",
          "highlightString": "<span class='highlight-string'>query</span>"
        },
        {
          "key": "summary",
          "highlightString": "<span class='highlight-string'>Query</span> Data Using 'json-query' Format"
        },
        {
          "key": "description",
          "highlightString": "<span class='highlight-string'>Query</span> data using a dot/bracket notation string and a matching key/value pair."
        }
      ],
      "groups": [],
      "x": 0.665028665028665,
      "y": 0.3601694915254237,
      "scheduled": false
    },
    "3ffa": {
      "name": "makeData",
      "canvasName": "makeData",
      "summary": "Make Payload",
      "description": "This task takes an input and converts it to a different data type. For example, converting a number into a string.",
      "location": "Application",
      "locationType": null,
      "app": "WorkFlowEngine",
      "type": "automatic",
      "displayName": "Tools",
      "variables": {
        "incoming": {
          "input": "{\n\"approvals_before_merge\": 1,\n\"reset_approvals_on_push\": false,\n\"disable_overriding_approvers_per_merge_request\": false,\n\"merge_requests_author_approval\": false,\n\"merge_requests_disable_committers_approval\": false,\n  \"require_password_to_approve\": true\n}",
          "outputType": "json",
          "variables": ""
        },
        "outgoing": {
          "output": null
        },
        "error": ""
      },
      "deprecated": false,
      "matched": [
        {
          "key": "canvasName",
          "highlightString": "<span class='highlight-string'>makeData</span>"
        }
      ],
      "groups": [],
      "actor": "Pronghorn",
      "x": 1.1687141687141687,
      "y": 0.5296610169491526,
      "scheduled": false
    },
    "335e": {
      "name": "ViewData",
      "canvasName": "ViewData",
      "summary": "SOC2 Compliance Repository Check",
      "description": "Displays a message and runtime data to an operator. This can be used to request a decision, or used for acknowledgement only.",
      "location": "Application",
      "app": "WorkFlowEngine",
      "displayName": "Tools",
      "type": "manual",
      "variables": {
        "incoming": {
          "header": "SOC2 Compliance Repository Check",
          "message": "",
          "body": "For IAP - Cloud platform we are pursuing SOC2 compliance. For all Git Repositories, SOC2 compliance requires the following compliance on all repositories.\n<p>1 - GitLab repositories must have a <span style=\"color: red;\">description</span> <br />2 - GitLab repositories must have <span style=\"color: red;\">protected branches</span> <br />3 - Every Merge request should require at least 1 merge reviewer. <br /><br /><strong>This repo is not compliant with the SOC2 Compliance, Kindly make sure the above rules are followed, Please contact Gitlab Administrator for assistance setting merge reviewer </strong></p>",
          "btn_success": "Retry",
          "btn_failure": "Skip and set Manually"
        },
        "outgoing": {},
        "error": ""
      },
      "view": "/workflow_engine/task/ViewData",
      "deprecated": false,
      "matched": [
        {
          "key": "canvasName",
          "highlightString": "<span class='highlight-string'>ViewData</span>"
        }
      ],
      "groups": [],
      "x": 1.5389025389025388,
      "y": 0.211864406779661,
      "scheduled": false
    },
    "dfe5": {
      "name": "merge",
      "canvasName": "merge",
      "summary": "Merge Data",
      "description": "Merge data into a single object",
      "location": "Application",
      "locationType": null,
      "app": "WorkFlowEngine",
      "type": "operation",
      "displayName": "WorkFlowEngine",
      "variables": {
        "incoming": {
          "data_to_merge": [
            {
              "key": "description",
              "value": {
                "task": "6a80",
                "variable": "return_data"
              }
            }
          ]
        },
        "outgoing": {
          "merged_object": null
        }
      },
      "deprecated": false,
      "matched": [
        {
          "key": "canvasName",
          "highlightString": "<span class='highlight-string'>merge</span>"
        },
        {
          "key": "summary",
          "highlightString": "<span class='highlight-string'>Merge</span> Data"
        },
        {
          "key": "description",
          "highlightString": "<span class='highlight-string'>Merge</span> data into a single object"
        }
      ],
      "groups": [],
      "x": 0.7698607698607699,
      "y": 0.3527542372881356
    },
    "5b8a": {
      "name": "newVariable",
      "canvasName": "newVariable",
      "summary": "Create a Job Variable",
      "description": "Create a new Job variable by Job ID and assign it a value.",
      "location": "Application",
      "locationType": null,
      "app": "WorkFlowEngine",
      "type": "operation",
      "displayName": "WorkFlowEngine",
      "variables": {
        "incoming": {
          "name": "descriptionFlag",
          "value": false
        },
        "outgoing": {
          "value": null
        }
      },
      "deprecated": false,
      "matched": [
        {
          "key": "summary",
          "highlightString": "Create a <span class='highlight-string'>Job</span> <span class='highlight-string'>Variable</span>"
        },
        {
          "key": "description",
          "highlightString": "Create a new <span class='highlight-string'>Job</span> <span class='highlight-string'>variable</span> by Job ID and assign it a value."
        },
        {
          "key": "canvasName",
          "highlightString": "new<span class='highlight-string'>Variable</span>"
        }
      ],
      "groups": [],
      "x": -0.12694512694512694,
      "y": 0.4957627118644068
    },
    "3c98": {
      "name": "newVariable",
      "canvasName": "newVariable",
      "summary": "Create a Job Variable",
      "description": "Create a new Job variable by Job ID and assign it a value.",
      "location": "Application",
      "locationType": null,
      "app": "WorkFlowEngine",
      "type": "operation",
      "displayName": "WorkFlowEngine",
      "variables": {
        "incoming": {
          "name": "approverflag",
          "value": false
        },
        "outgoing": {
          "value": null
        }
      },
      "deprecated": false,
      "matched": [
        {
          "key": "summary",
          "highlightString": "Create a <span class='highlight-string'>Job</span> <span class='highlight-string'>Variable</span>"
        },
        {
          "key": "description",
          "highlightString": "Create a new <span class='highlight-string'>Job</span> <span class='highlight-string'>variable</span> by Job ID and assign it a value."
        },
        {
          "key": "canvasName",
          "highlightString": "new<span class='highlight-string'>Variable</span>"
        }
      ],
      "groups": [],
      "x": 1.0360360360360361,
      "y": 0.5264830508474576
    },
    "bb0e": {
      "name": "modify",
      "canvasName": "modify",
      "summary": "Modify Data",
      "description": "Modify data",
      "location": "Application",
      "locationType": null,
      "app": "WorkFlowEngine",
      "type": "operation",
      "displayName": "WorkFlowEngine",
      "variables": {
        "incoming": {
          "object_to_update": "$var.job.descriptionFlag",
          "query": "",
          "new_value": true
        },
        "outgoing": {
          "updated_object": "$var.job.descriptionFlag"
        },
        "error": ""
      },
      "deprecated": false,
      "matched": [
        {
          "key": "canvasName",
          "highlightString": "<span class='highlight-string'>modify</span>"
        },
        {
          "key": "summary",
          "highlightString": "<span class='highlight-string'>Modify</span> Data"
        },
        {
          "key": "description",
          "highlightString": "<span class='highlight-string'>Modify</span> data"
        }
      ],
      "groups": [],
      "x": 1.0303030303030303,
      "y": 0.3580508474576271,
      "scheduled": false
    },
    "ec7c": {
      "name": "modify",
      "canvasName": "modify",
      "summary": "Modify Data",
      "description": "Modify data",
      "location": "Application",
      "locationType": null,
      "app": "WorkFlowEngine",
      "type": "operation",
      "displayName": "WorkFlowEngine",
      "variables": {
        "incoming": {
          "object_to_update": "$var.job.approverflag",
          "query": "",
          "new_value": true
        },
        "outgoing": {
          "updated_object": "$var.job.approverflag"
        },
        "error": ""
      },
      "deprecated": false,
      "matched": [
        {
          "key": "canvasName",
          "highlightString": "<span class='highlight-string'>modify</span>"
        },
        {
          "key": "summary",
          "highlightString": "<span class='highlight-string'>Modify</span> Data"
        },
        {
          "key": "description",
          "highlightString": "<span class='highlight-string'>Modify</span> data"
        }
      ],
      "groups": [],
      "x": 1.574938574938575,
      "y": 0.4417372881355932,
      "scheduled": false
    },
    "c451": {
      "name": "evaluation",
      "canvasName": "evaluation",
      "summary": "Run Evaluation Task",
      "description": "Run an evaluation",
      "location": "Application",
      "locationType": null,
      "app": "WorkFlowEngine",
      "type": "operation",
      "displayName": "WorkFlowEngine",
      "variables": {
        "incoming": {
          "all_true_flag": false,
          "evaluation_groups": [
            {
              "all_true_flag": true,
              "evaluations": [
                {
                  "query": "",
                  "operand_1": {
                    "variable": "descriptionFlag",
                    "task": "job"
                  },
                  "operator": "==",
                  "operand_2": {
                    "variable": true,
                    "task": "static"
                  }
                },
                {
                  "query": "",
                  "operand_1": {
                    "variable": "approverflag",
                    "task": "job"
                  },
                  "operator": "==",
                  "operand_2": {
                    "variable": true,
                    "task": "static"
                  }
                }
              ]
            }
          ]
        },
        "outgoing": {
          "return_value": null
        }
      },
      "deprecated": false,
      "matched": [
        {
          "key": "canvasName",
          "highlightString": "<span class='highlight-string'>eval</span>uation"
        },
        {
          "key": "summary",
          "highlightString": "Run <span class='highlight-string'>Eval</span>uation Task"
        },
        {
          "key": "description",
          "highlightString": "Run an <span class='highlight-string'>eval</span>uation"
        }
      ],
      "groups": [],
      "x": 1.7133497133497133,
      "y": 0.5084745762711864
    },
    "1e52": {
      "name": "arrayLength",
      "canvasName": "length",
      "summary": "Gets the length of an array.",
      "description": "Returns the number of elements in that array. The value is an unsigned, 32-bit integer  that is always numerically greater than the highest index in the array.",
      "location": "Application",
      "locationType": null,
      "app": "WorkFlowEngine",
      "type": "automatic",
      "displayName": "Array",
      "variables": {
        "incoming": {
          "arr": "$var.9203.filteredArray"
        },
        "outgoing": {
          "length": null
        },
        "error": ""
      },
      "deprecated": false,
      "matched": [
        {
          "key": "canvasName",
          "highlightString": "<span class='highlight-string'>length</span>"
        },
        {
          "key": "summary",
          "highlightString": "Gets the <span class='highlight-string'>length</span> of an array."
        }
      ],
      "groups": [],
      "actor": "Pronghorn",
      "x": 0.3357903357903358,
      "y": 0.5211864406779662,
      "scheduled": false
    },
    "765d": {
      "name": "evaluation",
      "canvasName": "evaluation",
      "summary": "Run Evaluation Task",
      "description": "Run an evaluation",
      "location": "Application",
      "locationType": null,
      "app": "WorkFlowEngine",
      "type": "operation",
      "displayName": "WorkFlowEngine",
      "variables": {
        "incoming": {
          "all_true_flag": false,
          "evaluation_groups": [
            {
              "all_true_flag": false,
              "evaluations": [
                {
                  "query": "",
                  "operand_1": {
                    "variable": "length",
                    "task": "1e52"
                  },
                  "operator": "!=",
                  "operand_2": {
                    "variable": 0,
                    "task": "static"
                  }
                }
              ]
            }
          ]
        },
        "outgoing": {
          "return_value": null
        }
      },
      "deprecated": false,
      "matched": [
        {
          "key": "canvasName",
          "highlightString": "<span class='highlight-string'>eval</span>uation"
        },
        {
          "key": "summary",
          "highlightString": "Run <span class='highlight-string'>Eval</span>uation Task"
        },
        {
          "key": "description",
          "highlightString": "Run an <span class='highlight-string'>eval</span>uation"
        }
      ],
      "groups": [],
      "x": 0.43652743652743653,
      "y": 0.5254237288135594
    },
    "646a": {
      "name": "putV4ProjectsId",
      "canvasName": "putV4ProjectsId",
      "summary": "Update an existing project",
      "description": "Update an existing project",
      "location": "Adapter",
      "locationType": "Gitlab",
      "app": "Gitlab",
      "type": "automatic",
      "displayName": "Gitlab",
      "variables": {
        "incoming": {
          "id": "$var.job.id",
          "body": "$var.dfe5.merged_object",
          "adapter_id": "$var.job.adapter_id"
        },
        "outgoing": {
          "result": null
        },
        "error": ""
      },
      "deprecated": false,
      "matched": [
        {
          "key": "canvasName",
          "highlightString": "<span class='highlight-string'>putV4ProjectsId</span>"
        }
      ],
      "groups": [],
      "actor": "Pronghorn",
      "x": 0.8901639344262295,
      "y": 0.3516949152542373,
      "scheduled": false
    },
    "b2c1": {
      "name": "approveV4Project",
      "canvasName": "approveV4Project",
      "summary": "Approve a single project",
      "description": "Approve a single project",
      "location": "Adapter",
      "locationType": "Gitlab",
      "app": "Gitlab",
      "type": "automatic",
      "displayName": "Gitlab",
      "variables": {
        "incoming": {
          "id": "$var.job.id",
          "body": "$var.3ffa.output",
          "adapter_id": "$var.job.adapter_id"
        },
        "outgoing": {
          "result": null
        },
        "error": ""
      },
      "deprecated": false,
      "matched": [
        {
          "key": "canvasName",
          "highlightString": "<span class='highlight-string'>approveV4Project</span>"
        }
      ],
      "groups": [],
      "actor": "Pronghorn",
      "x": 1.3319672131147542,
      "y": 0.524364406779661,
      "scheduled": false
    }
  },
  "transitions": {
    "2602": {
      "6a80": {
        "type": "standard",
        "state": "success"
      }
    },
    "9203": {
      "1e52": {
        "type": "standard",
        "state": "success"
      }
    },
    "workflow_start": {
      "5b8a": {
        "type": "standard",
        "state": "success"
      }
    },
    "workflow_end": {},
    "6db": {
      "7f36": {
        "type": "standard",
        "state": "success"
      }
    },
    "7f36": {
      "9203": {
        "type": "standard",
        "state": "success"
      }
    },
    "dc5c": {
      "2602": {
        "type": "standard",
        "state": "success"
      }
    },
    "6a80": {
      "dfe5": {
        "type": "standard",
        "state": "success"
      }
    },
    "3ffa": {
      "b2c1": {
        "type": "standard",
        "state": "success"
      }
    },
    "4ae1": {},
    "335e": {
      "workflow_end": {
        "type": "standard",
        "state": "failure"
      },
      "646a": {
        "type": "revert",
        "state": "success"
      }
    },
    "dfe5": {
      "646a": {
        "type": "standard",
        "state": "success"
      }
    },
    "5b8a": {
      "6db": {
        "type": "standard",
        "state": "success"
      }
    },
    "3c98": {
      "3ffa": {
        "type": "standard",
        "state": "success"
      }
    },
    "bb0e": {
      "3c98": {
        "type": "standard",
        "state": "success"
      }
    },
    "ec7c": {
      "c451": {
        "type": "standard",
        "state": "success"
      }
    },
    "c451": {
      "workflow_end": {
        "type": "standard",
        "state": "success"
      },
      "335e": {
        "type": "standard",
        "state": "failure"
      }
    },
    "1e52": {
      "765d": {
        "type": "standard",
        "state": "success"
      }
    },
    "765d": {
      "dc5c": {
        "type": "standard",
        "state": "success"
      },
      "3c98": {
        "type": "standard",
        "state": "failure"
      }
    },
    "d3d9": {},
    "646a": {
      "bb0e": {
        "type": "standard",
        "state": "success"
      },
      "3c98": {
        "type": "standard",
        "state": "error"
      }
    },
    "b2c1": {
      "c451": {
        "type": "standard",
        "state": "error"
      },
      "ec7c": {
        "type": "standard",
        "state": "success"
      }
    }
  },
  "font_size": 12,
  "created": "2021-02-28T15:10:28.932Z",
  "created_by": {
    "provenance": "local_aaa",
    "username": "admin@pronghorn",
    "firstname": "admin",
    "inactive": false,
    "email": ""
  },
  "createdVersion": "5.29.14-2020.2.7.0",
  "last_updated": "2021-04-13T17:55:40.032Z",
  "last_updated_by": {
    "provenance": "local_aaa",
    "username": "admin@pronghorn",
    "firstname": "admin",
    "inactive": false,
    "email": ""
  },
  "lastUpdatedVersion": "5.29.14-2020.2.17",
  "type": "automation",
  "description": "",
  "inputSchema": {
    "type": "object",
    "properties": {
      "artifact": {
        "title": "input",
        "type": "string",
        "examples": [
          "33"
        ]
      },
      "id": {
        "title": "id",
        "type": "string"
      },
      "adapter_id": {
        "type": [
          "array",
          "boolean",
          "null",
          "number",
          "object",
          "string"
        ]
      }
    },
    "required": [
      "artifact",
      "id",
      "adapter_id"
    ]
  },
  "outputSchema": {
    "type": "object",
    "properties": {
      "artifact": {
        "title": "input",
        "type": "string",
        "examples": [
          "33"
        ]
      },
      "id": {
        "title": "id",
        "type": "string"
      },
      "adapter_id": {
        "type": [
          "array",
          "boolean",
          "null",
          "number",
          "object",
          "string"
        ]
      },
      "_id": {
        "type": "string",
        "pattern": "^[0-9a-f]{24}$"
      },
      "initiator": {
        "type": "string"
      },
      "descriptionFlag": {
        "type": [
          "array",
          "string",
          "boolean",
          "integer",
          "number",
          "object"
        ],
        "examples": [
          "updated item"
        ]
      },
      "approverflag": {
        "type": [
          "array",
          "string",
          "boolean",
          "integer",
          "number",
          "object"
        ],
        "examples": [
          "updated item"
        ]
      }
    }
  },
  "tags": [],
  "groups": []
}
