{
  "_id": "6075bca78c016f0098c72842",
  "name": "mergeFormWithDiscoveryGitlab",
  "description": "",
  "incoming": [
    {
      "$id": "formOutput",
      "type": "object",
      "properties": {
        "components": {
          "type": "object",
          "properties": {
            "workflows": {
              "type": "array",
              "items": {
                "type": "object",
                "properties": {
                  "name": {
                    "type": "string",
                    "examples": [
                      "zackAll"
                    ]
                  }
                },
                "required": []
              }
            },
            "automations": {
              "type": "array",
              "items": {
                "type": "object",
                "properties": {
                  "name": {
                    "type": "string",
                    "examples": [
                      "zackAll"
                    ]
                  }
                },
                "required": []
              }
            },
            "jsonForms": {
              "type": "array",
              "items": {
                "type": "object",
                "properties": {
                  "name": {
                    "type": "string",
                    "examples": [
                      "zackAll"
                    ]
                  }
                },
                "required": []
              }
            },
            "templates": {
              "type": "array",
              "items": {
                "type": "object",
                "properties": {
                  "name": {
                    "type": "string",
                    "examples": [
                      "zackAll"
                    ]
                  }
                },
                "required": []
              }
            },
            "forms": {
              "type": "array",
              "items": {
                "type": "object",
                "properties": {
                  "name": {
                    "type": "string",
                    "examples": [
                      "zackAll"
                    ]
                  }
                },
                "required": []
              }
            },
            "commandTemplates": {
              "type": "array",
              "items": {
                "type": "object",
                "properties": {
                  "name": {
                    "type": "string",
                    "examples": [
                      "zackAll"
                    ]
                  }
                },
                "required": []
              }
            },
            "analyticTemplates": {
              "type": "array",
              "items": {
                "type": "object",
                "properties": {
                  "name": {
                    "type": "string",
                    "examples": [
                      "zackAll"
                    ]
                  }
                },
                "required": []
              }
            },
            "goldenConfigTrees": {
              "type": "array"
            },
            "transformations": {
              "type": "array",
              "items": {
                "type": "object",
                "properties": {
                  "name": {
                    "type": "string",
                    "examples": [
                      "zackAll"
                    ]
                  },
                  "id": {
                    "type": "string",
                    "examples": [
                      "5f7c62b43451a606c2fb0305"
                    ]
                  }
                },
                "required": []
              }
            }
          },
          "required": []
        }
      },
      "required": []
    },
    {
      "$id": "discoveryOutput",
      "type": "object",
      "properties": {
        "componentMap": {
          "type": "object",
          "properties": {
            "workflow": {
              "type": "array",
              "items": {
                "type": "object",
                "properties": {
                  "name": {
                    "type": "string",
                    "examples": [
                      "zackAll"
                    ]
                  },
                  "parent": {
                    "type": "array",
                    "items": {
                      "type": "object",
                      "properties": {
                        "name": {
                          "type": "string",
                          "examples": [
                            "zackAll"
                          ]
                        },
                        "type": {
                          "type": "string",
                          "examples": [
                            "ac-agenda-job"
                          ]
                        }
                      },
                      "required": []
                    }
                  }
                },
                "required": []
              }
            },
            "ac-agenda-job": {
              "type": "array",
              "items": {
                "type": "object",
                "properties": {
                  "name": {
                    "type": "string",
                    "examples": [
                      "zackAll"
                    ]
                  },
                  "_id": {
                    "type": "string",
                    "examples": [
                      "5f7c622d038374d99a024d66"
                    ]
                  }
                },
                "required": []
              }
            },
            "transformation": {
              "type": "array",
              "items": {
                "type": "object",
                "properties": {
                  "id": {
                    "type": "string",
                    "examples": [
                      "5f7c62b43451a606c2fb0305"
                    ]
                  },
                  "parent": {
                    "type": "array",
                    "items": {
                      "type": "object",
                      "properties": {
                        "name": {
                          "type": "string",
                          "examples": [
                            "zackAll"
                          ]
                        },
                        "type": {
                          "type": "string",
                          "examples": [
                            "workflow"
                          ]
                        }
                      },
                      "required": []
                    }
                  }
                },
                "required": []
              }
            },
            "mop-template": {
              "type": "array",
              "items": {
                "type": "object",
                "properties": {
                  "name": {
                    "type": "string",
                    "examples": [
                      "zackAll"
                    ]
                  },
                  "parent": {
                    "type": "array",
                    "items": {
                      "type": "object",
                      "properties": {
                        "name": {
                          "type": "string",
                          "examples": [
                            "zackAll"
                          ]
                        },
                        "type": {
                          "type": "string",
                          "examples": [
                            "workflow"
                          ]
                        }
                      },
                      "required": []
                    }
                  }
                },
                "required": []
              }
            },
            "template": {
              "type": "array",
              "items": {
                "type": "object",
                "properties": {
                  "name": {
                    "type": "string",
                    "examples": [
                      "zackAll"
                    ]
                  },
                  "parent": {
                    "type": "array",
                    "items": {
                      "type": "object",
                      "properties": {
                        "name": {
                          "type": "string",
                          "examples": [
                            "zackAll"
                          ]
                        },
                        "type": {
                          "type": "string",
                          "examples": [
                            "workflow"
                          ]
                        }
                      },
                      "required": []
                    }
                  }
                },
                "required": []
              }
            },
            "mop-analytic-template": {
              "type": "array",
              "items": {
                "type": "object",
                "properties": {
                  "name": {
                    "type": "string",
                    "examples": [
                      "zackAll"
                    ]
                  },
                  "parent": {
                    "type": "array",
                    "items": {
                      "type": "object",
                      "properties": {
                        "name": {
                          "type": "string",
                          "examples": [
                            "zackAll"
                          ]
                        },
                        "type": {
                          "type": "string",
                          "examples": [
                            "workflow"
                          ]
                        }
                      },
                      "required": []
                    }
                  }
                },
                "required": []
              }
            },
            "forms": {
              "type": "array",
              "items": {
                "type": "object",
                "properties": {
                  "name": {
                    "type": "string",
                    "examples": [
                      "zackAll"
                    ]
                  },
                  "parent": {
                    "type": "array",
                    "items": {
                      "type": "object",
                      "properties": {
                        "name": {
                          "type": "string",
                          "examples": [
                            "zackAll"
                          ]
                        },
                        "type": {
                          "type": "string",
                          "examples": [
                            "workflow"
                          ]
                        }
                      },
                      "required": []
                    }
                  }
                },
                "required": []
              }
            },
            "json-forms": {
              "type": "array",
              "items": {
                "type": "object",
                "properties": {
                  "name": {
                    "type": "string",
                    "examples": [
                      "zackAll"
                    ]
                  },
                  "parent": {
                    "type": "array",
                    "items": {
                      "type": "object",
                      "properties": {
                        "name": {
                          "type": "string",
                          "examples": [
                            "zackAll"
                          ]
                        },
                        "type": {
                          "type": "string",
                          "examples": [
                            "workflow"
                          ]
                        }
                      },
                      "required": []
                    }
                  }
                },
                "required": []
              }
            },
            "golden-config": {
              "type": "array",
              "items": {
                "type": "object",
                "properties": {
                  "treeId": {
                    "type": "string",
                    "examples": [
                      "zackAll"
                    ]
                  },
                  "parent": {
                    "type": "array",
                    "items": {
                      "type": "object",
                      "properties": {
                        "name": {
                          "type": "string",
                          "examples": [
                            "zackAll"
                          ]
                        },
                        "type": {
                          "type": "string",
                          "examples": [
                            "workflow"
                          ]
                        }
                      },
                      "required": []
                    }
                  }
                },
                "required": []
              }
            }
          },
          "required": []
        },
        "dependencies": {
          "type": "array",
          "items": {
            "type": "string",
            "examples": [
              "@itential/app-workflow_engine"
            ]
          }
        },
        "invalidComponents": {
          "type": "array",
          "items": {
            "type": "object",
            "properties": {
              "type": {
                "type": "string",
                "examples": [
                  "golden-config"
                ]
              },
              "component": {
                "type": "object",
                "properties": {
                  "treeId": {
                    "type": "string",
                    "examples": [
                      "zackAll"
                    ]
                  },
                  "parent": {
                    "type": "array",
                    "items": {
                      "type": "object",
                      "properties": {
                        "name": {
                          "type": "string",
                          "examples": [
                            "zackAll"
                          ]
                        },
                        "type": {
                          "type": "string",
                          "examples": [
                            "workflow"
                          ]
                        }
                      },
                      "required": []
                    }
                  }
                },
                "required": []
              }
            },
            "required": []
          }
        }
      },
      "required": []
    }
  ],
  "outgoing": [
    {
      "$id": "formInput",
      "type": "object",
      "properties": {
        "components": {
          "type": "object",
          "properties": {
            "workflows": {
              "type": "array",
              "items": {
                "type": "object",
                "properties": {
                  "name": {
                    "type": "string",
                    "examples": [
                      "zackAll"
                    ]
                  }
                },
                "required": []
              }
            },
            "automations": {
              "type": "array",
              "items": {
                "type": "object",
                "properties": {
                  "name": {
                    "type": "string",
                    "examples": [
                      "zackAll"
                    ]
                  }
                },
                "required": []
              }
            },
            "jsonForms": {
              "type": "array",
              "items": {
                "type": "object",
                "properties": {
                  "name": {
                    "type": "string",
                    "examples": [
                      "zackAll"
                    ]
                  }
                },
                "required": []
              }
            },
            "templates": {
              "type": "array",
              "items": {
                "type": "object",
                "properties": {
                  "name": {
                    "type": "string",
                    "examples": [
                      "zackAll"
                    ]
                  }
                },
                "required": []
              }
            },
            "forms": {
              "type": "array",
              "items": {
                "type": "object",
                "properties": {
                  "name": {
                    "type": "string",
                    "examples": [
                      "zackAll"
                    ]
                  }
                },
                "required": []
              }
            },
            "commandTemplates": {
              "type": "array",
              "items": {
                "type": "object",
                "properties": {
                  "name": {
                    "type": "string",
                    "examples": [
                      "zackAll"
                    ]
                  }
                },
                "required": []
              }
            },
            "analyticTemplates": {
              "type": "array",
              "items": {
                "type": "object",
                "properties": {
                  "name": {
                    "type": "string",
                    "examples": [
                      "zackAll"
                    ]
                  }
                },
                "required": []
              }
            },
            "goldenConfigTrees": {
              "type": "array"
            },
            "transformations": {
              "type": "array",
              "items": {
                "type": "object",
                "properties": {
                  "name": {
                    "type": "string",
                    "examples": [
                      "zackAll"
                    ]
                  },
                  "id": {
                    "type": "string",
                    "examples": [
                      "5f7c62b43451a606c2fb0305"
                    ]
                  }
                },
                "required": []
              }
            }
          },
          "required": []
        }
      },
      "required": []
    }
  ],
  "steps": [
    {
      "id": 2,
      "type": "assign",
      "from": {
        "location": "incoming",
        "name": "discoveryOutput",
        "ptr": "/componentMap/workflow"
      },
      "to": {
        "location": "method",
        "name": 1,
        "ptr": "/args/0/value"
      }
    },
    {
      "id": 3,
      "type": "assign",
      "from": {
        "location": "incoming",
        "name": "formOutput",
        "ptr": "/components/workflows"
      },
      "to": {
        "location": "method",
        "name": 1,
        "ptr": "/args/2/value"
      }
    },
    {
      "id": 12,
      "type": "assign",
      "from": {
        "location": "incoming",
        "name": "formOutput",
        "ptr": "/components/jsonForms"
      },
      "to": {
        "location": "method",
        "name": 6,
        "ptr": "/args/2/value"
      }
    },
    {
      "id": 13,
      "type": "assign",
      "from": {
        "location": "incoming",
        "name": "discoveryOutput",
        "ptr": "/componentMap/json-forms"
      },
      "to": {
        "location": "method",
        "name": 6,
        "ptr": "/args/0/value"
      }
    },
    {
      "id": 14,
      "type": "assign",
      "from": {
        "location": "incoming",
        "name": "formOutput",
        "ptr": "/components/templates"
      },
      "to": {
        "location": "method",
        "name": 7,
        "ptr": "/args/2/value"
      }
    },
    {
      "id": 15,
      "type": "assign",
      "from": {
        "location": "incoming",
        "name": "discoveryOutput",
        "ptr": "/componentMap/template"
      },
      "to": {
        "location": "method",
        "name": 7,
        "ptr": "/args/0/value"
      }
    },
    {
      "id": 16,
      "type": "assign",
      "from": {
        "location": "incoming",
        "name": "formOutput",
        "ptr": "/components/forms"
      },
      "to": {
        "location": "method",
        "name": 8,
        "ptr": "/args/2/value"
      }
    },
    {
      "id": 17,
      "type": "assign",
      "from": {
        "location": "incoming",
        "name": "discoveryOutput",
        "ptr": "/componentMap/forms"
      },
      "to": {
        "location": "method",
        "name": 8,
        "ptr": "/args/0/value"
      }
    },
    {
      "id": 18,
      "type": "assign",
      "from": {
        "location": "incoming",
        "name": "formOutput",
        "ptr": "/components/commandTemplates"
      },
      "to": {
        "location": "method",
        "name": 9,
        "ptr": "/args/2/value"
      }
    },
    {
      "id": 19,
      "type": "assign",
      "from": {
        "location": "incoming",
        "name": "discoveryOutput",
        "ptr": "/componentMap/mop-template"
      },
      "to": {
        "location": "method",
        "name": 9,
        "ptr": "/args/0/value"
      }
    },
    {
      "id": 21,
      "type": "assign",
      "from": {
        "location": "incoming",
        "name": "formOutput",
        "ptr": "/components/analyticTemplates"
      },
      "to": {
        "location": "method",
        "name": 20,
        "ptr": "/args/2/value"
      }
    },
    {
      "id": 22,
      "type": "assign",
      "from": {
        "location": "incoming",
        "name": "discoveryOutput",
        "ptr": "/componentMap/mop-analytic-template"
      },
      "to": {
        "location": "method",
        "name": 20,
        "ptr": "/args/0/value"
      }
    },
    {
      "id": 30,
      "type": "assign",
      "from": {
        "location": "incoming",
        "name": "discoveryOutput",
        "ptr": "/componentMap/transformation"
      },
      "to": {
        "location": "method",
        "name": 29,
        "ptr": "/args/0/value"
      }
    },
    {
      "id": 31,
      "type": "assign",
      "from": {
        "location": "incoming",
        "name": "formOutput",
        "ptr": "/components/transformations"
      },
      "to": {
        "location": "method",
        "name": 29,
        "ptr": "/args/2/value"
      }
    },
    {
      "id": 33,
      "type": "assign",
      "from": {
        "location": "incoming",
        "name": "discoveryOutput",
        "ptr": "/componentMap/ac-agenda-job"
      },
      "to": {
        "location": "outgoing",
        "name": "formInput",
        "ptr": "/components/automations"
      }
    },
    {
      "id": 1,
      "type": "method",
      "library": "Array",
      "method": "reduce",
      "args": [
        null,
        "ƒ_reduce_1",
        null
      ],
      "view": {
        "row": 1,
        "col": 2
      }
    },
    {
      "id": 6,
      "type": "method",
      "library": "Array",
      "method": "reduce",
      "args": [
        null,
        "ƒ_reduce_1",
        null
      ],
      "view": {
        "row": 3,
        "col": 2
      }
    },
    {
      "id": 7,
      "type": "method",
      "library": "Array",
      "method": "reduce",
      "args": [
        null,
        "ƒ_reduce_1",
        null
      ],
      "view": {
        "row": 4,
        "col": 2
      }
    },
    {
      "id": 8,
      "type": "method",
      "library": "Array",
      "method": "reduce",
      "args": [
        null,
        "ƒ_reduce_1",
        null
      ],
      "view": {
        "row": 5,
        "col": 2
      }
    },
    {
      "id": 9,
      "type": "method",
      "library": "Array",
      "method": "reduce",
      "args": [
        null,
        "ƒ_reduce_1",
        null
      ],
      "view": {
        "row": 6,
        "col": 2
      }
    },
    {
      "id": 20,
      "type": "method",
      "library": "Array",
      "method": "reduce",
      "args": [
        null,
        "ƒ_reduce_1",
        null
      ],
      "view": {
        "row": 7,
        "col": 2
      }
    },
    {
      "id": 29,
      "type": "method",
      "library": "Array",
      "method": "reduce",
      "args": [
        null,
        "ƒ_reduce_2",
        null
      ],
      "view": {
        "row": 9,
        "col": 2
      }
    },
    {
      "id": 4,
      "type": "assign",
      "from": {
        "location": "method",
        "name": 1,
        "ptr": "/return"
      },
      "to": {
        "location": "outgoing",
        "name": "formInput",
        "ptr": "/components/workflows"
      }
    },
    {
      "id": 24,
      "type": "assign",
      "from": {
        "location": "method",
        "name": 6,
        "ptr": "/return"
      },
      "to": {
        "location": "outgoing",
        "name": "formInput",
        "ptr": "/components/jsonForms"
      }
    },
    {
      "id": 25,
      "type": "assign",
      "from": {
        "location": "method",
        "name": 7,
        "ptr": "/return"
      },
      "to": {
        "location": "outgoing",
        "name": "formInput",
        "ptr": "/components/templates"
      }
    },
    {
      "id": 26,
      "type": "assign",
      "from": {
        "location": "method",
        "name": 8,
        "ptr": "/return"
      },
      "to": {
        "location": "outgoing",
        "name": "formInput",
        "ptr": "/components/forms"
      }
    },
    {
      "id": 27,
      "type": "assign",
      "from": {
        "location": "method",
        "name": 9,
        "ptr": "/return"
      },
      "to": {
        "location": "outgoing",
        "name": "formInput",
        "ptr": "/components/commandTemplates"
      }
    },
    {
      "id": 28,
      "type": "assign",
      "from": {
        "location": "method",
        "name": 20,
        "ptr": "/return"
      },
      "to": {
        "location": "outgoing",
        "name": "formInput",
        "ptr": "/components/analyticTemplates"
      }
    },
    {
      "id": 32,
      "type": "assign",
      "from": {
        "location": "method",
        "name": 29,
        "ptr": "/return"
      },
      "to": {
        "location": "outgoing",
        "name": "formInput",
        "ptr": "/components/transformations"
      }
    }
  ],
  "functions": [
    {
      "incoming": [
        {
          "type": "array",
          "items": {
            "type": "object",
            "properties": {
              "name": {
                "type": "string",
                "examples": [
                  "zackAll"
                ]
              }
            },
            "required": []
          },
          "$id": "accumulator"
        },
        {
          "type": "object",
          "properties": {
            "name": {
              "type": "string",
              "examples": [
                "zackAll"
              ]
            },
            "parent": {
              "type": "array",
              "items": {
                "type": "object",
                "properties": {
                  "name": {
                    "type": "string",
                    "examples": [
                      "zackAll"
                    ]
                  },
                  "type": {
                    "type": "string",
                    "examples": [
                      "ac-agenda-job"
                    ]
                  }
                },
                "required": []
              }
            }
          },
          "required": [],
          "$id": "currentValue"
        },
        {
          "title": "index",
          "type": "number",
          "optional": true,
          "$id": "index"
        },
        {
          "type": "array",
          "items": {
            "type": "object",
            "properties": {
              "name": {
                "type": "string",
                "examples": [
                  "zackAll"
                ]
              },
              "parent": {
                "type": "array",
                "items": {
                  "type": "object",
                  "properties": {
                    "name": {
                      "type": "string",
                      "examples": [
                        "zackAll"
                      ]
                    },
                    "type": {
                      "type": "string",
                      "examples": [
                        "ac-agenda-job"
                      ]
                    }
                  },
                  "required": []
                }
              }
            },
            "required": []
          },
          "$id": "array",
          "optional": true
        },
        {
          "$id": "thisArg",
          "type": "object",
          "properties": {},
          "isContext": true
        }
      ],
      "outgoing": [
        {
          "title": "accumulator",
          "type": [
            "array",
            "boolean",
            "number",
            "integer",
            "string",
            "object",
            "null"
          ],
          "$id": "accumulator"
        }
      ],
      "functions": [
        {
          "incoming": [
            {
              "$id": "accumulator",
              "type": "array",
              "items": {
                "type": "object",
                "properties": {
                  "name": {
                    "type": "string",
                    "examples": [
                      "zackAll"
                    ]
                  }
                },
                "required": []
              }
            },
            {
              "$id": "currentDiscoveredElement",
              "type": "object",
              "properties": {
                "name": {
                  "type": "string",
                  "examples": [
                    "zackAll"
                  ]
                },
                "parent": {
                  "type": "array",
                  "items": {
                    "type": "object",
                    "properties": {
                      "name": {
                        "type": "string",
                        "examples": [
                          "zackAll"
                        ]
                      },
                      "type": {
                        "type": "string",
                        "examples": [
                          "ac-agenda-job"
                        ]
                      }
                    },
                    "required": []
                  }
                }
              },
              "required": []
            }
          ],
          "outgoing": [
            {
              "$id": "isNewComponent",
              "type": "boolean",
              "examples": [
                true,
                false
              ]
            }
          ],
          "functions": [
            {
              "incoming": [
                {
                  "type": [
                    "array",
                    "boolean",
                    "number",
                    "integer",
                    "string",
                    "object",
                    "null"
                  ],
                  "$id": "accumulator"
                },
                {
                  "type": "object",
                  "properties": {
                    "name": {
                      "type": "string",
                      "examples": [
                        "zackAll"
                      ]
                    }
                  },
                  "required": [],
                  "$id": "currentValue"
                },
                {
                  "title": "index",
                  "type": "number",
                  "optional": true,
                  "$id": "index"
                },
                {
                  "$id": "array",
                  "type": "array",
                  "items": {
                    "type": "object",
                    "properties": {
                      "name": {
                        "type": "string",
                        "examples": [
                          "zackAll"
                        ]
                      }
                    },
                    "required": []
                  },
                  "optional": true
                },
                {
                  "$id": "thisArg",
                  "type": "object",
                  "properties": {
                    "name": {
                      "type": "string",
                      "examples": [
                        "zackAll"
                      ]
                    }
                  },
                  "isContext": true
                }
              ],
              "outgoing": [
                {
                  "title": "accumulator",
                  "type": [
                    "array",
                    "boolean",
                    "number",
                    "integer",
                    "string",
                    "object",
                    "null"
                  ],
                  "$id": "accumulator"
                }
              ],
              "functions": [],
              "name": "newCompunentCheck_reduce",
              "steps": [
                {
                  "id": 4,
                  "type": "assign",
                  "from": {
                    "location": "incoming",
                    "name": "thisArg",
                    "ptr": "/name"
                  },
                  "to": {
                    "location": "method",
                    "name": 3,
                    "ptr": "/args/1/value"
                  }
                },
                {
                  "id": 5,
                  "type": "assign",
                  "from": {
                    "location": "incoming",
                    "name": "currentValue",
                    "ptr": "/name"
                  },
                  "to": {
                    "location": "method",
                    "name": 3,
                    "ptr": "/args/0/value"
                  }
                },
                {
                  "id": 7,
                  "type": "assign",
                  "from": {
                    "location": "incoming",
                    "name": "accumulator",
                    "ptr": ""
                  },
                  "to": {
                    "location": "method",
                    "name": 1,
                    "ptr": "/args/2/value"
                  }
                },
                {
                  "id": 10,
                  "type": "declaration",
                  "library": "Number",
                  "method": "new Number",
                  "args": [
                    "0"
                  ],
                  "view": {
                    "row": 1,
                    "col": 1
                  }
                },
                {
                  "id": 11,
                  "type": "assign",
                  "from": {
                    "location": "declaration",
                    "name": 10,
                    "ptr": "/return"
                  },
                  "to": {
                    "location": "declaration",
                    "name": 8,
                    "ptr": "/args/0/value"
                  }
                },
                {
                  "id": 8,
                  "type": "declaration",
                  "library": "Boolean",
                  "method": "new Boolean",
                  "args": [
                    null
                  ],
                  "view": {
                    "row": 1,
                    "col": 2
                  }
                },
                {
                  "id": 3,
                  "type": "method",
                  "library": "Equality",
                  "method": "equality",
                  "args": [
                    null,
                    null
                  ],
                  "view": {
                    "row": 2,
                    "col": 1
                  }
                },
                {
                  "id": 9,
                  "type": "assign",
                  "from": {
                    "location": "declaration",
                    "name": 8,
                    "ptr": "/return"
                  },
                  "to": {
                    "location": "method",
                    "name": 1,
                    "ptr": "/args/1/value"
                  }
                },
                {
                  "id": 6,
                  "type": "assign",
                  "from": {
                    "location": "method",
                    "name": 3,
                    "ptr": "/return"
                  },
                  "to": {
                    "location": "method",
                    "name": 1,
                    "ptr": "/args/0/value"
                  }
                },
                {
                  "id": 1,
                  "type": "method",
                  "library": "Conditional",
                  "method": "ternary",
                  "args": [
                    null,
                    null,
                    null
                  ],
                  "view": {
                    "row": 1,
                    "col": 4
                  }
                },
                {
                  "id": 2,
                  "type": "assign",
                  "from": {
                    "location": "method",
                    "name": 1,
                    "ptr": "/return"
                  },
                  "to": {
                    "location": "outgoing",
                    "name": "accumulator",
                    "ptr": ""
                  }
                }
              ],
              "view": {
                "col": 4,
                "row": 6
              },
              "id": "ƒ_reduce_1",
              "comments": []
            }
          ],
          "name": "newComponentCheck",
          "steps": [
            {
              "id": 1,
              "type": "declaration",
              "library": "Boolean",
              "method": "new Boolean",
              "args": [
                "1"
              ],
              "view": {
                "row": 1,
                "col": 1
              }
            },
            {
              "id": 4,
              "type": "assign",
              "from": {
                "location": "incoming",
                "name": "accumulator",
                "ptr": ""
              },
              "to": {
                "location": "method",
                "name": 2,
                "ptr": "/args/0/value"
              }
            },
            {
              "id": 6,
              "type": "assign",
              "from": {
                "location": "incoming",
                "name": "currentDiscoveredElement",
                "ptr": "/name"
              },
              "to": {
                "location": "method",
                "name": 2,
                "ptr": "/args/3/value"
              }
            },
            {
              "id": 3,
              "type": "assign",
              "from": {
                "location": "declaration",
                "name": 1,
                "ptr": "/return"
              },
              "to": {
                "location": "method",
                "name": 2,
                "ptr": "/args/2/value"
              }
            },
            {
              "id": 2,
              "type": "method",
              "library": "Array",
              "method": "reduce",
              "args": [
                null,
                "ƒ_reduce_1",
                null,
                null
              ],
              "view": {
                "row": 2,
                "col": 2
              }
            },
            {
              "id": 5,
              "type": "assign",
              "from": {
                "location": "method",
                "name": 2,
                "ptr": "/return"
              },
              "to": {
                "location": "outgoing",
                "name": "isNewComponent",
                "ptr": ""
              }
            }
          ],
          "view": {
            "col": 2,
            "row": 6
          },
          "id": "userFunc_1",
          "comments": []
        }
      ],
      "name": "ƒ_reduce_1",
      "steps": [
        {
          "id": 2,
          "type": "assign",
          "from": {
            "location": "incoming",
            "name": "accumulator",
            "ptr": ""
          },
          "to": {
            "location": "function",
            "name": 1,
            "ptr": "/args/0/value"
          }
        },
        {
          "id": 3,
          "type": "assign",
          "from": {
            "location": "incoming",
            "name": "currentValue",
            "ptr": ""
          },
          "to": {
            "location": "function",
            "name": 1,
            "ptr": "/args/1/value"
          }
        },
        {
          "id": 6,
          "type": "assign",
          "from": {
            "location": "incoming",
            "name": "accumulator",
            "ptr": ""
          },
          "to": {
            "location": "method",
            "name": 4,
            "ptr": "/args/2/value"
          }
        },
        {
          "id": 7,
          "type": "declaration",
          "library": "Object",
          "method": "new Object",
          "args": [
            "{         \"name\": \"\"       }"
          ],
          "view": {
            "row": 3,
            "col": 1
          }
        },
        {
          "id": 11,
          "type": "assign",
          "from": {
            "location": "incoming",
            "name": "currentValue",
            "ptr": "/name"
          },
          "to": {
            "location": "method",
            "name": 8,
            "ptr": "/args/2/value"
          }
        },
        {
          "id": 12,
          "type": "assign",
          "from": {
            "location": "incoming",
            "name": "accumulator",
            "ptr": ""
          },
          "to": {
            "location": "method",
            "name": 9,
            "ptr": "/args/0/value"
          }
        },
        {
          "id": 10,
          "type": "assign",
          "from": {
            "location": "declaration",
            "name": 7,
            "ptr": "/return"
          },
          "to": {
            "location": "method",
            "name": 8,
            "ptr": "/args/0/value"
          }
        },
        {
          "id": 1,
          "type": "function",
          "function": "userFunc_1",
          "args": [
            null,
            null
          ],
          "view": {
            "row": 1,
            "col": 2
          }
        },
        {
          "id": 5,
          "type": "assign",
          "from": {
            "location": "function",
            "name": 1,
            "ptr": "/return/isNewComponent"
          },
          "to": {
            "location": "method",
            "name": 4,
            "ptr": "/args/0/value"
          }
        },
        {
          "id": 8,
          "type": "method",
          "library": "Object",
          "method": "setProperty",
          "args": [
            null,
            "name",
            null
          ],
          "view": {
            "row": 3,
            "col": 2
          }
        },
        {
          "id": 20,
          "type": "assign",
          "from": {
            "location": "method",
            "name": 8,
            "ptr": "/return"
          },
          "to": {
            "location": "method",
            "name": 9,
            "ptr": "/args/1/value"
          }
        },
        {
          "id": 9,
          "type": "method",
          "library": "Array",
          "method": "push",
          "args": [
            null,
            null
          ],
          "view": {
            "row": 3,
            "col": 3
          }
        },
        {
          "id": 14,
          "type": "assign",
          "from": {
            "location": "method",
            "name": 9,
            "ptr": "/return"
          },
          "to": {
            "location": "method",
            "name": 4,
            "ptr": "/args/1/value"
          }
        },
        {
          "id": 4,
          "type": "method",
          "library": "Conditional",
          "method": "ternary",
          "args": [
            null,
            null,
            null
          ],
          "view": {
            "row": 2,
            "col": 4
          }
        },
        {
          "id": 15,
          "type": "assign",
          "from": {
            "location": "method",
            "name": 4,
            "ptr": "/return"
          },
          "to": {
            "location": "outgoing",
            "name": "accumulator",
            "ptr": ""
          }
        }
      ],
      "view": {
        "col": 4,
        "row": 6
      },
      "id": "ƒ_reduce_1",
      "comments": []
    },
    {
      "incoming": [
        {
          "type": "array",
          "items": {
            "type": "object",
            "properties": {
              "name": {
                "type": "string",
                "examples": [
                  "zackAll"
                ]
              },
              "id": {
                "type": "string",
                "examples": [
                  "5f7c62b43451a606c2fb0305"
                ]
              }
            },
            "required": []
          },
          "$id": "accumulator"
        },
        {
          "type": "object",
          "properties": {
            "id": {
              "type": "string",
              "examples": [
                "5f7c62b43451a606c2fb0305"
              ]
            },
            "parent": {
              "type": "array",
              "items": {
                "type": "object",
                "properties": {
                  "name": {
                    "type": "string",
                    "examples": [
                      "zackAll"
                    ]
                  },
                  "type": {
                    "type": "string",
                    "examples": [
                      "workflow"
                    ]
                  }
                },
                "required": []
              }
            }
          },
          "required": [],
          "$id": "currentValue"
        },
        {
          "title": "index",
          "type": "number",
          "optional": true,
          "$id": "index"
        },
        {
          "type": "array",
          "items": {
            "type": "object",
            "properties": {
              "id": {
                "type": "string",
                "examples": [
                  "5f7c62b43451a606c2fb0305"
                ]
              },
              "parent": {
                "type": "array",
                "items": {
                  "type": "object",
                  "properties": {
                    "name": {
                      "type": "string",
                      "examples": [
                        "zackAll"
                      ]
                    },
                    "type": {
                      "type": "string",
                      "examples": [
                        "workflow"
                      ]
                    }
                  },
                  "required": []
                }
              }
            },
            "required": []
          },
          "$id": "array",
          "optional": true
        },
        {
          "$id": "thisArg",
          "type": "object",
          "properties": {},
          "isContext": true,
          "isThis": true
        }
      ],
      "outgoing": [
        {
          "title": "accumulator",
          "type": [
            "array",
            "boolean",
            "number",
            "integer",
            "string",
            "object",
            "null"
          ],
          "$id": "accumulator"
        }
      ],
      "functions": [
        {
          "incoming": [
            {
              "$id": "accumulator",
              "type": "array",
              "items": {
                "type": "object",
                "properties": {
                  "name": {
                    "type": "string",
                    "examples": [
                      "zackAll"
                    ]
                  },
                  "id": {
                    "type": "string",
                    "examples": [
                      "5f7c62b43451a606c2fb0305"
                    ]
                  }
                },
                "required": []
              }
            },
            {
              "$id": "curentDiscoveredJST",
              "type": "object",
              "properties": {
                "id": {
                  "type": "string",
                  "examples": [
                    "5f7c62b43451a606c2fb0305"
                  ]
                }
              },
              "required": []
            }
          ],
          "outgoing": [
            {
              "$id": "inNewComponent",
              "type": "boolean",
              "examples": [
                true,
                false
              ]
            }
          ],
          "functions": [
            {
              "incoming": [
                {
                  "type": [
                    "array",
                    "boolean",
                    "number",
                    "integer",
                    "string",
                    "object",
                    "null"
                  ],
                  "$id": "accumulator"
                },
                {
                  "type": "object",
                  "properties": {
                    "name": {
                      "type": "string",
                      "examples": [
                        "zackAll"
                      ]
                    },
                    "id": {
                      "type": "string",
                      "examples": [
                        "5f7c62b43451a606c2fb0305"
                      ]
                    }
                  },
                  "required": [],
                  "$id": "currentValue"
                },
                {
                  "title": "index",
                  "type": "number",
                  "optional": true,
                  "$id": "index"
                },
                {
                  "$id": "array",
                  "type": "array",
                  "items": {
                    "type": "object",
                    "properties": {
                      "name": {
                        "type": "string",
                        "examples": [
                          "zackAll"
                        ]
                      },
                      "id": {
                        "type": "string",
                        "examples": [
                          "5f7c62b43451a606c2fb0305"
                        ]
                      }
                    },
                    "required": []
                  },
                  "optional": true
                },
                {
                  "$id": "thisArg",
                  "type": "object",
                  "properties": {
                    "id": {
                      "type": "string",
                      "examples": [
                        "5f7c62b43451a606c2fb0305"
                      ]
                    }
                  },
                  "isContext": true,
                  "isThis": true
                }
              ],
              "outgoing": [
                {
                  "title": "accumulator",
                  "type": [
                    "array",
                    "boolean",
                    "number",
                    "integer",
                    "string",
                    "object",
                    "null"
                  ],
                  "$id": "accumulator"
                }
              ],
              "functions": [],
              "name": "newComponentCheck_JST_reduce",
              "steps": [
                {
                  "id": 5,
                  "type": "assign",
                  "from": {
                    "location": "incoming",
                    "name": "currentValue",
                    "ptr": "/id"
                  },
                  "to": {
                    "location": "method",
                    "name": 4,
                    "ptr": "/args/0/value"
                  }
                },
                {
                  "id": 6,
                  "type": "assign",
                  "from": {
                    "location": "incoming",
                    "name": "thisArg",
                    "ptr": "/id"
                  },
                  "to": {
                    "location": "method",
                    "name": 4,
                    "ptr": "/args/1/value"
                  }
                },
                {
                  "id": 8,
                  "type": "assign",
                  "from": {
                    "location": "incoming",
                    "name": "accumulator",
                    "ptr": ""
                  },
                  "to": {
                    "location": "method",
                    "name": 2,
                    "ptr": "/args/2/value"
                  }
                },
                {
                  "id": 10,
                  "type": "declaration",
                  "library": "Number",
                  "method": "new Number",
                  "args": [
                    "0"
                  ],
                  "view": {
                    "row": 1,
                    "col": 1
                  }
                },
                {
                  "id": 11,
                  "type": "assign",
                  "from": {
                    "location": "declaration",
                    "name": 10,
                    "ptr": "/return"
                  },
                  "to": {
                    "location": "declaration",
                    "name": 1,
                    "ptr": "/args/0/value"
                  }
                },
                {
                  "id": 1,
                  "type": "declaration",
                  "library": "Boolean",
                  "method": "new Boolean",
                  "args": [
                    null
                  ],
                  "view": {
                    "row": 1,
                    "col": 2
                  }
                },
                {
                  "id": 4,
                  "type": "method",
                  "library": "Equality",
                  "method": "equality",
                  "args": [
                    null,
                    null
                  ],
                  "view": {
                    "row": 3,
                    "col": 1
                  }
                },
                {
                  "id": 3,
                  "type": "assign",
                  "from": {
                    "location": "declaration",
                    "name": 1,
                    "ptr": "/return"
                  },
                  "to": {
                    "location": "method",
                    "name": 2,
                    "ptr": "/args/1/value"
                  }
                },
                {
                  "id": 7,
                  "type": "assign",
                  "from": {
                    "location": "method",
                    "name": 4,
                    "ptr": "/return"
                  },
                  "to": {
                    "location": "method",
                    "name": 2,
                    "ptr": "/args/0/value"
                  }
                },
                {
                  "id": 2,
                  "type": "method",
                  "library": "Conditional",
                  "method": "ternary",
                  "args": [
                    null,
                    null,
                    null
                  ],
                  "view": {
                    "row": 2,
                    "col": 2
                  }
                },
                {
                  "id": 9,
                  "type": "assign",
                  "from": {
                    "location": "method",
                    "name": 2,
                    "ptr": "/return"
                  },
                  "to": {
                    "location": "outgoing",
                    "name": "accumulator",
                    "ptr": ""
                  }
                }
              ],
              "view": {
                "col": 3,
                "row": 6
              },
              "id": "ƒ_reduce_1",
              "comments": []
            }
          ],
          "name": "newComponentCheck_transformations",
          "steps": [
            {
              "id": 1,
              "type": "declaration",
              "library": "Boolean",
              "method": "new Boolean",
              "args": [
                "1"
              ],
              "view": {
                "row": 1,
                "col": 1
              }
            },
            {
              "id": 4,
              "type": "assign",
              "from": {
                "location": "incoming",
                "name": "accumulator",
                "ptr": ""
              },
              "to": {
                "location": "method",
                "name": 2,
                "ptr": "/args/0/value"
              }
            },
            {
              "id": 5,
              "type": "assign",
              "from": {
                "location": "incoming",
                "name": "curentDiscoveredJST",
                "ptr": "/id"
              },
              "to": {
                "location": "method",
                "name": 2,
                "ptr": "/args/3/value"
              }
            },
            {
              "id": 3,
              "type": "assign",
              "from": {
                "location": "declaration",
                "name": 1,
                "ptr": "/return"
              },
              "to": {
                "location": "method",
                "name": 2,
                "ptr": "/args/2/value"
              }
            },
            {
              "id": 2,
              "type": "method",
              "library": "Array",
              "method": "reduce",
              "args": [
                null,
                "ƒ_reduce_1",
                null,
                null
              ],
              "view": {
                "row": 2,
                "col": 2
              }
            },
            {
              "id": 6,
              "type": "assign",
              "from": {
                "location": "method",
                "name": 2,
                "ptr": "/return"
              },
              "to": {
                "location": "outgoing",
                "name": "inNewComponent",
                "ptr": ""
              }
            }
          ],
          "view": {
            "col": 3,
            "row": 6
          },
          "id": "userFunc_1",
          "comments": []
        }
      ],
      "name": "ƒ_reduce_2",
      "steps": [
        {
          "id": 2,
          "type": "assign",
          "from": {
            "location": "incoming",
            "name": "accumulator",
            "ptr": ""
          },
          "to": {
            "location": "function",
            "name": 1,
            "ptr": "/args/0/value"
          },
          "REMOVE_STEP": true
        },
        {
          "id": 3,
          "type": "assign",
          "from": {
            "location": "incoming",
            "name": "currentValue",
            "ptr": ""
          },
          "to": {
            "location": "function",
            "name": 1,
            "ptr": "/args/1/value"
          }
        },
        {
          "id": 6,
          "type": "assign",
          "from": {
            "location": "incoming",
            "name": "accumulator",
            "ptr": ""
          },
          "to": {
            "location": "method",
            "name": 4,
            "ptr": "/args/2/value"
          }
        },
        {
          "id": 7,
          "type": "declaration",
          "library": "Object",
          "method": "new Object",
          "args": [
            "{}"
          ],
          "view": {
            "row": 3,
            "col": 1
          }
        },
        {
          "id": 10,
          "type": "assign",
          "from": {
            "location": "incoming",
            "name": "currentValue",
            "ptr": "/id"
          },
          "to": {
            "location": "method",
            "name": 8,
            "ptr": "/args/2/value"
          }
        },
        {
          "id": 13,
          "type": "assign",
          "from": {
            "location": "incoming",
            "name": "accumulator",
            "ptr": ""
          },
          "to": {
            "location": "method",
            "name": 11,
            "ptr": "/args/0/value"
          }
        },
        {
          "id": 9,
          "type": "assign",
          "from": {
            "location": "declaration",
            "name": 7,
            "ptr": "/return"
          },
          "to": {
            "location": "method",
            "name": 8,
            "ptr": "/args/0/value"
          }
        },
        {
          "id": 1,
          "type": "function",
          "function": "userFunc_1",
          "args": [
            null,
            null
          ],
          "view": {
            "row": 1,
            "col": 2
          }
        },
        {
          "id": 5,
          "type": "assign",
          "from": {
            "location": "function",
            "name": 1,
            "ptr": "/return/inNewComponent"
          },
          "to": {
            "location": "method",
            "name": 4,
            "ptr": "/args/0/value"
          }
        },
        {
          "id": 8,
          "type": "method",
          "library": "Object",
          "method": "setProperty",
          "args": [
            null,
            "id",
            null
          ],
          "view": {
            "row": 3,
            "col": 2
          }
        },
        {
          "id": 12,
          "type": "assign",
          "from": {
            "location": "method",
            "name": 8,
            "ptr": "/return"
          },
          "to": {
            "location": "method",
            "name": 11,
            "ptr": "/args/1/value"
          }
        },
        {
          "id": 11,
          "type": "method",
          "library": "Array",
          "method": "push",
          "args": [
            null,
            null
          ],
          "view": {
            "row": 3,
            "col": 3
          }
        },
        {
          "id": 14,
          "type": "assign",
          "from": {
            "location": "method",
            "name": 11,
            "ptr": "/return"
          },
          "to": {
            "location": "method",
            "name": 4,
            "ptr": "/args/1/value"
          }
        },
        {
          "id": 4,
          "type": "method",
          "library": "Conditional",
          "method": "ternary",
          "args": [
            null,
            null,
            null
          ],
          "view": {
            "row": 2,
            "col": 4
          }
        },
        {
          "id": 15,
          "type": "assign",
          "from": {
            "location": "method",
            "name": 4,
            "ptr": "/return"
          },
          "to": {
            "location": "outgoing",
            "name": "accumulator",
            "ptr": ""
          }
        }
      ],
      "view": {
        "col": 4,
        "row": 6
      },
      "id": "ƒ_reduce_2",
      "comments": []
    }
  ],
  "view": {
    "col": 4,
    "row": 10
  },
  "created": "2021-04-13T17:55:40.096Z",
  "createdBy": {
    "_id": "601424815f970e44a97f394a",
    "provenance": "local_aaa",
    "username": "admin@pronghorn"
  },
  "lastUpdated": "2021-04-13T17:55:40.096Z",
  "lastUpdatedBy": {
    "_id": "601424815f970e44a97f394a",
    "provenance": "local_aaa",
    "username": "admin@pronghorn"
  }
}