{
  "id": "606b357bcd3a32009690c1b3",
  "bindingSchema": {
    "properties": {
      "checkInArtifact": {
        "properties": {
          "gitLabAdapterName": {
            "binding:method": "GET",
            "binding:link": {
              "$ref": "/links",
              "rel": "collection"
            },
            "binding:target": {
              "propertyPointer": "/enum"
            },
            "binding:hyperSchema": {
              "type": "object",
              "base": "/health",
              "links": [
                {
                  "rel": "collection",
                  "href": "/adapters?equalsField=package_id&equals=@itentialopensource/adapter-gitlab",
                  "targetMediaType": "application/json",
                  "targetSchema": {
                    "$ref": "#"
                  },
                  "variables": []
                }
              ]
            },
            "binding:source": {
              "propertyPointer": "/results",
              "keyPointer": "/id"
            }
          },
          "artifact": {
            "binding:method": "GET",
            "binding:link": {
              "$ref": "/links",
              "rel": "collection"
            },
            "binding:target": {
              "propertyPointer": "/enum"
            },
            "binding:hyperSchema": {
              "type": "object",
              "base": "/prebuilts",
              "links": [
                {
                  "rel": "collection",
                  "href": "/ ",
                  "targetMediaType": "application/json",
                  "targetSchema": {
                    "$ref": "#"
                  },
                  "variables": []
                }
              ]
            },
            "binding:source": {
              "propertyPointer": "/results",
              "keyPointer": "/name"
            }
          },
          "forExistingGitLabProjects": {
            "properties": {}
          }
        }
      }
    }
  },
  "created": "2020-09-17T19:51:12.174Z",
  "createdBy": "clarisa.colton@itential.com",
  "description": null,
  "lastUpdated": "2022-05-24T19:26:53.007Z",
  "lastUpdatedBy": "clarisa.colton@itential.com",
  "name": "Push Bundles to Gitlab Adapter",
  "schema": {
    "title": "Push Bundles to Gitlab Adapter",
    "description": "",
    "type": "object",
    "required": [],
    "properties": {
      "checkInArtifact": {
        "type": "object",
        "title": "Check In Artifact",
        "description": "",
        "required": [
          "gitLabAdapterName",
          "gitLabProjectName",
          "gitLabGroupPath",
          "artifact"
        ],
        "properties": {
          "gitLabAdapterName": {
            "type": "string",
            "title": "GitLab Adapter Name",
            "_id": "/properties/checkInArtifact/properties/gitLabAdapterName",
            "description": "Select an adapter",
            "enum": []
          },
          "gitLabProjectName": {
            "type": "string",
            "title": "GitLab Project Name",
            "_id": "/properties/checkInArtifact/properties/gitLabProjectName",
            "description": "Project name for the GitLab repository."
          },
          "gitLabGroupPath": {
            "type": "string",
            "title": "GitLab Group Path",
            "_id": "/properties/checkInArtifact/properties/gitLabGroupPath",
            "description": "Link to the GitLab group to create the project under"
          },
          "reDiscoverArtifact": {
            "type": "boolean",
            "title": "Re-Discover Artifact",
            "_id": "/properties/checkInArtifact/properties/reDiscoverArtifact",
            "description": "Please check this box in case you've added or removed any IAP component (child workflow/form/template/etc.)",
            "default": false,
            "enum": [
              true,
              false
            ]
          },
          "artifact": {
            "type": "string",
            "title": "Artifact",
            "_id": "/properties/checkInArtifact/properties/artifact",
            "description": "Desired artifact to upload to GitLab",
            "enum": []
          },
          "forExistingGitLabProjects": {
            "type": "object",
            "title": "For Existing GitLab Projects",
            "description": "",
            "required": [
              "mrType",
              "commitMessage",
              "targetBranch"
            ],
            "properties": {
              "mrType": {
                "type": "string",
                "title": "MR Type",
                "_id": "/properties/checkInArtifact/properties/forExistingGitLabProjects/properties/mrType",
                "description": "Type of merge request (patch/minor/major)",
                "enum": [
                  "patch",
                  "minor",
                  "major"
                ]
              },
              "commitMessage": {
                "type": "string",
                "title": "Commit Message",
                "_id": "/properties/checkInArtifact/properties/forExistingGitLabProjects/properties/commitMessage",
                "description": "The message to put in with the commit"
              },
              "targetBranch": {
                "type": "string",
                "title": "Target Branch",
                "_id": "/properties/checkInArtifact/properties/forExistingGitLabProjects/properties/targetBranch",
                "description": "The branch desired for merging into the merge request"
              }
            }
          }
        }
      }
    }
  },
  "struct": {
    "nodeId": "9251ce6e-db72-4080-b3f1-86b340ba1add",
    "type": "array",
    "items": [
      {
        "nodeId": "505987cd-d6fc-4302-a2d0-0b6d68eec044",
        "type": "object",
        "description": "",
        "items": [
          {
            "nodeId": "637b1837-b609-4698-a0bf-fbfe1eaeaa07",
            "type": "string",
            "title": "GitLab Adapter Name",
            "description": "Select an adapter",
            "placeholder": "Select an item",
            "required": true,
            "enum": [],
            "binding": true,
            "rel": "collection",
            "targetPointer": "/enum",
            "base": "/health",
            "href": "/adapters?equalsField=package_id&equals=@itentialopensource/adapter-gitlab",
            "method": "GET",
            "sourcePointer": "/results",
            "sourceKeyPointer": "/id"
          },
          {
            "nodeId": "caf191bb-2851-44b0-92f1-9aa83413566c",
            "type": "string",
            "title": "GitLab Project Name",
            "description": "Project name for the GitLab repository.",
            "placeholder": "Enter text",
            "required": true
          },
          {
            "nodeId": "58e8670f-5fa1-47a8-8c26-e0155f9d9c3a",
            "type": "string",
            "title": "GitLab Group Path",
            "description": "Link to the GitLab group to create the project under",
            "placeholder": "itential/delivery/dsup",
            "required": true
          },
          {
            "nodeId": "fd106739-664a-4d51-a48b-74598d17c545",
            "type": "boolean",
            "title": "Re-Discover Artifact",
            "description": "Please check this box in case you've added or removed any IAP component (child workflow/form/template/etc.)",
            "default": false,
            "enum": [
              {
                "id": "bec790e9-1ce4-497a-a3c9-9bcbb6d44e75",
                "value": true
              },
              {
                "id": "5e3ec6ca-675e-4393-a5a7-d2d65bf355ab",
                "value": false
              }
            ]
          },
          {
            "nodeId": "ca5a34e8-8989-403a-800d-b17f713a49b5",
            "type": "string",
            "title": "Artifact",
            "description": "Desired artifact to upload to GitLab",
            "placeholder": "Select an Artifact",
            "required": true,
            "enum": [],
            "binding": true,
            "rel": "collection",
            "targetPointer": "/enum",
            "base": "/prebuilts",
            "href": "/ ",
            "method": "GET",
            "sourcePointer": "/results",
            "sourceKeyPointer": "/name",
            "originalHref": "/:id"
          },
          {
            "nodeId": "76f14d91-05ba-41a2-aa14-c6bfbb07e7a3",
            "type": "object",
            "description": "",
            "items": [
              {
                "nodeId": "293a11d4-b9fd-4bb1-82e3-021bec9c9743",
                "type": "string",
                "title": "MR Type",
                "description": "Type of merge request (patch/minor/major)",
                "placeholder": "Enter text",
                "required": true,
                "enum": [
                  {
                    "id": "3f87d31f-6465-4701-b0d3-7aa3b2e32f30",
                    "value": "patch"
                  },
                  {
                    "id": "74ea8535-8cdd-44fe-bfae-8b28717e86f1",
                    "value": "minor"
                  },
                  {
                    "id": "572e2ebe-8b19-43c3-9c55-8cf1fc723347",
                    "value": "major"
                  }
                ],
                "binding": false,
                "rel": "collection",
                "targetPointer": "/enum"
              },
              {
                "nodeId": "36d63b0b-bb1a-4f31-87ee-5e23bac03ae1",
                "type": "string",
                "title": "Commit Message",
                "description": "The message to put in with the commit",
                "placeholder": "Enter text",
                "required": true
              },
              {
                "nodeId": "cb55002f-3061-4bf0-a8f2-eaac5ebf8adb",
                "type": "string",
                "title": "Target Branch",
                "description": "The branch desired for merging into the merge request",
                "placeholder": "Enter text",
                "required": true
              }
            ],
            "title": "For Existing GitLab Projects"
          }
        ],
        "title": "Check In Artifact"
      }
    ]
  },
  "uiSchema": {
    "checkInArtifact": {
      "ui:collapseByDefault": false,
      "gitLabAdapterName": {
        "ui:placeholder": "Select an item"
      },
      "gitLabProjectName": {
        "ui:placeholder": "Enter text"
      },
      "gitLabGroupPath": {
        "ui:placeholder": "itential/delivery/dsup"
      },
      "artifact": {
        "ui:placeholder": "Select an Artifact"
      },
      "forExistingGitLabProjects": {
        "ui:collapseByDefault": false,
        "mrType": {
          "ui:placeholder": "Enter text"
        },
        "commitMessage": {
          "ui:placeholder": "Enter text"
        },
        "targetBranch": {
          "ui:placeholder": "Enter text"
        }
      }
    }
  },
  "validationSchema": {
    "checkInArtifact": {
      "forExistingGitLabProjects": {}
    }
  },
  "version": "2020.1"
}