{
  "_id": "6075bcbc8c016f0098c72845",
  "name": "createArtifactForPublishGitlab",
  "description": "",
  "incoming": [
    {
      "$id": "AEartifactInfo",
      "type": "object",
      "properties": {
        "_id": {
          "type": "string",
          "examples": [
            "5f7c62f0b80b0a2a91782437"
          ]
        },
        "name": {
          "type": "string",
          "examples": [
            "@itentialopensource/zackall"
          ]
        },
        "version": {
          "type": "string",
          "examples": [
            "0.0.1"
          ]
        },
        "description": {
          "type": "string",
          "examples": [
            "zackAll"
          ]
        },
        "author": {
          "type": "string",
          "examples": [
            "Itential Artifacts"
          ]
        },
        "repository": {
          "type": "object",
          "properties": {
            "type": {
              "type": "string",
              "examples": [
                "git"
              ]
            },
            "url": {
              "type": "string",
              "examples": [
                "https://gitlab.com/itentialopensource/pre-built-automations/"
              ]
            }
          },
          "required": []
        },
        "license": {
          "type": "string",
          "examples": [
            "Apache-2.0"
          ]
        },
        "keywords": {
          "type": "array",
          "items": {
            "type": "string",
            "examples": [
              "Itential"
            ]
          }
        },
        "IAPDependencies": {
          "type": "object",
          "properties": {
            "@itential/app-automation_catalog": {
              "type": "string"
            },
            "@itential/app-json_forms": {
              "type": "string"
            },
            "@itential/app-workflow_engine": {
              "type": "string"
            },
            "@itential/app-mop": {
              "type": "string"
            },
            "@itential/app-template_builder": {
              "type": "string"
            },
            "@itential/app-form_builder": {
              "type": "string"
            }
          },
          "required": []
        },
        "gitlabId": {
          "type": "integer",
          "examples": [
            1601987312797
          ]
        },
        "components": {
          "type": "array",
          "items": {
            "type": "object",
            "properties": {
              "type": {
                "type": "string",
                "examples": [
                  "ac-agenda-job"
                ]
              },
              "id": {
                "type": "string",
                "examples": [
                  "5f7c622d038374d99a024d66"
                ]
              },
              "name": {
                "type": "string",
                "examples": [
                  "zackAll"
                ]
              }
            },
            "required": []
          }
        },
        "readme": {
          "type": "string",
          "examples": [
            "zackAll"
          ]
        },
        "manifest": {
          "type": "object",
          "properties": {
            "bundleName": {
              "type": "string",
              "examples": [
                "ZackAll"
              ]
            },
            "fingerprint": {
              "type": "string",
              "examples": [
                "5f7c62f077c8212a9141d822"
              ]
            },
            "createdEpoch": {
              "type": "string",
              "examples": [
                "1601987312364"
              ]
            },
            "artifacts": {
              "type": "array",
              "items": {
                "type": "object",
                "properties": {
                  "id": {
                    "type": "string",
                    "examples": [
                      "zackAll"
                    ]
                  },
                  "name": {
                    "type": "string",
                    "examples": [
                      "zackAll"
                    ]
                  },
                  "type": {
                    "type": "string",
                    "examples": [
                      "ac-agenda-job"
                    ]
                  },
                  "location": {
                    "type": "string",
                    "examples": [
                      "/bundles/ac_agenda_jobs/zackAll.json"
                    ]
                  },
                  "properties": {
                    "type": "object",
                    "properties": {
                      "entryPoint": {
                        "type": "boolean",
                        "examples": [
                          true,
                          false
                        ]
                      }
                    },
                    "required": []
                  }
                },
                "required": []
              }
            }
          },
          "required": []
        }
      },
      "required": []
    },
    {
      "$id": "formOutput",
      "type": "object",
      "properties": {
        "components": {
          "type": "object",
          "properties": {
            "automations": {
              "type": "array",
              "items": {
                "type": "object",
                "properties": {
                  "name": {
                    "type": "string",
                    "examples": [
                      "zackAll"
                    ]
                  },
                  "_id": {
                    "type": "string",
                    "examples": [
                      "5f7c622d038374d99a024d66"
                    ]
                  }
                },
                "required": []
              }
            },
            "workflows": {
              "type": "array",
              "items": {
                "type": "object",
                "properties": {
                  "name": {
                    "type": "string",
                    "examples": [
                      "zackAll"
                    ]
                  }
                },
                "required": []
              }
            },
            "jsonForms": {
              "type": "array",
              "items": {
                "type": "object",
                "properties": {
                  "name": {
                    "type": "string",
                    "examples": [
                      "zackAll"
                    ]
                  }
                },
                "required": []
              }
            },
            "templates": {
              "type": "array",
              "items": {
                "type": "object",
                "properties": {
                  "name": {
                    "type": "string",
                    "examples": [
                      "zackAll"
                    ]
                  }
                },
                "required": []
              }
            },
            "forms": {
              "type": "array",
              "items": {
                "type": "object",
                "properties": {
                  "name": {
                    "type": "string",
                    "examples": [
                      "Demo"
                    ]
                  }
                },
                "required": []
              }
            },
            "commandTemplates": {
              "type": "array",
              "items": {
                "type": "object",
                "properties": {
                  "name": {
                    "type": "string",
                    "examples": [
                      "zackAll"
                    ]
                  }
                },
                "required": []
              }
            },
            "analyticTemplates": {
              "type": "array",
              "items": {
                "type": "object",
                "properties": {
                  "name": {
                    "type": "string",
                    "examples": [
                      "zackAll"
                    ]
                  }
                },
                "required": []
              }
            },
            "transformations": {
              "type": "array",
              "items": {
                "type": "object",
                "properties": {
                  "id": {
                    "type": "string",
                    "examples": [
                      "5f7c62b43451a606c2fb0305"
                    ]
                  }
                },
                "required": []
              }
            }
          },
          "required": []
        }
      },
      "required": []
    },
    {
      "$id": "discovery",
      "type": "object",
      "properties": {
        "componentMap": {
          "type": "object",
          "properties": {
            "ac-agenda-job": {
              "type": "array",
              "items": {
                "type": "object",
                "properties": {
                  "name": {
                    "type": "string",
                    "examples": [
                      "zackAll"
                    ]
                  },
                  "_id": {
                    "type": "string",
                    "examples": [
                      "5f7c622d038374d99a024d66"
                    ]
                  }
                },
                "required": []
              }
            },
            "workflow": {
              "type": "array",
              "items": {
                "type": "object",
                "properties": {
                  "name": {
                    "type": "string",
                    "examples": [
                      "zackAll"
                    ]
                  },
                  "parent": {
                    "type": "array",
                    "items": {
                      "type": "object",
                      "properties": {
                        "name": {
                          "type": "string",
                          "examples": [
                            "zackAll"
                          ]
                        },
                        "type": {
                          "type": "string",
                          "examples": [
                            "ac-agenda-job"
                          ]
                        }
                      },
                      "required": []
                    }
                  }
                },
                "required": []
              }
            },
            "json-forms": {
              "type": "array",
              "items": {
                "type": "object",
                "properties": {
                  "name": {
                    "type": "string",
                    "examples": [
                      "zackAll"
                    ]
                  },
                  "_id": {
                    "type": "string",
                    "examples": [
                      "5f7c6221e607880ade9b11bb"
                    ]
                  },
                  "parent": {
                    "type": "array",
                    "items": {
                      "type": "object",
                      "properties": {
                        "name": {
                          "type": "string",
                          "examples": [
                            "zackAll"
                          ]
                        },
                        "type": {
                          "type": "string",
                          "examples": [
                            "ac-agenda-job"
                          ]
                        }
                      },
                      "required": []
                    }
                  }
                },
                "required": []
              }
            },
            "mop-template": {
              "type": "array",
              "items": {
                "type": "object",
                "properties": {
                  "name": {
                    "type": "string",
                    "examples": [
                      "zackAll"
                    ]
                  },
                  "parent": {
                    "type": "array",
                    "items": {
                      "type": "object",
                      "properties": {
                        "name": {
                          "type": "string",
                          "examples": [
                            "zackAll"
                          ]
                        },
                        "type": {
                          "type": "string",
                          "examples": [
                            "workflow"
                          ]
                        }
                      },
                      "required": []
                    }
                  }
                },
                "required": []
              }
            },
            "template": {
              "type": "array",
              "items": {
                "type": "object",
                "properties": {
                  "name": {
                    "type": "string",
                    "examples": [
                      "zackAll"
                    ]
                  },
                  "parent": {
                    "type": "array",
                    "items": {
                      "type": "object",
                      "properties": {
                        "name": {
                          "type": "string",
                          "examples": [
                            "zackAll"
                          ]
                        },
                        "type": {
                          "type": "string",
                          "examples": [
                            "workflow"
                          ]
                        }
                      },
                      "required": []
                    }
                  }
                },
                "required": []
              }
            },
            "mop-analytic-template": {
              "type": "array",
              "items": {
                "type": "object",
                "properties": {
                  "name": {
                    "type": "string",
                    "examples": [
                      "zackAll"
                    ]
                  },
                  "parent": {
                    "type": "array",
                    "items": {
                      "type": "object",
                      "properties": {
                        "name": {
                          "type": "string",
                          "examples": [
                            "zackAll"
                          ]
                        },
                        "type": {
                          "type": "string",
                          "examples": [
                            "workflow"
                          ]
                        }
                      },
                      "required": []
                    }
                  }
                },
                "required": []
              }
            },
            "forms": {
              "type": "array",
              "items": {
                "type": "object",
                "properties": {
                  "name": {
                    "type": "string",
                    "examples": [
                      "zackAll"
                    ]
                  },
                  "parent": {
                    "type": "array",
                    "items": {
                      "type": "object",
                      "properties": {
                        "name": {
                          "type": "string",
                          "examples": [
                            "zackAll"
                          ]
                        },
                        "type": {
                          "type": "string",
                          "examples": [
                            "workflow"
                          ]
                        }
                      },
                      "required": []
                    }
                  }
                },
                "required": []
              }
            },
            "transformation": {
              "type": "array",
              "items": {
                "type": "object",
                "properties": {
                  "id": {
                    "type": "string",
                    "examples": [
                      "5f7c62b43451a606c2fb0305"
                    ]
                  },
                  "parent": {
                    "type": "array",
                    "items": {
                      "type": "object",
                      "properties": {
                        "name": {
                          "type": "string",
                          "examples": [
                            "zackAll"
                          ]
                        },
                        "type": {
                          "type": "string",
                          "examples": [
                            "workflow"
                          ]
                        }
                      },
                      "required": []
                    }
                  }
                },
                "required": []
              }
            },
            "golden-config": {
              "type": "array",
              "items": {
                "type": "object",
                "properties": {
                  "treeId": {
                    "type": "string",
                    "examples": [
                      "zackAll"
                    ]
                  },
                  "parent": {
                    "type": "array",
                    "items": {
                      "type": "object",
                      "properties": {
                        "name": {
                          "type": "string",
                          "examples": [
                            "zackAll"
                          ]
                        },
                        "type": {
                          "type": "string",
                          "examples": [
                            "workflow"
                          ]
                        }
                      },
                      "required": []
                    }
                  }
                },
                "required": []
              }
            }
          },
          "required": []
        },
        "dependencies": {
          "type": "array",
          "items": {
            "type": "string",
            "examples": [
              "@itential/app-automation_catalog"
            ]
          }
        },
        "invalidComponents": {
          "type": "array",
          "items": {
            "type": "object",
            "properties": {
              "type": {
                "type": "string",
                "examples": [
                  "golden-config"
                ]
              },
              "component": {
                "type": "object",
                "properties": {
                  "treeId": {
                    "type": "string",
                    "examples": [
                      "zackAll"
                    ]
                  },
                  "parent": {
                    "type": "array",
                    "items": {
                      "type": "object",
                      "properties": {
                        "name": {
                          "type": "string",
                          "examples": [
                            "zackAll"
                          ]
                        },
                        "type": {
                          "type": "string",
                          "examples": [
                            "workflow"
                          ]
                        }
                      },
                      "required": []
                    }
                  }
                },
                "required": []
              }
            },
            "required": []
          }
        }
      },
      "required": []
    }
  ],
  "outgoing": [
    {
      "$id": "mata",
      "type": "object",
      "properties": {
        "metadata": {
          "type": "object",
          "properties": {
            "name": {
              "type": "string",
              "examples": [
                "ZackAll"
              ]
            },
            "description": {
              "type": "string",
              "examples": [
                "zackAll"
              ]
            },
            "contributor": {
              "type": "string",
              "examples": [
                "zackAll"
              ]
            },
            "readme": {
              "type": "string",
              "examples": [
                "zackAll"
              ]
            },
            "license": {
              "type": "string"
            },
            "categories": {
              "type": "array"
            },
            "keywords": {
              "type": "array"
            },
            "dependencies": {
              "type": "array",
              "items": {
                "type": "string",
                "examples": [
                  "@itential/app-automation_catalog"
                ]
              }
            }
          },
          "required": []
        },
        "components": {
          "type": "object",
          "properties": {
            "ac-agenda-job": {
              "type": "array",
              "items": {
                "type": "object",
                "properties": {
                  "name": {
                    "type": "string",
                    "examples": [
                      "zackAll"
                    ]
                  },
                  "_id": {
                    "type": "string",
                    "examples": [
                      "5f7c622d038374d99a024d66"
                    ]
                  }
                },
                "required": []
              }
            },
            "workflow": {
              "type": "array",
              "items": {
                "type": "object",
                "properties": {
                  "name": {
                    "type": "string",
                    "examples": [
                      "zackAll"
                    ]
                  },
                  "parent": {
                    "type": "array",
                    "items": {
                      "type": "object",
                      "properties": {
                        "name": {
                          "type": "string",
                          "examples": [
                            "zackAll"
                          ]
                        },
                        "type": {
                          "type": "string",
                          "examples": [
                            "ac-agenda-job"
                          ]
                        }
                      },
                      "required": []
                    }
                  }
                },
                "required": []
              }
            },
            "json-forms": {
              "type": "array",
              "items": {
                "type": "object",
                "properties": {
                  "name": {
                    "type": "string",
                    "examples": [
                      "zackAll"
                    ]
                  },
                  "_id": {
                    "type": "string",
                    "examples": [
                      "5f7c6221e607880ade9b11bb"
                    ]
                  },
                  "parent": {
                    "type": "array",
                    "items": {
                      "type": "object",
                      "properties": {
                        "name": {
                          "type": "string",
                          "examples": [
                            "zackAll"
                          ]
                        },
                        "type": {
                          "type": "string",
                          "examples": [
                            "ac-agenda-job"
                          ]
                        }
                      },
                      "required": []
                    }
                  }
                },
                "required": []
              }
            },
            "forms": {
              "type": "array",
              "items": {
                "type": "object",
                "properties": {
                  "name": {
                    "type": "string",
                    "examples": [
                      "zackAll"
                    ]
                  },
                  "parent": {
                    "type": "array",
                    "items": {
                      "type": "object",
                      "properties": {
                        "name": {
                          "type": "string",
                          "examples": [
                            "zackAll"
                          ]
                        },
                        "type": {
                          "type": "string",
                          "examples": [
                            "workflow"
                          ]
                        }
                      },
                      "required": []
                    }
                  }
                },
                "required": []
              }
            },
            "template": {
              "type": "array",
              "items": {
                "type": "object",
                "properties": {
                  "name": {
                    "type": "string",
                    "examples": [
                      "zackAll"
                    ]
                  },
                  "parent": {
                    "type": "array",
                    "items": {
                      "type": "object",
                      "properties": {
                        "name": {
                          "type": "string",
                          "examples": [
                            "zackAll"
                          ]
                        },
                        "type": {
                          "type": "string",
                          "examples": [
                            "workflow"
                          ]
                        }
                      },
                      "required": []
                    }
                  }
                },
                "required": []
              }
            },
            "mop-template": {
              "type": "array",
              "items": {
                "type": "object",
                "properties": {
                  "name": {
                    "type": "string",
                    "examples": [
                      "zackAll"
                    ]
                  },
                  "parent": {
                    "type": "array",
                    "items": {
                      "type": "object",
                      "properties": {
                        "name": {
                          "type": "string",
                          "examples": [
                            "zackAll"
                          ]
                        },
                        "type": {
                          "type": "string",
                          "examples": [
                            "workflow"
                          ]
                        }
                      },
                      "required": []
                    }
                  }
                },
                "required": []
              }
            },
            "mop-analytic-template": {
              "type": "array",
              "items": {
                "type": "object",
                "properties": {
                  "name": {
                    "type": "string",
                    "examples": [
                      "zackAll"
                    ]
                  },
                  "parent": {
                    "type": "array",
                    "items": {
                      "type": "object",
                      "properties": {
                        "name": {
                          "type": "string",
                          "examples": [
                            "zackAll"
                          ]
                        },
                        "type": {
                          "type": "string",
                          "examples": [
                            "workflow"
                          ]
                        }
                      },
                      "required": []
                    }
                  }
                },
                "required": []
              }
            },
            "golden-config": {
              "type": "array"
            },
            "transformation": {
              "type": "array",
              "items": {
                "type": "object",
                "properties": {
                  "id": {
                    "type": "string",
                    "examples": [
                      "5f7c62b43451a606c2fb0305"
                    ]
                  },
                  "parent": {
                    "type": "array",
                    "items": {
                      "type": "object",
                      "properties": {
                        "name": {
                          "type": "string",
                          "examples": [
                            "zackAll"
                          ]
                        },
                        "type": {
                          "type": "string",
                          "examples": [
                            "workflow"
                          ]
                        }
                      },
                      "required": []
                    }
                  }
                },
                "required": []
              }
            }
          },
          "required": []
        }
      },
      "required": []
    },
    {
      "$id": "packageJSON",
      "type": "object",
      "properties": {
        "name": {
          "type": "string",
          "examples": [
            "@itentialopensource/artifact-template"
          ]
        },
        "version": {
          "type": "string",
          "examples": [
            "0.0.5"
          ]
        },
        "description": {
          "type": "string",
          "examples": [
            "Template for creating new artifacts"
          ]
        },
        "scripts": {
          "type": "object",
          "properties": {
            "test": {
              "type": "string",
              "examples": [
                "echo \"Error: no test specified\" && exit 1"
              ]
            },
            "deploy": {
              "type": "string",
              "examples": [
                "echo not needed npm publish --access=public --registry=http://registry.npmjs.org"
              ]
            },
            "validateSchema": {
              "type": "string",
              "examples": [
                "node test/manifestTester.js manifest.json manifest-schema.json"
              ]
            },
            "validateSchemaLinks": {
              "type": "string",
              "examples": [
                "node test/manifestLinkTester.js manifest.json"
              ]
            },
            "generateImageLinks": {
              "type": "string",
              "examples": [
                "node utils/generateImageLinks.js"
              ]
            }
          },
          "required": []
        },
        "repository": {
          "type": "object",
          "properties": {
            "type": {
              "type": "string",
              "examples": [
                "git"
              ]
            },
            "url": {
              "type": "string",
              "examples": [
                "https://gitlab.com/itentialopensource/pre-built-automations/artifact-template.git"
              ]
            }
          },
          "required": []
        },
        "keywords": {
          "type": "array",
          "items": {
            "type": "string",
            "examples": [
              "Itential"
            ]
          }
        },
        "contributors": {
          "type": "array",
          "items": {
            "type": "string",
            "examples": [
              "Itential Artifacts"
            ]
          }
        },
        "author": {
          "type": "string",
          "examples": [
            "Itential Artifacts"
          ]
        },
        "license": {
          "type": "string",
          "examples": [
            "Apache-2.0"
          ]
        },
        "devDependencies": {
          "type": "object",
          "properties": {
            "r2": {
              "type": "string",
              "examples": [
                "^2.0.1"
              ]
            },
            "ajv": {
              "type": "string",
              "examples": [
                "6.10.0"
              ]
            },
            "better-ajv-errors": {
              "type": "string",
              "examples": [
                "^0.6.1"
              ]
            },
            "fs-extra": {
              "type": "string",
              "examples": [
                "^7.0.1"
              ]
            }
          },
          "required": []
        }
      },
      "required": []
    }
  ],
  "steps": [
    {
      "id": 2,
      "type": "assign",
      "from": {
        "location": "incoming",
        "name": "AEartifactInfo",
        "ptr": "/readme"
      },
      "to": {
        "location": "outgoing",
        "name": "mata",
        "ptr": "/metadata/readme"
      }
    },
    {
      "id": 3,
      "type": "assign",
      "from": {
        "location": "incoming",
        "name": "AEartifactInfo",
        "ptr": "/description"
      },
      "to": {
        "location": "outgoing",
        "name": "mata",
        "ptr": "/metadata/description"
      }
    },
    {
      "id": 5,
      "type": "assign",
      "from": {
        "location": "incoming",
        "name": "AEartifactInfo",
        "ptr": "/repository"
      },
      "to": {
        "location": "outgoing",
        "name": "packageJSON",
        "ptr": "/repository"
      }
    },
    {
      "id": 6,
      "type": "assign",
      "from": {
        "location": "incoming",
        "name": "AEartifactInfo",
        "ptr": "/version"
      },
      "to": {
        "location": "outgoing",
        "name": "packageJSON",
        "ptr": "/version"
      }
    },
    {
      "id": 9,
      "type": "assign",
      "from": {
        "location": "incoming",
        "name": "AEartifactInfo",
        "ptr": "/keywords"
      },
      "to": {
        "location": "outgoing",
        "name": "packageJSON",
        "ptr": "/keywords"
      }
    },
    {
      "id": 10,
      "type": "assign",
      "from": {
        "location": "incoming",
        "name": "AEartifactInfo",
        "ptr": "/license"
      },
      "to": {
        "location": "outgoing",
        "name": "packageJSON",
        "ptr": "/license"
      }
    },
    {
      "id": 11,
      "type": "declaration",
      "library": "Object",
      "method": "new Object",
      "args": [
        "{         \"test\": \"echo \\\"Error: no test specified\\\" && exit 1\",         \"deploy\": \"echo not needed npm publish --access=public --registry=http://registry.npmjs.org\",         \"validateSchema\": \"node test/manifestTester.js manifest.json manifest-schema.json\",         \"validateSchemaLinks\": \"node test/manifestLinkTester.js manifest.json\",         \"generateImageLinks\": \"node utils/generateImageLinks.js\"     }"
      ],
      "view": {
        "row": 9,
        "col": 3
      }
    },
    {
      "id": 13,
      "type": "assign",
      "from": {
        "location": "incoming",
        "name": "AEartifactInfo",
        "ptr": "/author"
      },
      "to": {
        "location": "outgoing",
        "name": "packageJSON",
        "ptr": "/author"
      }
    },
    {
      "id": 14,
      "type": "declaration",
      "library": "Object",
      "method": "new Object",
      "args": [
        "{         \"r2\": \"^2.0.1\",         \"ajv\": \"6.10.0\",         \"better-ajv-errors\": \"^0.6.1\",         \"fs-extra\": \"^7.0.1\"     }"
      ],
      "view": {
        "row": 11,
        "col": 3
      }
    },
    {
      "id": 17,
      "type": "declaration",
      "library": "Array",
      "method": "new Array",
      "args": [
        "Itential Artifacts"
      ],
      "view": {
        "row": 10,
        "col": 3
      },
      "polymorphIndex": 0
    },
    {
      "id": 19,
      "type": "declaration",
      "library": "String",
      "method": "new String",
      "args": [
        "Itential Artifacts"
      ],
      "view": {
        "row": 1,
        "col": 4
      }
    },
    {
      "id": 21,
      "type": "declaration",
      "library": "Array",
      "method": "new Array",
      "args": [],
      "view": {
        "row": 2,
        "col": 4
      },
      "polymorphIndex": 0
    },
    {
      "id": 24,
      "type": "assign",
      "from": {
        "location": "incoming",
        "name": "formOutput",
        "ptr": "/components/automations"
      },
      "to": {
        "location": "outgoing",
        "name": "mata",
        "ptr": "/components/ac-agenda-job"
      }
    },
    {
      "id": 25,
      "type": "assign",
      "from": {
        "location": "incoming",
        "name": "formOutput",
        "ptr": "/components/workflows"
      },
      "to": {
        "location": "outgoing",
        "name": "mata",
        "ptr": "/components/workflow"
      }
    },
    {
      "id": 26,
      "type": "assign",
      "from": {
        "location": "incoming",
        "name": "formOutput",
        "ptr": "/components/jsonForms"
      },
      "to": {
        "location": "outgoing",
        "name": "mata",
        "ptr": "/components/json-forms"
      }
    },
    {
      "id": 27,
      "type": "assign",
      "from": {
        "location": "incoming",
        "name": "formOutput",
        "ptr": "/components/forms"
      },
      "to": {
        "location": "outgoing",
        "name": "mata",
        "ptr": "/components/forms"
      }
    },
    {
      "id": 28,
      "type": "assign",
      "from": {
        "location": "incoming",
        "name": "formOutput",
        "ptr": "/components/templates"
      },
      "to": {
        "location": "outgoing",
        "name": "mata",
        "ptr": "/components/template"
      }
    },
    {
      "id": 29,
      "type": "assign",
      "from": {
        "location": "incoming",
        "name": "formOutput",
        "ptr": "/components/commandTemplates"
      },
      "to": {
        "location": "outgoing",
        "name": "mata",
        "ptr": "/components/mop-template"
      }
    },
    {
      "id": 30,
      "type": "assign",
      "from": {
        "location": "incoming",
        "name": "formOutput",
        "ptr": "/components/analyticTemplates"
      },
      "to": {
        "location": "outgoing",
        "name": "mata",
        "ptr": "/components/mop-analytic-template"
      }
    },
    {
      "id": 31,
      "type": "assign",
      "from": {
        "location": "incoming",
        "name": "formOutput",
        "ptr": "/components/transformations"
      },
      "to": {
        "location": "outgoing",
        "name": "mata",
        "ptr": "/components/transformation"
      }
    },
    {
      "id": 32,
      "type": "assign",
      "from": {
        "location": "incoming",
        "name": "discovery",
        "ptr": "/dependencies"
      },
      "to": {
        "location": "outgoing",
        "name": "mata",
        "ptr": "/metadata/dependencies"
      }
    },
    {
      "id": 48,
      "type": "assign",
      "from": {
        "location": "incoming",
        "name": "AEartifactInfo",
        "ptr": "/name"
      },
      "to": {
        "location": "method",
        "name": 47,
        "ptr": "/args/0/value"
      }
    },
    {
      "id": 59,
      "type": "assign",
      "from": {
        "location": "incoming",
        "name": "AEartifactInfo",
        "ptr": "/name"
      },
      "to": {
        "location": "method",
        "name": 35,
        "ptr": "/args/2/value"
      }
    },
    {
      "id": 12,
      "type": "assign",
      "from": {
        "location": "declaration",
        "name": 11,
        "ptr": "/return"
      },
      "to": {
        "location": "outgoing",
        "name": "packageJSON",
        "ptr": "/scripts"
      }
    },
    {
      "id": 15,
      "type": "assign",
      "from": {
        "location": "declaration",
        "name": 14,
        "ptr": "/return"
      },
      "to": {
        "location": "outgoing",
        "name": "packageJSON",
        "ptr": "/devDependencies"
      }
    },
    {
      "id": 18,
      "type": "assign",
      "from": {
        "location": "declaration",
        "name": 17,
        "ptr": "/return"
      },
      "to": {
        "location": "outgoing",
        "name": "packageJSON",
        "ptr": "/contributors"
      }
    },
    {
      "id": 20,
      "type": "assign",
      "from": {
        "location": "declaration",
        "name": 19,
        "ptr": "/return"
      },
      "to": {
        "location": "outgoing",
        "name": "mata",
        "ptr": "/metadata/contributor"
      }
    },
    {
      "id": 22,
      "type": "assign",
      "from": {
        "location": "declaration",
        "name": 21,
        "ptr": "/return"
      },
      "to": {
        "location": "outgoing",
        "name": "mata",
        "ptr": "/metadata/categories"
      }
    },
    {
      "id": 23,
      "type": "assign",
      "from": {
        "location": "declaration",
        "name": 21,
        "ptr": "/return"
      },
      "to": {
        "location": "outgoing",
        "name": "mata",
        "ptr": "/metadata/keywords"
      }
    },
    {
      "id": 41,
      "type": "method",
      "library": "String",
      "method": "includes",
      "args": [
        null,
        "/",
        null
      ],
      "view": {
        "row": 1,
        "col": 2
      }
    },
    {
      "id": 47,
      "type": "method",
      "library": "String",
      "method": "split",
      "args": [
        null,
        "/",
        null
      ],
      "view": {
        "row": 4,
        "col": 1
      }
    },
    {
      "id": 43,
      "type": "assign",
      "from": {
        "location": "method",
        "name": 41,
        "ptr": "/return"
      },
      "to": {
        "location": "method",
        "name": 35,
        "ptr": "/args/0/value"
      }
    },
    {
      "id": 50,
      "type": "assign",
      "from": {
        "location": "method",
        "name": 47,
        "ptr": "/return"
      },
      "to": {
        "location": "method",
        "name": 49,
        "ptr": "/args/0/value"
      }
    },
    {
      "id": 53,
      "type": "assign",
      "from": {
        "location": "method",
        "name": 47,
        "ptr": "/return"
      },
      "to": {
        "location": "method",
        "name": 52,
        "ptr": "/args/0/value"
      }
    },
    {
      "id": 52,
      "type": "method",
      "library": "Array",
      "method": "length",
      "args": [
        null
      ],
      "view": {
        "row": 2,
        "col": 2
      }
    },
    {
      "id": 56,
      "type": "assign",
      "from": {
        "location": "method",
        "name": 52,
        "ptr": "/return"
      },
      "to": {
        "location": "method",
        "name": 55,
        "ptr": "/args/0/value"
      }
    },
    {
      "id": 55,
      "type": "method",
      "library": "Math",
      "method": "subtract",
      "args": [
        null,
        1
      ],
      "view": {
        "row": 2,
        "col": 3
      }
    },
    {
      "id": 57,
      "type": "assign",
      "from": {
        "location": "method",
        "name": 55,
        "ptr": "/return"
      },
      "to": {
        "location": "method",
        "name": 49,
        "ptr": "/args/1/value"
      }
    },
    {
      "id": 49,
      "type": "method",
      "library": "Array",
      "method": "getIndex",
      "args": [
        null,
        null
      ],
      "view": {
        "row": 3,
        "col": 2
      }
    },
    {
      "id": 58,
      "type": "assign",
      "from": {
        "location": "method",
        "name": 49,
        "ptr": "/return"
      },
      "to": {
        "location": "method",
        "name": 35,
        "ptr": "/args/1/value"
      }
    },
    {
      "id": 35,
      "type": "method",
      "library": "Conditional",
      "method": "ternary",
      "args": [
        null,
        null,
        null
      ],
      "view": {
        "row": 1,
        "col": 3
      }
    },
    {
      "id": 36,
      "type": "assign",
      "from": {
        "location": "method",
        "name": 35,
        "ptr": "/return"
      },
      "to": {
        "location": "outgoing",
        "name": "mata",
        "ptr": "/metadata/name"
      }
    },
    {
      "id": 60,
      "type": "method",
      "library": "String",
      "method": "concat",
      "args": [
        null,
        "/",
        "artifact-template"
      ],
      "view": {
        "row": 8,
        "col": 4
      }
    },
    {
      "id": 62,
      "type": "assign",
      "from": {
        "location": "method",
        "name": 60,
        "ptr": "/return"
      },
      "to": {
        "location": "outgoing",
        "name": "packageJSON",
        "ptr": "/name"
      }
    },
    {
      "id": 64,
      "type": "method",
      "library": "Conditional",
      "method": "ternary",
      "args": [
        null,
        null,
        null
      ],
      "view": {
        "row": 3,
        "col": 3
      }
    },
    {
      "id": 66,
      "type": "method",
      "library": "Array",
      "method": "getIndex",
      "args": [
        null,
        0
      ],
      "view": {
        "row": 5,
        "col": 3
      }
    },
    {
      "id": 69,
      "type": "assign",
      "from": {
        "location": "method",
        "name": 47,
        "ptr": "/return"
      },
      "to": {
        "location": "method",
        "name": 66,
        "ptr": "/args/0/value"
      }
    },
    {
      "id": 70,
      "type": "assign",
      "from": {
        "location": "method",
        "name": 66,
        "ptr": "/return"
      },
      "to": {
        "location": "method",
        "name": 64,
        "ptr": "/args/1/value"
      }
    },
    {
      "id": 71,
      "type": "assign",
      "from": {
        "location": "method",
        "name": 41,
        "ptr": "/return"
      },
      "to": {
        "location": "method",
        "name": 64,
        "ptr": "/args/0/value"
      }
    },
    {
      "id": 72,
      "type": "assign",
      "from": {
        "location": "incoming",
        "name": "AEartifactInfo",
        "ptr": "/name"
      },
      "to": {
        "location": "method",
        "name": 64,
        "ptr": "/args/2/value"
      }
    },
    {
      "id": 73,
      "type": "assign",
      "from": {
        "location": "method",
        "name": 64,
        "ptr": "/return"
      },
      "to": {
        "location": "method",
        "name": 60,
        "ptr": "/args/0/value"
      }
    },
    {
      "id": 74,
      "type": "assign",
      "from": {
        "location": "incoming",
        "name": "AEartifactInfo",
        "ptr": "/name"
      },
      "to": {
        "location": "method",
        "name": 41,
        "ptr": "/args/0/value"
      }
    }
  ],
  "functions": [],
  "comments": [],
  "view": {
    "col": 4,
    "row": 12
  },
  "created": "2021-04-13T17:55:40.123Z",
  "createdBy": {
    "_id": "601424815f970e44a97f394a",
    "provenance": "local_aaa",
    "username": "admin@pronghorn"
  },
  "lastUpdated": "2021-04-13T17:55:40.123Z",
  "lastUpdatedBy": {
    "_id": "601424815f970e44a97f394a",
    "provenance": "local_aaa",
    "username": "admin@pronghorn"
  },
  "version": "3.13.0"
}