{
  "name": "Push Bundles to Gitlab Adapter Create Link",
  "tasks": {
    "592": {
      "name": "query",
      "canvasName": "query",
      "summary": "Query update commit data",
      "description": "Query update commit data",
      "location": "Application",
      "locationType": null,
      "app": "WorkFlowEngine",
      "type": "operation",
      "displayName": "WorkFlowEngine",
      "variables": {
        "incoming": {
          "pass_on_null": false,
          "query": "commitActions",
          "obj": "$var.edbd.job_details"
        },
        "outgoing": {
          "return_data": null
        },
        "error": ""
      },
      "deprecated": false,
      "matched": [
        {
          "key": "canvasName",
          "highlightString": "<span class='highlight-string'>query</span>"
        },
        {
          "key": "summary",
          "highlightString": "<span class='highlight-string'>Query</span> Data Using 'json-query' Format"
        },
        {
          "key": "description",
          "highlightString": "<span class='highlight-string'>Query</span> data using a dot/bracket notation string and a matching key/value pair."
        }
      ],
      "groups": [],
      "x": 1.6901639344262296,
      "y": 1.0847457627118644,
      "scheduled": false
    },
    "619": {
      "name": "query",
      "canvasName": "query",
      "summary": "Query projects in group",
      "description": "Query projects in group",
      "location": "Application",
      "locationType": null,
      "app": "WorkFlowEngine",
      "type": "operation",
      "displayName": "WorkFlowEngine",
      "variables": {
        "incoming": {
          "pass_on_null": false,
          "query": "response.projects",
          "obj": "$var.8f4d.result"
        },
        "outgoing": {
          "return_data": null
        },
        "error": ""
      },
      "deprecated": false,
      "matched": [
        {
          "key": "canvasName",
          "highlightString": "<span class='highlight-string'>query</span>"
        },
        {
          "key": "summary",
          "highlightString": "<span class='highlight-string'>Query</span> Data Using 'json-query' Format"
        },
        {
          "key": "description",
          "highlightString": "<span class='highlight-string'>Query</span> data using a dot/bracket notation string and a matching key/value pair."
        }
      ],
      "groups": [],
      "x": 1.1487826871055,
      "y": 0.772211720226843,
      "scheduled": false
    },
    "1751": {
      "name": "transformation",
      "canvasName": "transformation",
      "summary": "JSON Transformation",
      "description": "Perform a JSON Transformation using the JST library.",
      "location": "Application",
      "locationType": null,
      "app": "WorkFlowEngine",
      "type": "operation",
      "displayName": "WorkFlowEngine",
      "variables": {
        "incoming": {
          "tr_id": "6075cef28c016f0098c7284c",
          "variableMap": {
            "artifactFullName": "$var.job.repoName"
          },
          "options": {
            "extractOutput": true,
            "validateIncoming": true,
            "revertToDefaultValue": true
          }
        },
        "outgoing": {
          "artifactName": null
        }
      },
      "deprecated": false,
      "matched": [
        {
          "key": "description",
          "highlightString": "Perform a JSON Transformation using the <span class='highlight-string'>JST</span> library."
        }
      ],
      "groups": [],
      "x": 0.608661417322835,
      "y": 0.489964580873672,
      "task_name": "getArtifactPathGitlab"
    },
    "2890": {
      "name": "query",
      "canvasName": "query",
      "summary": "Query Data Using 'json-query' Format",
      "description": "Query data using a dot/bracket notation string and a matching key/value pair.",
      "location": "Application",
      "locationType": null,
      "app": "WorkFlowEngine",
      "type": "operation",
      "displayName": "WorkFlowEngine",
      "variables": {
        "incoming": {
          "pass_on_null": false,
          "query": "response",
          "obj": "$var.c6d7.result"
        },
        "outgoing": {
          "return_data": null
        },
        "error": ""
      },
      "deprecated": false,
      "matched": [
        {
          "key": "canvasName",
          "highlightString": "<span class='highlight-string'>query</span>"
        },
        {
          "key": "summary",
          "highlightString": "<span class='highlight-string'>Query</span> Data Using 'json-query' Format"
        },
        {
          "key": "description",
          "highlightString": "<span class='highlight-string'>Query</span> data using a dot/bracket notation string and a matching key/value pair."
        }
      ],
      "groups": [],
      "x": 1.7081967213114755,
      "y": 1.2860169491525424,
      "scheduled": false
    },
    "2995": {
      "name": "query",
      "canvasName": "query",
      "summary": "Query Data Using 'json-query' Format",
      "description": "Query data using a dot/bracket notation string and a matching key/value pair.",
      "location": "Application",
      "locationType": null,
      "app": "WorkFlowEngine",
      "type": "operation",
      "displayName": "WorkFlowEngine",
      "variables": {
        "incoming": {
          "pass_on_null": false,
          "query": "time",
          "obj": "$var.b99e.time"
        },
        "outgoing": {
          "return_data": null
        },
        "error": ""
      },
      "deprecated": false,
      "matched": [
        {
          "key": "canvasName",
          "highlightString": "<span class='highlight-string'>query</span>"
        },
        {
          "key": "summary",
          "highlightString": "<span class='highlight-string'>Query</span> Data Using 'json-query' Format"
        },
        {
          "key": "description",
          "highlightString": "<span class='highlight-string'>Query</span> data using a dot/bracket notation string and a matching key/value pair."
        }
      ],
      "groups": [],
      "x": 2.2705882352941176,
      "y": 0.4661016949152542,
      "scheduled": false
    },
    "5168": {
      "name": "query",
      "canvasName": "query",
      "summary": "Query repo id",
      "description": "Query repo id",
      "location": "Application",
      "locationType": null,
      "app": "WorkFlowEngine",
      "type": "operation",
      "displayName": "WorkFlowEngine",
      "variables": {
        "incoming": {
          "pass_on_null": false,
          "query": "response.id",
          "obj": "$var.6c1.result"
        },
        "outgoing": {
          "return_data": null
        },
        "error": ""
      },
      "deprecated": false,
      "matched": [
        {
          "key": "canvasName",
          "highlightString": "<span class='highlight-string'>query</span>"
        },
        {
          "key": "summary",
          "highlightString": "<span class='highlight-string'>Query</span> Data Using 'json-query' Format"
        },
        {
          "key": "description",
          "highlightString": "<span class='highlight-string'>Query</span> data using a dot/bracket notation string and a matching key/value pair."
        }
      ],
      "groups": [],
      "x": 1.17493237150586,
      "y": 0.583175803402647,
      "scheduled": false
    },
    "6114": {
      "name": "reattempt",
      "canvasName": "reattempt",
      "summary": "Re-attempt",
      "description": "Re-attempt after n minutes",
      "location": "Application",
      "locationType": null,
      "app": "MOP",
      "type": "automatic",
      "displayName": "MOP",
      "variables": {
        "incoming": {
          "job_id": "$var.job._id",
          "attemptID": "$var.2995.return_data",
          "minutes": 0,
          "attempts": 3
        },
        "outgoing": {
          "response": null
        },
        "error": ""
      },
      "deprecated": false,
      "matched": [
        {
          "key": "canvasName",
          "highlightString": "<span class='highlight-string'>reatte</span>mpt"
        }
      ],
      "groups": [],
      "actor": "Pronghorn",
      "x": 2.4598039215686276,
      "y": 0.2129237288135593,
      "scheduled": false
    },
    "7100": {
      "name": "ViewData",
      "canvasName": "ViewData",
      "summary": "View Data",
      "description": "View data in a pretty format",
      "location": "Application",
      "app": "WorkFlowEngine",
      "displayName": "Tools",
      "type": "manual",
      "variables": {
        "incoming": {
          "header": "Failed",
          "message": "failed to create merge request",
          "body": "",
          "variables": {},
          "btn_success": "okay",
          "btn_failure": "cancel"
        },
        "outgoing": {},
        "error": ""
      },
      "view": "/workflow_engine/task/ViewData",
      "deprecated": false,
      "matched": [
        {
          "key": "canvasName",
          "highlightString": "<span class='highlight-string'>View</span><span class='highlight-string'>Data</span>"
        },
        {
          "key": "summary",
          "highlightString": "<span class='highlight-string'>View</span> <span class='highlight-string'>Data</span>"
        },
        {
          "key": "description",
          "highlightString": "<span class='highlight-string'>View</span> <span class='highlight-string'>data</span> in a pretty format"
        }
      ],
      "groups": [],
      "x": 2.933606557377049,
      "y": 0.8940677966101694,
      "scheduled": false
    },
    "workflow_start": {
      "name": "workflow_start",
      "groups": [],
      "x": 0.23278688524590163,
      "y": 0.4904661016949153
    },
    "workflow_end": {
      "name": "workflow_end",
      "groups": [],
      "x": 3.055737704918033,
      "y": 0.4894067796610169
    },
    "8f53": {
      "name": "query",
      "canvasName": "query",
      "summary": "Get Subgroup ID",
      "description": "Get Subgroup ID",
      "location": "Application",
      "locationType": null,
      "app": "WorkFlowEngine",
      "type": "operation",
      "displayName": "WorkFlowEngine",
      "variables": {
        "incoming": {
          "pass_on_null": false,
          "query": "response.id",
          "obj": "$var.8f4d.result"
        },
        "outgoing": {
          "return_data": null
        },
        "error": ""
      },
      "deprecated": false,
      "matched": [
        {
          "key": "canvasName",
          "highlightString": "<span class='highlight-string'>query</span>"
        },
        {
          "key": "summary",
          "highlightString": "<span class='highlight-string'>Query</span> Data Using 'json-query' Format"
        },
        {
          "key": "description",
          "highlightString": "<span class='highlight-string'>Query</span> data using a dot/bracket notation string and a matching key/value pair."
        }
      ],
      "groups": [],
      "x": 0.521259842519685,
      "y": 0.488783943329398,
      "scheduled": false
    },
    "fa4d": {
      "name": "merge",
      "canvasName": "merge",
      "summary": "Merge Data",
      "description": "Merge data into a single object",
      "location": "Application",
      "locationType": null,
      "app": "WorkFlowEngine",
      "type": "operation",
      "displayName": "WorkFlowEngine",
      "variables": {
        "incoming": {
          "data_to_merge": [
            {
              "key": "name",
              "value": {
                "task": "job",
                "variable": "repoName",
                "editable": true
              }
            },
            {
              "key": "path",
              "value": {
                "task": "1751",
                "variable": "artifactName",
                "editable": true
              }
            },
            {
              "key": "namespace_id",
              "value": {
                "task": "8f53",
                "variable": "return_data"
              }
            }
          ]
        },
        "outgoing": {
          "merged_object": null
        }
      },
      "deprecated": false,
      "matched": [
        {
          "key": "canvasName",
          "highlightString": "<span class='highlight-string'>merge</span>"
        },
        {
          "key": "summary",
          "highlightString": "<span class='highlight-string'>Merge</span> Data"
        },
        {
          "key": "description",
          "highlightString": "<span class='highlight-string'>Merge</span> data into a single object"
        }
      ],
      "groups": [],
      "x": 0.699212598425197,
      "y": 0.487603305785124
    },
    "29b": {
      "name": "newVariable",
      "canvasName": "newVariable",
      "summary": "Create a Job Variable",
      "description": "Create a new Job variable by Job ID and assign it a value.",
      "location": "Application",
      "locationType": null,
      "app": "WorkFlowEngine",
      "type": "operation",
      "displayName": "WorkFlowEngine",
      "variables": {
        "incoming": {
          "name": "postRepoURI",
          "value": "https://gitlab.com/api/v4/projects"
        },
        "outgoing": {
          "value": null
        }
      },
      "deprecated": false,
      "matched": [
        {
          "key": "canvasName",
          "highlightString": "<span class='highlight-string'>new</span>Variable"
        },
        {
          "key": "description",
          "highlightString": "Create a <span class='highlight-string'>new</span> Job variable by Job ID and assign it a value."
        }
      ],
      "groups": [],
      "x": 0.866141732283465,
      "y": 0.480519480519481
    },
    "190d": {
      "name": "query",
      "canvasName": "query",
      "summary": "Query homepage",
      "description": "Query homepage",
      "location": "Application",
      "locationType": null,
      "app": "WorkFlowEngine",
      "type": "operation",
      "displayName": "WorkFlowEngine",
      "variables": {
        "incoming": {
          "pass_on_null": false,
          "query": "response.web_url",
          "obj": "$var.6c1.result"
        },
        "outgoing": {
          "return_data": null
        },
        "error": ""
      },
      "deprecated": false,
      "matched": [
        {
          "key": "canvasName",
          "highlightString": "<span class='highlight-string'>query</span>"
        },
        {
          "key": "summary",
          "highlightString": "<span class='highlight-string'>Query</span> Data Using 'json-query' Format"
        },
        {
          "key": "description",
          "highlightString": "<span class='highlight-string'>Query</span> data using a dot/bracket notation string and a matching key/value pair."
        }
      ],
      "groups": [],
      "x": 1.17007874015748,
      "y": 0.48642266824085,
      "scheduled": false
    },
    "cfa6": {
      "name": "query",
      "canvasName": "query",
      "summary": "Query ssh url",
      "description": "Query ssh url",
      "location": "Application",
      "locationType": null,
      "app": "WorkFlowEngine",
      "type": "operation",
      "displayName": "WorkFlowEngine",
      "variables": {
        "incoming": {
          "pass_on_null": false,
          "query": "response.ssh_url_to_repo",
          "obj": "$var.6c1.result"
        },
        "outgoing": {
          "return_data": null
        },
        "error": ""
      },
      "deprecated": false,
      "matched": [
        {
          "key": "canvasName",
          "highlightString": "<span class='highlight-string'>query</span>"
        },
        {
          "key": "summary",
          "highlightString": "<span class='highlight-string'>Query</span> Data Using 'json-query' Format"
        },
        {
          "key": "description",
          "highlightString": "<span class='highlight-string'>Query</span> data using a dot/bracket notation string and a matching key/value pair."
        }
      ],
      "groups": [],
      "x": 1.17222723174031,
      "y": 0.395085066162571,
      "scheduled": false
    },
    "5a9c": {
      "name": "merge",
      "canvasName": "merge",
      "summary": "Merge Data",
      "description": "Merge data into a single object",
      "location": "Application",
      "locationType": null,
      "app": "WorkFlowEngine",
      "type": "operation",
      "displayName": "WorkFlowEngine",
      "variables": {
        "incoming": {
          "data_to_merge": [
            {
              "key": "git",
              "value": {
                "task": "cfa6",
                "variable": "return_data"
              }
            },
            {
              "key": "homepage",
              "value": {
                "task": "190d",
                "variable": "return_data"
              }
            }
          ]
        },
        "outgoing": {
          "merged_object": null
        }
      },
      "deprecated": false,
      "matched": [
        {
          "key": "canvasName",
          "highlightString": "<span class='highlight-string'>merge</span>"
        },
        {
          "key": "summary",
          "highlightString": "<span class='highlight-string'>Merge</span> Data"
        },
        {
          "key": "description",
          "highlightString": "<span class='highlight-string'>Merge</span> data into a single object"
        }
      ],
      "groups": [],
      "x": 1.29035166816952,
      "y": 0.487712665406427
    },
    "5a7e": {
      "name": "query",
      "canvasName": "query",
      "summary": "Query create",
      "description": "Query create",
      "location": "Application",
      "locationType": null,
      "app": "WorkFlowEngine",
      "type": "operation",
      "displayName": "WorkFlowEngine",
      "variables": {
        "incoming": {
          "pass_on_null": false,
          "query": "create",
          "obj": "$var.job.artifact"
        },
        "outgoing": {
          "return_data": null
        },
        "error": ""
      },
      "deprecated": false,
      "matched": [
        {
          "key": "canvasName",
          "highlightString": "<span class='highlight-string'>query</span>"
        },
        {
          "key": "summary",
          "highlightString": "<span class='highlight-string'>Query</span> Data Using 'json-query' Format"
        },
        {
          "key": "description",
          "highlightString": "<span class='highlight-string'>Query</span> data using a dot/bracket notation string and a matching key/value pair."
        }
      ],
      "groups": [],
      "x": 1.39765554553652,
      "y": 0.484877126654064,
      "scheduled": false
    },
    "753f": {
      "name": "childJob",
      "canvasName": "childJob",
      "summary": "Create Commit Data",
      "description": "Run a child job inside a workflow.",
      "location": "Application",
      "locationType": null,
      "app": "WorkFlowEngine",
      "type": "operation",
      "displayName": "WorkFlowEngine",
      "variables": {
        "incoming": {
          "task": "",
          "workflow": "Push Bundles to Gitlab Adapter Commit Data",
          "variables": {
            "artifact": {
              "variable": "",
              "task": "ea3c",
              "value": "fixedArray"
            },
            "action": {
              "variable": "",
              "task": "static",
              "value": "create"
            }
          },
          "data_array": "",
          "transformation": "",
          "loopType": ""
        },
        "outgoing": {
          "job_details": null
        }
      },
      "deprecated": false,
      "matched": [
        {
          "key": "canvasName",
          "highlightString": "<span class='highlight-string'>child</span><span class='highlight-string'>Job</span>"
        },
        {
          "key": "summary",
          "highlightString": "Run <span class='highlight-string'>Child</span> <span class='highlight-string'>Job</span>"
        },
        {
          "key": "description",
          "highlightString": "Run a <span class='highlight-string'>child</span> <span class='highlight-string'>job</span> inside a workflow."
        }
      ],
      "groups": [],
      "actor": "job",
      "x": 1.70423805229937,
      "y": 0.47069943289225
    },
    "871d": {
      "name": "query",
      "canvasName": "query",
      "summary": "Query create commit data",
      "description": "Query create commit data",
      "location": "Application",
      "locationType": null,
      "app": "WorkFlowEngine",
      "type": "operation",
      "displayName": "WorkFlowEngine",
      "variables": {
        "incoming": {
          "pass_on_null": false,
          "query": "commitActions",
          "obj": "$var.753f.job_details"
        },
        "outgoing": {
          "return_data": null
        },
        "error": ""
      },
      "deprecated": false,
      "matched": [
        {
          "key": "canvasName",
          "highlightString": "<span class='highlight-string'>query</span>"
        },
        {
          "key": "summary",
          "highlightString": "<span class='highlight-string'>Query</span> Data Using 'json-query' Format"
        },
        {
          "key": "description",
          "highlightString": "<span class='highlight-string'>Query</span> data using a dot/bracket notation string and a matching key/value pair."
        }
      ],
      "groups": [],
      "x": 1.88277727682597,
      "y": 0.464083175803403,
      "scheduled": false
    },
    "14f0": {
      "name": "merge",
      "canvasName": "merge",
      "summary": "Merge Data",
      "description": "Merge data into a single object",
      "location": "Application",
      "locationType": null,
      "app": "WorkFlowEngine",
      "type": "operation",
      "displayName": "WorkFlowEngine",
      "variables": {
        "incoming": {
          "data_to_merge": [
            {
              "key": "branch",
              "value": {
                "task": "static",
                "variable": "master"
              }
            },
            {
              "key": "commit_message",
              "value": {
                "task": "static",
                "variable": "initial commit"
              }
            },
            {
              "key": "actions",
              "value": {
                "task": "871d",
                "variable": "return_data"
              }
            }
          ]
        },
        "outgoing": {
          "merged_object": null
        }
      },
      "deprecated": false,
      "matched": [
        {
          "key": "canvasName",
          "highlightString": "<span class='highlight-string'>merge</span>"
        },
        {
          "key": "summary",
          "highlightString": "<span class='highlight-string'>Merge</span> Data"
        },
        {
          "key": "description",
          "highlightString": "<span class='highlight-string'>Merge</span> data into a single object"
        }
      ],
      "groups": [],
      "x": 1.9705882352941178,
      "y": 0.4639830508474576
    },
    "3b3e": {
      "name": "ViewData",
      "canvasName": "ViewData",
      "summary": "View Data",
      "description": "View data in a pretty format",
      "location": "Application",
      "app": "WorkFlowEngine",
      "displayName": "Tools",
      "type": "manual",
      "variables": {
        "incoming": {
          "header": "Error",
          "message": "",
          "body": "Error making commit to repository on GitLab. Try again?",
          "variables": {},
          "btn_success": "Retry",
          "btn_failure": ""
        },
        "outgoing": {},
        "error": ""
      },
      "view": "/workflow_engine/task/ViewData",
      "deprecated": false,
      "matched": [
        {
          "key": "canvasName",
          "highlightString": "<span class='highlight-string'>View</span><span class='highlight-string'>Data</span>"
        },
        {
          "key": "summary",
          "highlightString": "<span class='highlight-string'>View</span> <span class='highlight-string'>Data</span>"
        },
        {
          "key": "description",
          "highlightString": "<span class='highlight-string'>View</span> <span class='highlight-string'>data</span> in a pretty format"
        }
      ],
      "groups": [],
      "x": 2.118627450980392,
      "y": 0.2330508474576271,
      "scheduled": false
    },
    "542c": {
      "name": "transformation",
      "canvasName": "transformation",
      "summary": "JSON Transformation",
      "description": "Perform a JSON Transformation using the JST library.",
      "location": "Application",
      "locationType": null,
      "app": "WorkFlowEngine",
      "type": "operation",
      "displayName": "WorkFlowEngine",
      "variables": {
        "incoming": {
          "tr_id": "6075cfe68c016f0098c7284d",
          "variableMap": {
            "repoId": "$var.5168.return_data"
          },
          "options": {
            "extractOutput": true,
            "validateIncoming": true,
            "revertToDefaultValue": true
          }
        },
        "outgoing": {
          "gitlabCommitURI": null
        }
      },
      "deprecated": false,
      "matched": [
        {
          "key": "description",
          "highlightString": "Perform a JSON Transformation using the <span class='highlight-string'>JST</span> library."
        }
      ],
      "groups": [],
      "x": 2.0843137254901962,
      "y": 0.4597457627118644,
      "task_name": "getUriGitlab"
    },
    "e90f": {
      "name": "transformation",
      "canvasName": "transformation",
      "summary": "JSON Transformation",
      "description": "Perform a JSON Transformation using the JST library.",
      "location": "Application",
      "locationType": null,
      "app": "WorkFlowEngine",
      "type": "operation",
      "displayName": "WorkFlowEngine",
      "variables": {
        "incoming": {
          "tr_id": "6075bc748c016f0098c72840",
          "variableMap": {
            "errorMessage": "$var.a8f0.return_data"
          },
          "options": {
            "extractOutput": true,
            "validateIncoming": true,
            "revertToDefaultValue": true
          }
        },
        "outgoing": {
          "nameBool": null,
          "pathBool": null
        }
      },
      "deprecated": false,
      "matched": [
        {
          "key": "description",
          "highlightString": "Perform a JSON Transformation using the <span class='highlight-string'>JST</span> library."
        }
      ],
      "groups": [],
      "x": 1.030327868852459,
      "y": 0.6776315789473685,
      "task_name": "repoExistsGitlab"
    },
    "a848": {
      "name": "evaluation",
      "canvasName": "evaluation",
      "summary": "Repo name or path already taken?",
      "description": "Repo name or path already taken?",
      "location": "Application",
      "locationType": null,
      "app": "WorkFlowEngine",
      "type": "operation",
      "displayName": "WorkFlowEngine",
      "variables": {
        "incoming": {
          "all_true_flag": false,
          "evaluation_groups": [
            {
              "all_true_flag": false,
              "evaluations": [
                {
                  "query": "",
                  "operand_1": {
                    "variable": "pathBool",
                    "task": "e90f"
                  },
                  "operator": "==",
                  "operand_2": {
                    "variable": true,
                    "task": "static"
                  }
                },
                {
                  "query": "",
                  "operand_1": {
                    "variable": "nameBool",
                    "task": "e90f"
                  },
                  "operator": "==",
                  "operand_2": {
                    "variable": true,
                    "task": "static"
                  }
                }
              ]
            }
          ]
        },
        "outgoing": {
          "return_value": null
        }
      },
      "deprecated": false,
      "matched": [
        {
          "key": "canvasName",
          "highlightString": "<span class='highlight-string'>eval</span>uation"
        },
        {
          "key": "summary",
          "highlightString": "Run <span class='highlight-string'>Eval</span>uation Task"
        },
        {
          "key": "description",
          "highlightString": "Run an <span class='highlight-string'>eval</span>uation"
        }
      ],
      "groups": [],
      "x": 1.03779527559055,
      "y": 0.763872491145218
    },
    "38fc": {
      "name": "ViewData",
      "canvasName": "ViewData",
      "summary": "View Data",
      "description": "View data in a pretty format",
      "location": "Application",
      "app": "WorkFlowEngine",
      "displayName": "Tools",
      "type": "manual",
      "variables": {
        "incoming": {
          "header": "Failed",
          "message": "Failed to create repository",
          "body": "",
          "variables": {},
          "btn_success": "Retry",
          "btn_failure": ""
        },
        "outgoing": {},
        "error": ""
      },
      "view": "/workflow_engine/task/ViewData",
      "deprecated": false,
      "matched": [
        {
          "key": "canvasName",
          "highlightString": "<span class='highlight-string'>View</span><span class='highlight-string'>Data</span>"
        },
        {
          "key": "summary",
          "highlightString": "<span class='highlight-string'>View</span> <span class='highlight-string'>Data</span>"
        },
        {
          "key": "description",
          "highlightString": "<span class='highlight-string'>View</span> <span class='highlight-string'>data</span> in a pretty format"
        }
      ],
      "groups": [],
      "x": 0.9532786885245902,
      "y": 0.8665254237288136,
      "scheduled": false
    },
    "c46b": {
      "name": "merge",
      "canvasName": "merge",
      "summary": "Merge Data",
      "description": "Merge data into a single object",
      "location": "Application",
      "locationType": null,
      "app": "WorkFlowEngine",
      "type": "operation",
      "displayName": "WorkFlowEngine",
      "variables": {
        "incoming": {
          "data_to_merge": [
            {
              "key": "branch",
              "value": {
                "task": "job",
                "variable": "mrBranchName",
                "editable": true
              }
            },
            {
              "key": "ref",
              "value": {
                "task": "job",
                "variable": "targetBranch",
                "editable": true
              }
            }
          ]
        },
        "outgoing": {
          "merged_object": null
        }
      },
      "deprecated": false,
      "matched": [
        {
          "key": "canvasName",
          "highlightString": "<span class='highlight-string'>merge</span>"
        },
        {
          "key": "summary",
          "highlightString": "<span class='highlight-string'>Merge</span> Data"
        },
        {
          "key": "description",
          "highlightString": "<span class='highlight-string'>Merge</span> data into a single object"
        }
      ],
      "groups": [],
      "x": 1.3772954924874792,
      "y": 0.77307366638442
    },
    "af69": {
      "name": "query",
      "canvasName": "query",
      "summary": "Query update",
      "description": "Query update",
      "location": "Application",
      "locationType": null,
      "app": "WorkFlowEngine",
      "type": "operation",
      "displayName": "WorkFlowEngine",
      "variables": {
        "incoming": {
          "pass_on_null": false,
          "query": "update",
          "obj": "$var.job.artifactCreateAndUpdate"
        },
        "outgoing": {
          "return_data": null
        },
        "error": ""
      },
      "deprecated": false,
      "matched": [
        {
          "key": "canvasName",
          "highlightString": "<span class='highlight-string'>query</span>"
        },
        {
          "key": "summary",
          "highlightString": "<span class='highlight-string'>Query</span> Data Using 'json-query' Format"
        },
        {
          "key": "description",
          "highlightString": "<span class='highlight-string'>Query</span> data using a dot/bracket notation string and a matching key/value pair."
        }
      ],
      "groups": [],
      "x": 1.6942622950819672,
      "y": 0.7680084745762712,
      "scheduled": false
    },
    "edbd": {
      "name": "childJob",
      "canvasName": "childJob",
      "summary": "Create Commit Data",
      "description": "Run a child job inside a workflow.",
      "location": "Application",
      "locationType": null,
      "app": "WorkFlowEngine",
      "type": "operation",
      "displayName": "WorkFlowEngine",
      "variables": {
        "incoming": {
          "task": "",
          "workflow": "Push Bundles to Gitlab Adapter Commit Data",
          "variables": {
            "artifact": {
              "variable": "",
              "task": "7f02",
              "value": "fixedArray"
            },
            "action": {
              "variable": "",
              "task": "static",
              "value": "update"
            }
          },
          "data_array": "",
          "transformation": "",
          "loopType": ""
        },
        "outgoing": {
          "job_details": null
        }
      },
      "deprecated": false,
      "matched": [
        {
          "key": "canvasName",
          "highlightString": "<span class='highlight-string'>child</span><span class='highlight-string'>Job</span>"
        },
        {
          "key": "summary",
          "highlightString": "Run <span class='highlight-string'>Child</span> <span class='highlight-string'>Job</span>"
        },
        {
          "key": "description",
          "highlightString": "Run a <span class='highlight-string'>child</span> <span class='highlight-string'>job</span> inside a workflow."
        }
      ],
      "groups": [],
      "actor": "job",
      "x": 1.5491803278688525,
      "y": 1.0963983050847457
    },
    "25d8": {
      "name": "merge",
      "canvasName": "merge",
      "summary": "Merge Data",
      "description": "Merge data into a single object",
      "location": "Application",
      "locationType": null,
      "app": "WorkFlowEngine",
      "type": "operation",
      "displayName": "WorkFlowEngine",
      "variables": {
        "incoming": {
          "data_to_merge": [
            {
              "key": "branch",
              "value": {
                "task": "job",
                "variable": "mrBranchName",
                "editable": true
              }
            },
            {
              "key": "commit_message",
              "value": {
                "task": "job",
                "variable": "commitMessage",
                "editable": true
              }
            },
            {
              "key": "actions",
              "value": {
                "task": "592",
                "variable": "return_data"
              }
            }
          ]
        },
        "outgoing": {
          "merged_object": null
        }
      },
      "deprecated": false,
      "matched": [
        {
          "key": "canvasName",
          "highlightString": "<span class='highlight-string'>merge</span>"
        },
        {
          "key": "summary",
          "highlightString": "<span class='highlight-string'>Merge</span> Data"
        },
        {
          "key": "description",
          "highlightString": "<span class='highlight-string'>Merge</span> data into a single object"
        }
      ],
      "groups": [],
      "x": 1.8245901639344262,
      "y": 1.076271186440678
    },
    "b529": {
      "name": "ViewData",
      "canvasName": "ViewData",
      "summary": "View Data",
      "description": "View data in a pretty format",
      "location": "Application",
      "app": "WorkFlowEngine",
      "displayName": "Tools",
      "type": "manual",
      "variables": {
        "incoming": {
          "header": "Failed",
          "message": "failed to update MR branch",
          "body": "failed",
          "variables": {},
          "btn_success": "Retry",
          "btn_failure": "Cancel"
        },
        "outgoing": {},
        "error": ""
      },
      "view": "/workflow_engine/task/ViewData",
      "deprecated": false,
      "matched": [
        {
          "key": "canvasName",
          "highlightString": "<span class='highlight-string'>View</span><span class='highlight-string'>Data</span>"
        },
        {
          "key": "summary",
          "highlightString": "<span class='highlight-string'>View</span> <span class='highlight-string'>Data</span>"
        },
        {
          "key": "description",
          "highlightString": "<span class='highlight-string'>View</span> <span class='highlight-string'>data</span> in a pretty format"
        }
      ],
      "groups": [],
      "x": 2.5344262295081967,
      "y": 1.048728813559322,
      "scheduled": false
    },
    "dd20": {
      "name": "merge",
      "canvasName": "merge",
      "summary": "Merge Data",
      "description": "Merge data into a single object",
      "location": "Application",
      "locationType": null,
      "app": "WorkFlowEngine",
      "type": "operation",
      "displayName": "WorkFlowEngine",
      "variables": {
        "incoming": {
          "data_to_merge": [
            {
              "key": "source_branch",
              "value": {
                "task": "job",
                "variable": "mrBranchName",
                "editable": true
              }
            },
            {
              "key": "target_branch",
              "value": {
                "task": "job",
                "variable": "targetBranch",
                "editable": true
              }
            },
            {
              "key": "title",
              "value": {
                "task": "job",
                "variable": "mrBranchName",
                "editable": true
              }
            },
            {
              "key": "description",
              "value": {
                "task": "ddb4",
                "variable": "combinedStrings",
                "editable": true
              }
            }
          ]
        },
        "outgoing": {
          "merged_object": null
        }
      },
      "deprecated": false,
      "matched": [
        {
          "key": "canvasName",
          "highlightString": "<span class='highlight-string'>merge</span>"
        },
        {
          "key": "summary",
          "highlightString": "<span class='highlight-string'>Merge</span> Data"
        },
        {
          "key": "description",
          "highlightString": "<span class='highlight-string'>Merge</span> data into a single object"
        }
      ],
      "groups": [],
      "x": 2.8975409836065573,
      "y": 1.2605932203389831
    },
    "92e3": {
      "name": "transformation",
      "canvasName": "transformation",
      "summary": "JSON Transformation",
      "description": "Perform a JSON Transformation using the JST library.",
      "location": "Application",
      "locationType": null,
      "app": "WorkFlowEngine",
      "type": "operation",
      "displayName": "WorkFlowEngine",
      "variables": {
        "incoming": {
          "tr_id": "6075cfe68c016f0098c7284d",
          "variableMap": {
            "repoId": "$var.3c4a.repoId"
          },
          "options": {
            "extractOutput": true,
            "validateIncoming": true,
            "revertToDefaultValue": true
          }
        },
        "outgoing": {
          "gitlabCommitURI": null
        }
      },
      "deprecated": false,
      "matched": [
        {
          "key": "description",
          "highlightString": "Perform a JSON Transformation using the <span class='highlight-string'>JST</span> library."
        }
      ],
      "groups": [],
      "x": 1.9226519337016574,
      "y": 1.0660501981505945,
      "task_name": "getUriGitlab"
    },
    "3c4a": {
      "name": "transformation",
      "canvasName": "transformation",
      "summary": "JSON Transformation",
      "description": "Perform a JSON Transformation using the JST library.",
      "location": "Application",
      "locationType": null,
      "app": "WorkFlowEngine",
      "type": "operation",
      "displayName": "WorkFlowEngine",
      "variables": {
        "incoming": {
          "tr_id": "6075bd068c016f0098c72848",
          "variableMap": {
            "repoSearchName": "$var.job.repoName",
            "repoSearchResults": "$var.619.return_data"
          },
          "options": {
            "extractOutput": true,
            "validateIncoming": false,
            "revertToDefaultValue": true
          }
        },
        "outgoing": {
          "repoURL": null,
          "repoId": null,
          "httpURL": null
        }
      },
      "deprecated": false,
      "matched": [
        {
          "key": "description",
          "highlightString": "Perform a JSON Transformation using the <span class='highlight-string'>JST</span> library."
        }
      ],
      "groups": [],
      "x": 1.2504173622704509,
      "y": 0.7747671464860287,
      "task_name": "getRepoURLGitlab"
    },
    "f382": {
      "name": "transformation",
      "canvasName": "transformation",
      "summary": "JSON Transformation",
      "description": "Perform a JSON Transformation using the JST library.",
      "location": "Application",
      "locationType": null,
      "app": "WorkFlowEngine",
      "type": "operation",
      "displayName": "WorkFlowEngine",
      "variables": {
        "incoming": {
          "tr_id": "6075d09d8c016f0098c7284e",
          "variableMap": {
            "repoId": "$var.3c4a.repoId",
            "targetBranch": "$var.job.targetBranch"
          },
          "options": {
            "extractOutput": true,
            "validateIncoming": false,
            "revertToDefaultValue": true
          }
        },
        "outgoing": {
          "getPackageJsonURL": null
        }
      },
      "deprecated": false,
      "matched": [
        {
          "key": "description",
          "highlightString": "Perform a JSON Transformation using the <span class='highlight-string'>JST</span> library."
        }
      ],
      "groups": [],
      "x": 1.7836065573770492,
      "y": 0.7701271186440678,
      "task_name": "getPackageJsonGitlab"
    },
    "40bf": {
      "name": "query",
      "canvasName": "query",
      "summary": "Query version",
      "description": "Query version",
      "location": "Application",
      "locationType": null,
      "app": "WorkFlowEngine",
      "type": "operation",
      "displayName": "WorkFlowEngine",
      "variables": {
        "incoming": {
          "pass_on_null": false,
          "query": "response.version",
          "obj": "$var.c16e.result"
        },
        "outgoing": {
          "return_data": null
        },
        "error": "",
        "decorators": []
      },
      "deprecated": false,
      "matched": [
        {
          "key": "canvasName",
          "highlightString": "<span class='highlight-string'>query</span>"
        },
        {
          "key": "summary",
          "highlightString": "<span class='highlight-string'>Query</span> Data Using 'json-query' Format"
        },
        {
          "key": "description",
          "highlightString": "<span class='highlight-string'>Query</span> data using a dot/bracket notation string and a matching key/value pair."
        }
      ],
      "groups": [],
      "x": 1.7008196721311475,
      "y": 0.9226694915254238,
      "scheduled": false
    },
    "ddb4": {
      "name": "stringConcat",
      "canvasName": "concat",
      "summary": "Merge request description",
      "description": "Merge request description",
      "location": "Application",
      "locationType": null,
      "app": "WorkFlowEngine",
      "type": "automatic",
      "displayName": "String",
      "variables": {
        "incoming": {
          "str": "Merge request created by:",
          "stringN": "$var.job.username"
        },
        "outgoing": {
          "combinedStrings": null
        },
        "error": ""
      },
      "deprecated": false,
      "matched": [
        {
          "key": "canvasName",
          "highlightString": "<span class='highlight-string'>concat</span>"
        },
        {
          "key": "summary",
          "highlightString": "<span class='highlight-string'>Concat</span>enates strings together."
        },
        {
          "key": "description",
          "highlightString": "<span class='highlight-string'>Concat</span>enates a string with a second string(s). The second parameter can be a string or array."
        }
      ],
      "groups": [],
      "actor": "Pronghorn",
      "x": 2.754918032786885,
      "y": 1.263771186440678,
      "scheduled": false
    },
    "d1bf": {
      "name": "transformation",
      "canvasName": "transformation",
      "summary": "JSON Transformation",
      "description": "Perform a JSON Transformation using the JST library.",
      "location": "Application",
      "locationType": null,
      "app": "WorkFlowEngine",
      "type": "operation",
      "displayName": "WorkFlowEngine",
      "variables": {
        "incoming": {
          "tr_id": "6075bcc58c016f0098c72846",
          "variableMap": {
            "branch": "$var.ae5b.branch",
            "commit_message": "$var.ae5b.commit_message",
            "filterActions": "$var.ae5b.actions"
          },
          "options": {
            "extractOutput": true,
            "validateIncoming": true,
            "revertToDefaultValue": true
          }
        },
        "outgoing": {
          "filteredCommit": null
        }
      },
      "deprecated": false,
      "matched": [
        {
          "key": "description",
          "highlightString": "Perform a JSON Transformation using the <span class='highlight-string'>JST</span> library."
        }
      ],
      "groups": [],
      "x": 2.3475409836065575,
      "y": 1.2786016949152543,
      "task_name": "filterActionsGitlab"
    },
    "ae5b": {
      "name": "transformation",
      "canvasName": "transformation",
      "summary": "JSON Transformation",
      "description": "Perform a JSON Transformation using the JST library.",
      "location": "Application",
      "locationType": null,
      "app": "WorkFlowEngine",
      "type": "operation",
      "displayName": "WorkFlowEngine",
      "variables": {
        "incoming": {
          "tr_id": "6075d1cf8c016f0098c72852",
          "variableMap": {
            "commitUpdate": "$var.25d8.merged_object"
          },
          "options": {
            "extractOutput": true,
            "validateIncoming": true,
            "revertToDefaultValue": true
          }
        },
        "outgoing": {
          "branch": null,
          "commit_message": null,
          "actions": null
        }
      },
      "deprecated": false,
      "matched": [
        {
          "key": "description",
          "highlightString": "Perform a JSON Transformation using the <span class='highlight-string'>JST</span> library."
        }
      ],
      "groups": [],
      "x": 2.24672131147541,
      "y": 1.2754237288135593,
      "task_name": "actionCreateGitlab"
    },
    "2dcc": {
      "name": "transformation",
      "canvasName": "transformation",
      "summary": "JSON Transformation",
      "description": "Perform a JSON Transformation using the JST library.",
      "location": "Application",
      "locationType": null,
      "app": "WorkFlowEngine",
      "type": "operation",
      "displayName": "WorkFlowEngine",
      "variables": {
        "incoming": {
          "tr_id": "6075d13d8c016f0098c7284f",
          "variableMap": {
            "repoID": "$var.3c4a.repoId"
          },
          "options": {
            "extractOutput": true,
            "validateIncoming": true,
            "revertToDefaultValue": true
          }
        },
        "outgoing": {
          "uriForGet": null
        }
      },
      "deprecated": false,
      "matched": [
        {
          "key": "description",
          "highlightString": "Perform a JSON Transformation using the <span class='highlight-string'>JST</span> library."
        }
      ],
      "groups": [],
      "x": 2.044262295081967,
      "y": 1.0730932203389831,
      "task_name": "getUriForFilesGitlab"
    },
    "6c1": {
      "name": "postV4Projects",
      "canvasName": "postV4Projects",
      "summary": "Create new project",
      "description": "Create new project",
      "location": "Adapter",
      "locationType": "Gitlab",
      "app": "Gitlab",
      "type": "automatic",
      "displayName": "Gitlab",
      "variables": {
        "incoming": {
          "body": "$var.fa4d.merged_object",
          "adapter_id": "$var.job.adapter_id"
        },
        "outgoing": {
          "result": null
        },
        "error": "$var.job.error"
      },
      "deprecated": false,
      "matched": [
        {
          "key": "canvasName",
          "highlightString": "<span class='highlight-string'>postV4Projects</span>"
        }
      ],
      "groups": [],
      "actor": "Pronghorn",
      "x": 1.0344262295081967,
      "y": 0.4650423728813559,
      "scheduled": false
    },
    "a8f0": {
      "name": "query",
      "canvasName": "query",
      "summary": "get error response",
      "description": "Query data using a dot/bracket notation string and a matching key/value pair.",
      "location": "Application",
      "locationType": null,
      "app": "WorkFlowEngine",
      "type": "operation",
      "displayName": "WorkFlowEngine",
      "variables": {
        "incoming": {
          "pass_on_null": false,
          "query": "response",
          "obj": "$var.job.error"
        },
        "outgoing": {
          "return_data": null
        },
        "error": "$var.job.createError"
      },
      "deprecated": false,
      "matched": [
        {
          "key": "canvasName",
          "highlightString": "<span class='highlight-string'>query</span>"
        },
        {
          "key": "summary",
          "highlightString": "<span class='highlight-string'>Query</span> Data Using 'json-query' Format"
        },
        {
          "key": "description",
          "highlightString": "<span class='highlight-string'>Query</span> data using a dot/bracket notation string and a matching key/value pair."
        }
      ],
      "groups": [],
      "x": 1.039344262295082,
      "y": 0.5826271186440678,
      "scheduled": false
    },
    "8f4d": {
      "name": "getV4GroupsId",
      "canvasName": "getV4GroupsId",
      "summary": "Get a single group, with containing projects.",
      "description": "Get a single group, with containing projects.",
      "location": "Adapter",
      "locationType": "Gitlab",
      "app": "Gitlab",
      "type": "automatic",
      "displayName": "Gitlab",
      "variables": {
        "incoming": {
          "id": "$var.job.url",
          "adapter_id": "$var.job.adapter_id"
        },
        "outgoing": {
          "result": null
        },
        "error": ""
      },
      "deprecated": false,
      "matched": [
        {
          "key": "canvasName",
          "highlightString": "<span class='highlight-string'>getV4GroupsId</span>"
        }
      ],
      "groups": [],
      "actor": "Pronghorn",
      "x": 0.3836065573770492,
      "y": 0.4809322033898305,
      "scheduled": false
    },
    "2b32": {
      "name": "postV4ProjectsIdRepositoryBranches",
      "canvasName": "postV4ProjectsIdRepositoryBranches",
      "summary": "Create branch",
      "description": "Create branch",
      "location": "Adapter",
      "locationType": "Gitlab",
      "app": "Gitlab",
      "type": "automatic",
      "displayName": "Gitlab",
      "variables": {
        "incoming": {
          "id": "$var.3c4a.repoId",
          "body": "$var.c46b.merged_object",
          "adapter_id": "$var.job.adapter_id"
        },
        "outgoing": {
          "result": null
        },
        "error": ""
      },
      "deprecated": false,
      "matched": [
        {
          "key": "canvasName",
          "highlightString": "postV4ProjectsIdRepository<span class='highlight-string'>Branch</span>es"
        },
        {
          "key": "summary",
          "highlightString": "Create <span class='highlight-string'>branch</span>"
        },
        {
          "key": "description",
          "highlightString": "Create <span class='highlight-string'>branch</span>"
        }
      ],
      "groups": [],
      "actor": "Pronghorn",
      "x": 1.5508196721311476,
      "y": 0.7701271186440678,
      "scheduled": false
    },
    "c16e": {
      "name": "getV4ProjectsRepositoryFilesRaw",
      "canvasName": "getV4ProjectsRepositoryFilesRaw",
      "summary": "Get raw file from repository",
      "description": "Get raw file from repository",
      "location": "Adapter",
      "locationType": "Gitlab",
      "app": "Gitlab",
      "type": "automatic",
      "displayName": "Gitlab",
      "variables": {
        "incoming": {
          "ref": "master",
          "id": "$var.3c4a.repoId",
          "filePath": "package.json",
          "adapter_id": "$var.job.adapter_id"
        },
        "outgoing": {
          "result": null
        },
        "error": ""
      },
      "deprecated": false,
      "matched": [
        {
          "key": "canvasName",
          "highlightString": "getV4ProjectsRepository<span class='highlight-string'>File</span>sRaw"
        },
        {
          "key": "summary",
          "highlightString": "Get raw <span class='highlight-string'>file</span> from repository"
        },
        {
          "key": "description",
          "highlightString": "Get raw <span class='highlight-string'>file</span> from repository"
        }
      ],
      "groups": [],
      "actor": "Pronghorn",
      "x": 1.560655737704918,
      "y": 0.9290254237288136,
      "scheduled": false
    },
    "57f8": {
      "name": "postV4ProjectsIdRepositoryCommits",
      "canvasName": "postV4ProjectsIdRepositoryCommits",
      "summary": "Commit multiple file changes as one commit",
      "description": "This feature was introduced in GitLab 8.13",
      "location": "Adapter",
      "locationType": "Gitlab",
      "app": "Gitlab",
      "type": "automatic",
      "displayName": "Gitlab",
      "variables": {
        "incoming": {
          "id": "$var.3c4a.repoId",
          "body": "$var.a161.commitDeleteBody",
          "adapter_id": "$var.job.adapter_id"
        },
        "outgoing": {
          "result": null
        },
        "error": ""
      },
      "deprecated": false,
      "matched": [
        {
          "key": "canvasName",
          "highlightString": "<span class='highlight-string'>postV4ProjectsIdRepositoryCommits</span>"
        }
      ],
      "groups": [],
      "actor": "Pronghorn",
      "x": 2.0737704918032787,
      "y": 1.277542372881356,
      "scheduled": false
    },
    "3ed9": {
      "name": "postV4ProjectsIdRepositoryCommits",
      "canvasName": "postV4ProjectsIdRepositoryCommits",
      "summary": "Commit multiple file changes as one commit",
      "description": "This feature was introduced in GitLab 8.13",
      "location": "Adapter",
      "locationType": "Gitlab",
      "app": "Gitlab",
      "type": "automatic",
      "displayName": "Gitlab",
      "variables": {
        "incoming": {
          "id": "$var.3c4a.repoId",
          "body": "$var.d1bf.filteredCommit",
          "adapter_id": "$var.job.adapter_id"
        },
        "outgoing": {
          "result": null
        },
        "error": ""
      },
      "deprecated": false,
      "matched": [
        {
          "key": "canvasName",
          "highlightString": "<span class='highlight-string'>postV4ProjectsIdRepositoryCommits</span>"
        }
      ],
      "groups": [],
      "actor": "Pronghorn",
      "x": 2.5278688524590165,
      "y": 1.2680084745762712,
      "scheduled": false
    },
    "9c59": {
      "name": "postV4ProjectsIdMergeRequests",
      "canvasName": "postV4ProjectsIdMergeRequests",
      "summary": "Create a merge request",
      "description": "Create a merge request",
      "location": "Adapter",
      "locationType": "Gitlab",
      "app": "Gitlab",
      "type": "automatic",
      "displayName": "Gitlab",
      "variables": {
        "incoming": {
          "id": "$var.3c4a.repoId",
          "body": "$var.dd20.merged_object",
          "adapter_id": "$var.job.adapter_id"
        },
        "outgoing": {
          "result": null
        },
        "error": ""
      },
      "deprecated": false,
      "matched": [
        {
          "key": "canvasName",
          "highlightString": "postV4ProjectsId<span class='highlight-string'>Merge</span>Requests"
        },
        {
          "key": "summary",
          "highlightString": "Create a <span class='highlight-string'>merge</span> request"
        },
        {
          "key": "description",
          "highlightString": "Create a <span class='highlight-string'>merge</span> request"
        }
      ],
      "groups": [],
      "actor": "Pronghorn",
      "x": 3.0508196721311474,
      "y": 1.2669491525423728,
      "scheduled": false
    },
    "5c14": {
      "name": "postV4ProjectsIdRepositoryCommits",
      "canvasName": "postV4ProjectsIdRepositoryCommits",
      "summary": "Commit multiple file changes as one commit",
      "description": "This feature was introduced in GitLab 8.13",
      "location": "Adapter",
      "locationType": "Gitlab",
      "app": "Gitlab",
      "type": "automatic",
      "displayName": "Gitlab",
      "variables": {
        "incoming": {
          "id": "$var.5168.return_data",
          "body": "$var.14f0.merged_object",
          "adapter_id": "$var.job.adapter_id"
        },
        "outgoing": {
          "result": null
        },
        "error": ""
      },
      "deprecated": false,
      "matched": [
        {
          "key": "canvasName",
          "highlightString": "<span class='highlight-string'>postV4ProjectsIdRepositoryCommits</span>"
        }
      ],
      "groups": [],
      "actor": "Pronghorn",
      "x": 2.462745098039216,
      "y": 0.4724576271186441,
      "scheduled": false
    },
    "f9c1": {
      "name": "childJob",
      "canvasName": "childJob",
      "summary": "Run Child Job",
      "description": "Runs a child job inside a workflow.",
      "location": "Application",
      "locationType": null,
      "app": "WorkFlowEngine",
      "type": "operation",
      "displayName": "WorkFlowEngine",
      "variables": {
        "incoming": {
          "task": "",
          "workflow": "Push Bundles to Gitlab Adapter Compliance Commit",
          "variables": {
            "artifact": {
              "variable": "",
              "task": "14f0",
              "value": "merged_object"
            },
            "id": {
              "variable": "",
              "task": "5168",
              "value": "return_data"
            },
            "adapter_id": {
              "variable": "",
              "task": "job",
              "value": "adapter_id"
            }
          },
          "data_array": "",
          "transformation": "",
          "loopType": ""
        },
        "outgoing": {
          "job_details": null
        }
      },
      "deprecated": false,
      "matched": [
        {
          "key": "canvasName",
          "highlightString": "<span class='highlight-string'>child</span>Job"
        },
        {
          "key": "summary",
          "highlightString": "Run <span class='highlight-string'>Child</span> Job"
        },
        {
          "key": "description",
          "highlightString": "Runs a <span class='highlight-string'>child</span> job inside a workflow."
        }
      ],
      "groups": [],
      "actor": "job",
      "x": 2.7426229508196722,
      "y": 0.4841101694915254
    },
    "f3e4": {
      "name": "transformation",
      "canvasName": "transformation",
      "summary": "JSON Transformation",
      "description": "Perform a JSON Transformation using the JST library.",
      "location": "Application",
      "locationType": null,
      "app": "WorkFlowEngine",
      "type": "operation",
      "displayName": "WorkFlowEngine",
      "variables": {
        "incoming": {
          "tr_id": "6075d17e8c016f0098c72850",
          "variableMap": {
            "bodyFromGetCall": "$var.2890.return_data"
          },
          "options": {
            "extractOutput": true,
            "validateIncoming": true,
            "revertToDefaultValue": true
          }
        },
        "outgoing": {
          "filteredBody": null
        }
      },
      "deprecated": false,
      "matched": [
        {
          "key": "description",
          "highlightString": "Perform a JSON Transformation using the <span class='highlight-string'>JST</span> library."
        }
      ],
      "groups": [],
      "x": 1.7877049180327869,
      "y": 1.2838983050847457,
      "task_name": "filterBodyGitlab"
    },
    "a161": {
      "name": "transformation",
      "canvasName": "transformation",
      "summary": "JSON Transformation",
      "description": "Perform a JSON Transformation using the JST library.",
      "location": "Application",
      "locationType": null,
      "app": "WorkFlowEngine",
      "type": "operation",
      "displayName": "WorkFlowEngine",
      "variables": {
        "incoming": {
          "tr_id": "6075d19a8c016f0098c72851",
          "variableMap": {
            "commit_message": "Clean Repo [skip ci]",
            "branch": "$var.job.mrBranchName",
            "filteredBody": "$var.f3e4.filteredBody"
          },
          "options": {
            "extractOutput": true,
            "validateIncoming": true,
            "revertToDefaultValue": true
          }
        },
        "outgoing": {
          "commitDeleteBody": null
        }
      },
      "deprecated": false,
      "matched": [
        {
          "key": "description",
          "highlightString": "Perform a JSON Transformation using the <span class='highlight-string'>JST</span> library."
        }
      ],
      "groups": [],
      "x": 1.8754098360655738,
      "y": 1.284957627118644,
      "task_name": "createDeleteCommitGitlab"
    },
    "c6d7": {
      "name": "getV4ProjectsIdRepositoryTree",
      "canvasName": "getV4ProjectsIdRepositoryTree",
      "summary": "Get a project repository tree",
      "description": "Get a project repository tree",
      "location": "Adapter",
      "locationType": "Gitlab",
      "app": "Gitlab",
      "type": "automatic",
      "displayName": "Gitlab",
      "variables": {
        "incoming": {
          "id": "$var.3c4a.repoId",
          "ref": "$var.job.mrBranchName",
          "pathParam": "",
          "recursive": true,
          "perPage": 5000,
          "adapter_id": "$var.job.adapter_id"
        },
        "outgoing": {
          "result": null
        },
        "error": ""
      },
      "deprecated": false,
      "matched": [
        {
          "key": "canvasName",
          "highlightString": "<span class='highlight-string'>getV4ProjectsIdRepositoryTree</span>"
        }
      ],
      "groups": [],
      "actor": "Pronghorn",
      "x": 1.5327868852459017,
      "y": 1.2701271186440677,
      "scheduled": false
    },
    "b99e": {
      "name": "getTime",
      "canvasName": "getTime",
      "summary": "Get time",
      "description": "Gets the current time with an optional offset, timezone shift, and format string",
      "location": "Application",
      "locationType": null,
      "app": "WorkFlowEngine",
      "type": "automatic",
      "displayName": "Time",
      "variables": {
        "incoming": {
          "timezone": "-05:00",
          "offsetDuration": "",
          "format": ""
        },
        "outgoing": {
          "time": null
        },
        "error": ""
      },
      "deprecated": false,
      "matched": [
        {
          "key": "canvasName",
          "highlightString": "<span class='highlight-string'>getTime</span>"
        }
      ],
      "groups": [],
      "actor": "Pronghorn",
      "x": 2.1715686274509802,
      "y": 0.4639830508474576,
      "scheduled": false
    },
    "a33f": {
      "name": "delay",
      "canvasName": "delay",
      "summary": "Delay a Job",
      "description": "Delay a Job for a duration by Job ID and number of seconds.",
      "location": "Application",
      "locationType": null,
      "app": "WorkFlowEngine",
      "type": "operation",
      "displayName": "WorkFlowEngine",
      "variables": {
        "incoming": {
          "time": 10
        },
        "outgoing": {
          "time_in_milliseconds": null
        },
        "error": ""
      },
      "deprecated": false,
      "matched": [
        {
          "key": "canvasName",
          "highlightString": "<span class='highlight-string'>delay</span>"
        },
        {
          "key": "summary",
          "highlightString": "<span class='highlight-string'>Delay</span> a Job"
        },
        {
          "key": "description",
          "highlightString": "<span class='highlight-string'>Delay</span> a Job for a duration by Job ID and number of seconds."
        }
      ],
      "groups": [],
      "x": 2.303921568627451,
      "y": 0.3082627118644068,
      "scheduled": false
    },
    "b51": {
      "name": "ViewData",
      "canvasName": "ViewData",
      "summary": "SubGroup Not Found",
      "description": "Displays a message and runtime data to an operator. This can be used to request a decision, or used for acknowledgement only.",
      "location": "Application",
      "app": "WorkFlowEngine",
      "displayName": "Tools",
      "type": "manual",
      "variables": {
        "incoming": {
          "header": "SubGroup Not Found",
          "message": "",
          "body": "Error making commit to repository on GitLab. Try again?",
          "variables": {},
          "btn_success": "Try Again",
          "btn_failure": "End"
        },
        "outgoing": {},
        "error": ""
      },
      "view": "/workflow_engine/task/ViewData",
      "deprecated": false,
      "matched": [
        {
          "key": "canvasName",
          "highlightString": "<span class='highlight-string'>View</span>Data"
        },
        {
          "key": "summary",
          "highlightString": "<span class='highlight-string'>View</span> Data"
        }
      ],
      "groups": [],
      "x": 0.3819672131147541,
      "y": 0.3283898305084746,
      "scheduled": false
    },
    "ea3c": {
      "name": "transformation",
      "canvasName": "transformation",
      "summary": "updatePackageJSONGitlab",
      "description": "Perform a JSON Transformation using the JST library.",
      "location": "Application",
      "locationType": null,
      "app": "WorkFlowEngine",
      "type": "operation",
      "displayName": "WorkFlowEngine",
      "variables": {
        "incoming": {
          "tr_id": "6075bc6c8c016f0098c7283f",
          "variableMap": {
            "filesArray": "$var.5a7e.return_data",
            "packageJsonName": "$var.job.packageJsonName",
            "packageJsonVersion": "0.0.1"
          },
          "options": {
            "extractOutput": false,
            "validateIncoming": true,
            "revertToDefaultValue": true
          }
        },
        "outgoing": {
          "fixedArray": null
        }
      },
      "deprecated": false,
      "matched": [
        {
          "key": "description",
          "highlightString": "Perform a JSON Transformation using the <span class='highlight-string'>JST</span> library."
        }
      ],
      "groups": [],
      "x": 1.5303867403314917,
      "y": 0.4914134742404227,
      "task_name": "updatePackageJSONGitlab"
    },
    "7f02": {
      "name": "transformation",
      "canvasName": "transformation",
      "summary": "updatePackageJSONGitlab",
      "description": "Perform a JSON Transformation using the JST library.",
      "location": "Application",
      "locationType": null,
      "app": "WorkFlowEngine",
      "type": "operation",
      "displayName": "WorkFlowEngine",
      "variables": {
        "incoming": {
          "tr_id": "6075bc6c8c016f0098c7283f",
          "variableMap": {
            "filesArray": "$var.af69.return_data",
            "packageJsonName": "$var.job.packageJsonName",
            "packageJsonVersion": "$var.40bf.return_data"
          },
          "options": {
            "extractOutput": false,
            "validateIncoming": true,
            "revertToDefaultValue": true
          }
        },
        "outgoing": {
          "fixedArray": null
        }
      },
      "deprecated": false,
      "matched": [
        {
          "key": "description",
          "highlightString": "Perform a JSON Transformation using the <span class='highlight-string'>JST</span> library."
        }
      ],
      "groups": [],
      "x": 1.7823204419889502,
      "y": 0.9273447820343461,
      "task_name": "updatePackageJSONGitlab"
    }
  },
  "transitions": {
    "592": {
      "25d8": {
        "type": "standard",
        "state": "success"
      }
    },
    "619": {
      "3c4a": {
        "type": "standard",
        "state": "success"
      }
    },
    "1751": {
      "fa4d": {
        "type": "standard",
        "state": "success"
      }
    },
    "2890": {
      "f3e4": {
        "type": "standard",
        "state": "success"
      }
    },
    "2995": {
      "5c14": {
        "type": "standard",
        "state": "success"
      }
    },
    "5168": {
      "5a9c": {
        "type": "standard",
        "state": "success"
      }
    },
    "6114": {
      "3b3e": {
        "type": "standard",
        "state": "failure"
      },
      "a33f": {
        "type": "standard",
        "state": "success"
      }
    },
    "7100": {
      "workflow_end": {
        "type": "standard",
        "state": "failure"
      },
      "9c59": {
        "type": "revert",
        "state": "success"
      }
    },
    "workflow_start": {
      "8f4d": {
        "type": "standard",
        "state": "success"
      }
    },
    "workflow_end": {},
    "8f53": {
      "1751": {
        "type": "standard",
        "state": "success"
      }
    },
    "fa4d": {
      "29b": {
        "type": "standard",
        "state": "success"
      }
    },
    "29b": {
      "6c1": {
        "type": "standard",
        "state": "success"
      }
    },
    "190d": {
      "5a9c": {
        "type": "standard",
        "state": "success"
      }
    },
    "cfa6": {
      "5a9c": {
        "type": "standard",
        "state": "success"
      }
    },
    "5a9c": {
      "5a7e": {
        "type": "standard",
        "state": "success"
      }
    },
    "5a7e": {
      "ea3c": {
        "type": "standard",
        "state": "success"
      }
    },
    "753f": {
      "871d": {
        "type": "standard",
        "state": "success"
      }
    },
    "871d": {
      "14f0": {
        "type": "standard",
        "state": "success"
      }
    },
    "14f0": {
      "542c": {
        "type": "standard",
        "state": "success"
      }
    },
    "3b3e": {
      "542c": {
        "type": "revert",
        "state": "success"
      }
    },
    "583c": {},
    "ba52": {},
    "542c": {
      "b99e": {
        "type": "standard",
        "state": "success"
      }
    },
    "e90f": {
      "a848": {
        "type": "standard",
        "state": "success"
      }
    },
    "a848": {
      "619": {
        "type": "standard",
        "state": "success"
      },
      "38fc": {
        "type": "standard",
        "state": "failure"
      }
    },
    "38fc": {
      "6c1": {
        "type": "revert",
        "state": "success"
      }
    },
    "c60": {},
    "c46b": {
      "2b32": {
        "type": "standard",
        "state": "success"
      }
    },
    "af69": {
      "f382": {
        "type": "standard",
        "state": "success"
      }
    },
    "edbd": {
      "592": {
        "type": "standard",
        "state": "success"
      }
    },
    "25d8": {
      "92e3": {
        "type": "standard",
        "state": "success"
      }
    },
    "b529": {
      "3ed9": {
        "type": "revert",
        "state": "success"
      }
    },
    "dd20": {
      "9c59": {
        "type": "standard",
        "state": "success"
      }
    },
    "683e": {},
    "2c42": {},
    "33ba": {},
    "92e3": {
      "2dcc": {
        "type": "standard",
        "state": "success"
      }
    },
    "1fc1": {},
    "3c4a": {
      "c46b": {
        "type": "standard",
        "state": "success"
      }
    },
    "f382": {
      "c16e": {
        "type": "standard",
        "state": "success"
      }
    },
    "40bf": {
      "7f02": {
        "type": "standard",
        "state": "success"
      }
    },
    "ddb4": {
      "dd20": {
        "type": "standard",
        "state": "success"
      }
    },
    "80b1": {},
    "d1bf": {
      "3ed9": {
        "type": "standard",
        "state": "success"
      }
    },
    "ae5b": {
      "d1bf": {
        "type": "standard",
        "state": "success"
      }
    },
    "2dcc": {
      "c6d7": {
        "type": "standard",
        "state": "success"
      }
    },
    "5a0d": {},
    "a613": {},
    "6c1": {
      "5168": {
        "type": "standard",
        "state": "success"
      },
      "cfa6": {
        "type": "standard",
        "state": "success"
      },
      "190d": {
        "type": "standard",
        "state": "success"
      },
      "a8f0": {
        "type": "standard",
        "state": "error"
      }
    },
    "a8f0": {
      "e90f": {
        "type": "standard",
        "state": "success"
      }
    },
    "8f4d": {
      "8f53": {
        "type": "standard",
        "state": "success"
      },
      "b51": {
        "type": "standard",
        "state": "error"
      }
    },
    "2b32": {
      "af69": {
        "type": "standard",
        "state": "success"
      }
    },
    "c16e": {
      "40bf": {
        "type": "standard",
        "state": "success"
      }
    },
    "57f8": {
      "ae5b": {
        "type": "standard",
        "state": "success"
      }
    },
    "3ed9": {
      "b529": {
        "type": "standard",
        "state": "error"
      },
      "ddb4": {
        "type": "standard",
        "state": "success"
      }
    },
    "9c59": {
      "7100": {
        "type": "standard",
        "state": "error"
      },
      "workflow_end": {
        "type": "standard",
        "state": "success"
      }
    },
    "5c14": {
      "6114": {
        "type": "standard",
        "state": "error"
      },
      "f9c1": {
        "type": "standard",
        "state": "success"
      }
    },
    "f9c1": {
      "workflow_end": {
        "type": "standard",
        "state": "success"
      }
    },
    "f3e4": {
      "a161": {
        "type": "standard",
        "state": "success"
      }
    },
    "a161": {
      "57f8": {
        "type": "standard",
        "state": "success"
      }
    },
    "c6d7": {
      "2890": {
        "type": "standard",
        "state": "success"
      }
    },
    "b99e": {
      "2995": {
        "type": "standard",
        "state": "success"
      }
    },
    "a33f": {
      "2995": {
        "type": "revert",
        "state": "success"
      }
    },
    "b51": {
      "8f4d": {
        "type": "revert",
        "state": "success"
      },
      "workflow_end": {
        "type": "standard",
        "state": "failure"
      }
    },
    "ea3c": {
      "753f": {
        "type": "standard",
        "state": "success"
      }
    },
    "7f02": {
      "edbd": {
        "type": "standard",
        "state": "success"
      }
    }
  },
  "font_size": 12,
  "created": "2020-09-18T17:56:01.699Z",
  "created_by": {
    "provenance": "Itential AAA LDAP",
    "username": "prit.shah",
    "firstname": "Prit",
    "inactive": true
  },
  "createdVersion": "5.10.4-2020.1.22.0",
  "last_updated": "2021-07-19T21:36:17.534Z",
  "last_updated_by": {
    "provenance": "local_aaa",
    "username": "admin@pronghorn",
    "firstname": "admin",
    "inactive": false,
    "email": ""
  },
  "lastUpdatedVersion": "5.40.5-2021.1.8.0",
  "type": "automation",
  "description": null,
  "inputSchema": {
    "type": "object",
    "properties": {
      "repoName": {
        "$id": "artifactFullName",
        "type": "string",
        "examples": [
          "New Artifact"
        ]
      },
      "_id": {
        "title": "job_id",
        "type": "string",
        "examples": [
          "test"
        ]
      },
      "artifact": {
        "type": "object",
        "examples": [
          {
            "name": "value"
          }
        ]
      },
      "mrBranchName": {
        "$id": "branch",
        "type": "string"
      },
      "targetBranch": {
        "$id": "targetBranch",
        "type": "string",
        "examples": [
          "fdsf"
        ]
      },
      "artifactCreateAndUpdate": {
        "type": "object",
        "examples": [
          {
            "name": "value"
          }
        ]
      },
      "commitMessage": {
        "type": [
          "array",
          "boolean",
          "null",
          "number",
          "object",
          "string"
        ]
      },
      "username": {
        "title": "stringN",
        "type": [
          "array",
          "string",
          "boolean",
          "number"
        ],
        "items": {
          "type": "string"
        },
        "examples": [
          [
            " World"
          ]
        ]
      },
      "adapter_id": {
        "type": [
          "array",
          "boolean",
          "null",
          "number",
          "object",
          "string"
        ]
      },
      "url": {
        "title": "id",
        "type": "string"
      },
      "packageJsonName": {
        "$id": "packageJsonName",
        "type": "string",
        "examples": [
          "sdfsa"
        ]
      }
    },
    "required": [
      "repoName",
      "_id",
      "artifact",
      "mrBranchName",
      "targetBranch",
      "artifactCreateAndUpdate",
      "commitMessage",
      "username",
      "adapter_id",
      "url",
      "packageJsonName"
    ]
  },
  "outputSchema": {
    "type": "object",
    "properties": {
      "repoName": {
        "$id": "artifactFullName",
        "type": "string",
        "examples": [
          "New Artifact"
        ]
      },
      "_id": {
        "type": "string",
        "pattern": "^[0-9a-f]{24}$"
      },
      "artifact": {
        "type": "object",
        "examples": [
          {
            "name": "value"
          }
        ]
      },
      "mrBranchName": {
        "$id": "branch",
        "type": "string"
      },
      "targetBranch": {
        "$id": "targetBranch",
        "type": "string",
        "examples": [
          "fdsf"
        ]
      },
      "artifactCreateAndUpdate": {
        "type": "object",
        "examples": [
          {
            "name": "value"
          }
        ]
      },
      "commitMessage": {
        "type": [
          "array",
          "boolean",
          "null",
          "number",
          "object",
          "string"
        ]
      },
      "username": {
        "title": "stringN",
        "type": [
          "array",
          "string",
          "boolean",
          "number"
        ],
        "items": {
          "type": "string"
        },
        "examples": [
          [
            " World"
          ]
        ]
      },
      "adapter_id": {
        "type": [
          "array",
          "boolean",
          "null",
          "number",
          "object",
          "string"
        ]
      },
      "url": {
        "title": "id",
        "type": "string"
      },
      "packageJsonName": {
        "$id": "packageJsonName",
        "type": "string",
        "examples": [
          "sdfsa"
        ]
      },
      "initiator": {
        "type": "string"
      },
      "postRepoURI": {
        "type": "string"
      },
      "error": {
        "type": [
          "array",
          "boolean",
          "null",
          "number",
          "object",
          "string"
        ]
      },
      "createError": {
        "type": [
          "array",
          "boolean",
          "null",
          "number",
          "object",
          "string"
        ]
      }
    }
  },
  "tags": [],
  "groups": []
}
