{
  "id": "61b221b08f647a0176ff7a6a",
  "created": "2021-12-09T15:33:04.600Z",
  "createdBy": "clarisa.colton@itential.com",
  "lastUpdated": "2022-01-13T19:15:52.675Z",
  "lastUpdatedBy": "clarisa.colton@itential.com",
  "name": "Push Bundles to Gitlab",
  "description": null,
  "struct": {
    "nodeId": "9251ce6e-db72-4080-b3f1-86b340ba1add",
    "type": "array",
    "items": [
      {
        "nodeId": "505987cd-d6fc-4302-a2d0-0b6d68eec044",
        "type": "object",
        "description": "",
        "items": [
          {
            "nodeId": "caf191bb-2851-44b0-92f1-9aa83413566c",
            "type": "string",
            "title": "GitLab Project Name",
            "description": "Project name for the GitHub repository.",
            "placeholder": "Enter text",
            "required": true
          },
          {
            "nodeId": "e26ab28d-a71a-4d5c-819c-ab5263f38716",
            "type": "string",
            "title": "GitLab Link",
            "description": "",
            "placeholder": "Enter text",
            "required": true,
            "readOnly": false,
            "binding": false,
            "rel": "item",
            "targetPointer": "/default"
          },
          {
            "nodeId": "bfa9397b-40f3-48e2-83a7-c08d7c942b4b",
            "type": "string",
            "title": "Access Token",
            "description": "",
            "placeholder": "Enter text",
            "required": true,
            "readOnly": false,
            "binding": false,
            "rel": "item",
            "targetPointer": "/default"
          },
          {
            "nodeId": "fd106739-664a-4d51-a48b-74598d17c545",
            "type": "boolean",
            "title": "Re-Discover Artifact",
            "description": "Please check this box in case you've added or removed any IAP component (child workflow/form/template/etc.)",
            "default": false,
            "enum": [
              {
                "id": "bec790e9-1ce4-497a-a3c9-9bcbb6d44e75",
                "value": true
              },
              {
                "id": "5e3ec6ca-675e-4393-a5a7-d2d65bf355ab",
                "value": false
              }
            ]
          },
          {
            "nodeId": "ca5a34e8-8989-403a-800d-b17f713a49b5",
            "type": "string",
            "title": "Artifact",
            "description": "Desired artifact to upload to GitHub",
            "placeholder": "Select an Artifact",
            "required": true,
            "enum": [],
            "binding": true,
            "rel": "collection",
            "targetPointer": "/enum",
            "base": "/",
            "href": "prebuilts/?skip=0&limit=250&order=1&sort=name",
            "method": "GET",
            "sourcePointer": "/results",
            "sourceKeyPointer": "/name",
            "labelKeyPointer": "",
            "transformation": ""
          },
          {
            "nodeId": "76f14d91-05ba-41a2-aa14-c6bfbb07e7a3",
            "type": "object",
            "description": "",
            "items": [
              {
                "nodeId": "293a11d4-b9fd-4bb1-82e3-021bec9c9743",
                "type": "string",
                "title": "MR Type",
                "description": "Type of pull request (patch/minor/major)",
                "placeholder": "Enter text",
                "required": true,
                "enum": [
                  {
                    "id": "3f87d31f-6465-4701-b0d3-7aa3b2e32f30",
                    "value": "patch"
                  },
                  {
                    "id": "74ea8535-8cdd-44fe-bfae-8b28717e86f1",
                    "value": "minor"
                  },
                  {
                    "id": "572e2ebe-8b19-43c3-9c55-8cf1fc723347",
                    "value": "major"
                  }
                ],
                "binding": false,
                "rel": "collection",
                "targetPointer": "/enum"
              },
              {
                "nodeId": "36d63b0b-bb1a-4f31-87ee-5e23bac03ae1",
                "type": "string",
                "title": "Commit Message",
                "description": "The message to put in with the commit",
                "placeholder": "Enter text",
                "required": true
              },
              {
                "nodeId": "cb55002f-3061-4bf0-a8f2-eaac5ebf8adb",
                "type": "string",
                "title": "Target Branch",
                "description": "The branch desired for merging into the pull request",
                "placeholder": "Enter text",
                "required": true
              }
            ],
            "title": "For Existing GitLab Projects"
          }
        ],
        "title": "Check In Artifact"
      }
    ]
  },
  "schema": {
    "title": "Push Bundles to Gitlab",
    "description": "",
    "type": "object",
    "required": [],
    "properties": {
      "checkInArtifact": {
        "type": "object",
        "title": "Check In Artifact",
        "description": "",
        "required": [
          "gitLabProjectName",
          "gitLabLink",
          "accessToken",
          "artifact"
        ],
        "properties": {
          "gitLabProjectName": {
            "type": "string",
            "title": "GitLab Project Name",
            "_id": "/properties/checkInArtifact/properties/gitLabProjectName",
            "description": "Project name for the GitHub repository."
          },
          "gitLabLink": {
            "type": "string",
            "title": "GitLab Link",
            "_id": "/properties/checkInArtifact/properties/gitLabLink",
            "description": ""
          },
          "accessToken": {
            "type": "string",
            "title": "Access Token",
            "_id": "/properties/checkInArtifact/properties/accessToken",
            "description": ""
          },
          "reDiscoverArtifact": {
            "type": "boolean",
            "title": "Re-Discover Artifact",
            "_id": "/properties/checkInArtifact/properties/reDiscoverArtifact",
            "description": "Please check this box in case you've added or removed any IAP component (child workflow/form/template/etc.)",
            "default": false,
            "enum": [
              true,
              false
            ]
          },
          "artifact": {
            "type": "string",
            "title": "Artifact",
            "_id": "/properties/checkInArtifact/properties/artifact",
            "description": "Desired artifact to upload to GitHub",
            "enum": []
          },
          "forExistingGitLabProjects": {
            "type": "object",
            "title": "For Existing GitLab Projects",
            "description": "",
            "required": [
              "mrType",
              "commitMessage",
              "targetBranch"
            ],
            "properties": {
              "mrType": {
                "type": "string",
                "title": "MR Type",
                "_id": "/properties/checkInArtifact/properties/forExistingGitLabProjects/properties/mrType",
                "description": "Type of pull request (patch/minor/major)",
                "enum": [
                  "patch",
                  "minor",
                  "major"
                ]
              },
              "commitMessage": {
                "type": "string",
                "title": "Commit Message",
                "_id": "/properties/checkInArtifact/properties/forExistingGitLabProjects/properties/commitMessage",
                "description": "The message to put in with the commit"
              },
              "targetBranch": {
                "type": "string",
                "title": "Target Branch",
                "_id": "/properties/checkInArtifact/properties/forExistingGitLabProjects/properties/targetBranch",
                "description": "The branch desired for merging into the pull request"
              }
            }
          }
        }
      }
    }
  },
  "uiSchema": {
    "checkInArtifact": {
      "ui:collapseByDefault": false,
      "items": {
        "gitLabProjectName": {
          "ui:placeholder": "Enter text"
        },
        "gitLabLink": {
          "ui:placeholder": "Enter text"
        },
        "accessToken": {
          "ui:placeholder": "Enter text"
        },
        "artifact": {
          "ui:placeholder": "Select an Artifact"
        },
        "forExistingGitLabProjects": {
          "ui:collapseByDefault": false,
          "items": {
            "mrType": {
              "ui:placeholder": "Enter text"
            },
            "commitMessage": {
              "ui:placeholder": "Enter text"
            },
            "targetBranch": {
              "ui:placeholder": "Enter text"
            }
          }
        }
      }
    }
  },
  "bindingSchema": {
    "properties": {
      "checkInArtifact": {
        "properties": {
          "artifact": {
            "binding:method": "GET",
            "binding:link": {
              "$ref": "/links",
              "rel": "collection"
            },
            "binding:target": {
              "propertyPointer": "/enum"
            },
            "binding:hyperSchema": {
              "type": "object",
              "base": "/",
              "links": [
                {
                  "rel": "collection",
                  "href": "prebuilts/?skip=0&limit=250&order=1&sort=name",
                  "targetMediaType": "application/json",
                  "targetSchema": {
                    "$ref": "#"
                  },
                  "variables": []
                }
              ]
            },
            "binding:source": {
              "propertyPointer": "/results",
              "keyPointer": "/name"
            }
          },
          "forExistingGitLabProjects": {
            "properties": {}
          }
        }
      }
    }
  },
  "validationSchema": {
    "checkInArtifact": {
      "forExistingGitLabProjects": {}
    }
  },
  "version": "2020.1"
}