{
  "name": "Push Bundles to Gitlab Create Link",
  "tasks": {
    "274": {
      "name": "transformation",
      "canvasName": "transformation",
      "summary": "JSON Transformation",
      "description": "Perform a JSON Transformation using the JST library.",
      "location": "Application",
      "locationType": null,
      "app": "WorkFlowEngine",
      "type": "operation",
      "displayName": "WorkFlowEngine",
      "variables": {
        "incoming": {
          "tr_id": "5f805da7ae462065b2fd0973",
          "variableMap": {
            "commit_message": "Clean Repo [skip ci]",
            "branch": "$var.job.mrBranchName",
            "filteredBody": "$var.e0ff.filteredBody"
          },
          "options": {
            "extractOutput": true
          }
        },
        "outgoing": {
          "commitDeleteBody": null
        }
      },
      "deprecated": false,
      "matched": [
        {
          "key": "description",
          "highlightString": "Perform a JSON Transformation using the <span class='highlight-string'>JST</span> library."
        }
      ],
      "groups": [],
      "x": 3.6252086811352253,
      "y": 0.7646062658763759
    },
    "592": {
      "name": "query",
      "canvasName": "query",
      "summary": "Query update commit data",
      "description": "Query update commit data",
      "location": "Application",
      "locationType": null,
      "app": "WorkFlowEngine",
      "type": "operation",
      "displayName": "WorkFlowEngine",
      "variables": {
        "incoming": {
          "pass_on_null": false,
          "query": "commitActions",
          "obj": "$var.edbd.job_details"
        },
        "outgoing": {
          "return_data": null
        },
        "error": ""
      },
      "deprecated": false,
      "matched": [
        {
          "key": "canvasName",
          "highlightString": "<span class='highlight-string'>query</span>"
        },
        {
          "key": "summary",
          "highlightString": "<span class='highlight-string'>Query</span> Data Using 'json-query' Format"
        },
        {
          "key": "description",
          "highlightString": "<span class='highlight-string'>Query</span> data using a dot/bracket notation string and a matching key/value pair."
        }
      ],
      "groups": [],
      "x": 2.666110183639399,
      "y": 0.768839966130398,
      "scheduled": false
    },
    "619": {
      "name": "query",
      "canvasName": "query",
      "summary": "Query projects in group",
      "description": "Query projects in group",
      "location": "Application",
      "locationType": null,
      "app": "WorkFlowEngine",
      "type": "operation",
      "displayName": "WorkFlowEngine",
      "variables": {
        "incoming": {
          "pass_on_null": false,
          "query": "body.projects",
          "obj": "$var.4d8d.response"
        },
        "outgoing": {
          "return_data": null
        },
        "error": ""
      },
      "deprecated": false,
      "matched": [
        {
          "key": "canvasName",
          "highlightString": "<span class='highlight-string'>query</span>"
        },
        {
          "key": "summary",
          "highlightString": "<span class='highlight-string'>Query</span> Data Using 'json-query' Format"
        },
        {
          "key": "description",
          "highlightString": "<span class='highlight-string'>Query</span> data using a dot/bracket notation string and a matching key/value pair."
        }
      ],
      "groups": [],
      "x": 1.1487826871055,
      "y": 0.772211720226843,
      "scheduled": false
    },
    "1751": {
      "name": "transformation",
      "canvasName": "transformation",
      "summary": "JSON Transformation",
      "description": "Perform a JSON Transformation using the JST library.",
      "location": "Application",
      "locationType": null,
      "app": "WorkFlowEngine",
      "type": "operation",
      "displayName": "WorkFlowEngine",
      "variables": {
        "incoming": {
          "tr_id": "5f6906d6e9306554f0267171",
          "variableMap": {
            "artifactFullName": "$var.job.repoName"
          },
          "options": {
            "extractOutput": true
          }
        },
        "outgoing": {
          "artifactName": null
        }
      },
      "deprecated": false,
      "matched": [
        {
          "key": "description",
          "highlightString": "Perform a JSON Transformation using the <span class='highlight-string'>JST</span> library."
        }
      ],
      "groups": [],
      "x": 0.608661417322835,
      "y": 0.489964580873672
    },
    "2890": {
      "name": "query",
      "canvasName": "query",
      "summary": "Query Data Using 'json-query' Format",
      "description": "Query data using a dot/bracket notation string and a matching key/value pair.",
      "location": "Application",
      "locationType": null,
      "app": "WorkFlowEngine",
      "type": "operation",
      "displayName": "WorkFlowEngine",
      "variables": {
        "incoming": {
          "pass_on_null": false,
          "query": "body",
          "obj": "$var.b09d.response"
        },
        "outgoing": {
          "return_data": null
        },
        "error": ""
      },
      "deprecated": false,
      "matched": [
        {
          "key": "canvasName",
          "highlightString": "<span class='highlight-string'>query</span>"
        },
        {
          "key": "summary",
          "highlightString": "<span class='highlight-string'>Query</span> Data Using 'json-query' Format"
        },
        {
          "key": "description",
          "highlightString": "<span class='highlight-string'>Query</span> data using a dot/bracket notation string and a matching key/value pair."
        }
      ],
      "groups": [],
      "x": 3.3831385642737897,
      "y": 0.77307366638442,
      "scheduled": false
    },
    "5168": {
      "name": "query",
      "canvasName": "query",
      "summary": "Query repo id",
      "description": "Query repo id",
      "location": "Application",
      "locationType": null,
      "app": "WorkFlowEngine",
      "type": "operation",
      "displayName": "WorkFlowEngine",
      "variables": {
        "incoming": {
          "pass_on_null": false,
          "query": "body.id",
          "obj": "$var.3a3b.response"
        },
        "outgoing": {
          "return_data": null
        },
        "error": ""
      },
      "deprecated": false,
      "matched": [
        {
          "key": "canvasName",
          "highlightString": "<span class='highlight-string'>query</span>"
        },
        {
          "key": "summary",
          "highlightString": "<span class='highlight-string'>Query</span> Data Using 'json-query' Format"
        },
        {
          "key": "description",
          "highlightString": "<span class='highlight-string'>Query</span> data using a dot/bracket notation string and a matching key/value pair."
        }
      ],
      "groups": [],
      "x": 1.17493237150586,
      "y": 0.583175803402647,
      "scheduled": false
    },
    "7100": {
      "name": "ViewData",
      "canvasName": "ViewData",
      "summary": "View Data",
      "description": "View data in a pretty format",
      "location": "Application",
      "app": "WorkFlowEngine",
      "displayName": "Tools",
      "type": "manual",
      "variables": {
        "incoming": {
          "header": "Failed",
          "message": "failed to create merge request",
          "body": "",
          "variables": {},
          "btn_success": "okay",
          "btn_failure": "cancel"
        },
        "outgoing": {},
        "error": ""
      },
      "view": "/workflow_engine/task/ViewData",
      "deprecated": false,
      "matched": [
        {
          "key": "canvasName",
          "highlightString": "<span class='highlight-string'>View</span><span class='highlight-string'>Data</span>"
        },
        {
          "key": "summary",
          "highlightString": "<span class='highlight-string'>View</span> <span class='highlight-string'>Data</span>"
        },
        {
          "key": "description",
          "highlightString": "<span class='highlight-string'>View</span> <span class='highlight-string'>data</span> in a pretty format"
        }
      ],
      "groups": [],
      "x": 5.28881469115192,
      "y": 0.4707874682472481,
      "scheduled": false
    },
    "workflow_start": {
      "name": "workflow_start",
      "groups": [],
      "x": 0.111023622047244,
      "y": 0.466351829988194
    },
    "workflow_end": {
      "name": "workflow_end",
      "groups": [],
      "x": 4.907345575959933,
      "y": 0.4792548687552921
    },
    "4d8d": {
      "name": "restCall",
      "canvasName": "restCall",
      "summary": "Get Git Subgroup",
      "description": "Get Git Subgroup",
      "location": "Application",
      "locationType": null,
      "app": "WorkFlowEngine",
      "type": "automatic",
      "displayName": "Tools",
      "variables": {
        "incoming": {
          "uri": "$var.job.uri",
          "verb": "GET",
          "user": "",
          "password": "",
          "headers": "$var.726d.object",
          "body": "",
          "responseHeaders": true
        },
        "outgoing": {
          "response": null
        },
        "error": ""
      },
      "deprecated": false,
      "matched": [
        {
          "key": "canvasName",
          "highlightString": "<span class='highlight-string'>restCall</span>"
        }
      ],
      "groups": [],
      "actor": "Pronghorn",
      "x": 0.405511811023622,
      "y": 0.48642266824085,
      "scheduled": false
    },
    "726d": {
      "name": "setObjectKey",
      "canvasName": "setObjectKey",
      "summary": "Build Header",
      "description": "Build Header",
      "location": "Application",
      "locationType": null,
      "app": "WorkFlowEngine",
      "type": "automatic",
      "displayName": "Object",
      "variables": {
        "incoming": {
          "obj": {},
          "path": [
            "PRIVATE-TOKEN"
          ],
          "value": "$var.job.token"
        },
        "outgoing": {
          "object": null
        },
        "error": ""
      },
      "deprecated": false,
      "matched": [
        {
          "key": "displayName",
          "highlightString": "<span class='highlight-string'>Object</span>"
        },
        {
          "key": "canvasName",
          "highlightString": "set<span class='highlight-string'>Object</span>Key"
        },
        {
          "key": "summary",
          "highlightString": "Set <span class='highlight-string'>Object</span> Key"
        },
        {
          "key": "description",
          "highlightString": "Set an <span class='highlight-string'>object</span> key"
        }
      ],
      "groups": [],
      "actor": "Pronghorn",
      "x": 0.259842519685039,
      "y": 0.485242030696576,
      "scheduled": false
    },
    "8f53": {
      "name": "query",
      "canvasName": "query",
      "summary": "Get Subgroup ID",
      "description": "Get Subgroup ID",
      "location": "Application",
      "locationType": null,
      "app": "WorkFlowEngine",
      "type": "operation",
      "displayName": "WorkFlowEngine",
      "variables": {
        "incoming": {
          "pass_on_null": false,
          "query": "body.id",
          "obj": "$var.4d8d.response"
        },
        "outgoing": {
          "return_data": null
        },
        "error": ""
      },
      "deprecated": false,
      "matched": [
        {
          "key": "canvasName",
          "highlightString": "<span class='highlight-string'>query</span>"
        },
        {
          "key": "summary",
          "highlightString": "<span class='highlight-string'>Query</span> Data Using 'json-query' Format"
        },
        {
          "key": "description",
          "highlightString": "<span class='highlight-string'>Query</span> data using a dot/bracket notation string and a matching key/value pair."
        }
      ],
      "groups": [],
      "x": 0.521259842519685,
      "y": 0.488783943329398,
      "scheduled": false
    },
    "fa4d": {
      "name": "merge",
      "canvasName": "merge",
      "summary": "Merge Data",
      "description": "Merge data into a single object",
      "location": "Application",
      "locationType": null,
      "app": "WorkFlowEngine",
      "type": "operation",
      "displayName": "WorkFlowEngine",
      "variables": {
        "incoming": {
          "data_to_merge": [
            {
              "key": "name",
              "value": {
                "task": "job",
                "variable": "repoName",
                "editable": true
              }
            },
            {
              "key": "path",
              "value": {
                "task": "1751",
                "variable": "artifactName",
                "editable": true
              }
            },
            {
              "key": "namespace_id",
              "value": {
                "task": "8f53",
                "variable": "return_data"
              }
            }
          ]
        },
        "outgoing": {
          "merged_object": null
        }
      },
      "deprecated": false,
      "matched": [
        {
          "key": "canvasName",
          "highlightString": "<span class='highlight-string'>merge</span>"
        },
        {
          "key": "summary",
          "highlightString": "<span class='highlight-string'>Merge</span> Data"
        },
        {
          "key": "description",
          "highlightString": "<span class='highlight-string'>Merge</span> data into a single object"
        }
      ],
      "groups": [],
      "x": 0.699212598425197,
      "y": 0.487603305785124
    },
    "3a3b": {
      "name": "restCall",
      "canvasName": "restCall",
      "summary": "REST Call",
      "description": "Execute a REST call",
      "location": "Application",
      "locationType": null,
      "app": "WorkFlowEngine",
      "type": "automatic",
      "displayName": "Tools",
      "variables": {
        "incoming": {
          "uri": "$var.job.postRepoURI",
          "verb": "POST",
          "user": "",
          "password": "",
          "headers": "$var.726d.object",
          "body": "$var.fa4d.merged_object",
          "responseHeaders": true
        },
        "outgoing": {
          "response": null
        },
        "error": "$var.job.createRepoError"
      },
      "deprecated": false,
      "matched": [
        {
          "key": "canvasName",
          "highlightString": "<span class='highlight-string'>restCall</span>"
        }
      ],
      "groups": [],
      "actor": "Pronghorn",
      "x": 1.03858267716535,
      "y": 0.475796930342385,
      "scheduled": false
    },
    "29b": {
      "name": "newVariable",
      "canvasName": "newVariable",
      "summary": "Create a Job Variable",
      "description": "Create a new Job variable by Job ID and assign it a value.",
      "location": "Application",
      "locationType": null,
      "app": "WorkFlowEngine",
      "type": "operation",
      "displayName": "WorkFlowEngine",
      "variables": {
        "incoming": {
          "name": "postRepoURI",
          "value": "https://gitlab.com/api/v4/projects"
        },
        "outgoing": {
          "value": null
        }
      },
      "deprecated": false,
      "matched": [
        {
          "key": "canvasName",
          "highlightString": "<span class='highlight-string'>new</span>Variable"
        },
        {
          "key": "description",
          "highlightString": "Create a <span class='highlight-string'>new</span> Job variable by Job ID and assign it a value."
        }
      ],
      "groups": [],
      "x": 0.866141732283465,
      "y": 0.480519480519481
    },
    "190d": {
      "name": "query",
      "canvasName": "query",
      "summary": "Query homepage",
      "description": "Query homepage",
      "location": "Application",
      "locationType": null,
      "app": "WorkFlowEngine",
      "type": "operation",
      "displayName": "WorkFlowEngine",
      "variables": {
        "incoming": {
          "pass_on_null": false,
          "query": "body.web_url",
          "obj": "$var.3a3b.response"
        },
        "outgoing": {
          "return_data": null
        },
        "error": ""
      },
      "deprecated": false,
      "matched": [
        {
          "key": "canvasName",
          "highlightString": "<span class='highlight-string'>query</span>"
        },
        {
          "key": "summary",
          "highlightString": "<span class='highlight-string'>Query</span> Data Using 'json-query' Format"
        },
        {
          "key": "description",
          "highlightString": "<span class='highlight-string'>Query</span> data using a dot/bracket notation string and a matching key/value pair."
        }
      ],
      "groups": [],
      "x": 1.17007874015748,
      "y": 0.48642266824085,
      "scheduled": false
    },
    "cfa6": {
      "name": "query",
      "canvasName": "query",
      "summary": "Query ssh url",
      "description": "Query ssh url",
      "location": "Application",
      "locationType": null,
      "app": "WorkFlowEngine",
      "type": "operation",
      "displayName": "WorkFlowEngine",
      "variables": {
        "incoming": {
          "pass_on_null": false,
          "query": "body.ssh_url_to_repo",
          "obj": "$var.3a3b.response"
        },
        "outgoing": {
          "return_data": null
        },
        "error": ""
      },
      "deprecated": false,
      "matched": [
        {
          "key": "canvasName",
          "highlightString": "<span class='highlight-string'>query</span>"
        },
        {
          "key": "summary",
          "highlightString": "<span class='highlight-string'>Query</span> Data Using 'json-query' Format"
        },
        {
          "key": "description",
          "highlightString": "<span class='highlight-string'>Query</span> data using a dot/bracket notation string and a matching key/value pair."
        }
      ],
      "groups": [],
      "x": 1.17222723174031,
      "y": 0.395085066162571,
      "scheduled": false
    },
    "5a9c": {
      "name": "merge",
      "canvasName": "merge",
      "summary": "Merge Data",
      "description": "Merge data into a single object",
      "location": "Application",
      "locationType": null,
      "app": "WorkFlowEngine",
      "type": "operation",
      "displayName": "WorkFlowEngine",
      "variables": {
        "incoming": {
          "data_to_merge": [
            {
              "key": "git",
              "value": {
                "task": "cfa6",
                "variable": "return_data"
              }
            },
            {
              "key": "homepage",
              "value": {
                "task": "190d",
                "variable": "return_data"
              }
            }
          ]
        },
        "outgoing": {
          "merged_object": null
        }
      },
      "deprecated": false,
      "matched": [
        {
          "key": "canvasName",
          "highlightString": "<span class='highlight-string'>merge</span>"
        },
        {
          "key": "summary",
          "highlightString": "<span class='highlight-string'>Merge</span> Data"
        },
        {
          "key": "description",
          "highlightString": "<span class='highlight-string'>Merge</span> data into a single object"
        }
      ],
      "groups": [],
      "x": 1.29035166816952,
      "y": 0.487712665406427
    },
    "5a7e": {
      "name": "query",
      "canvasName": "query",
      "summary": "Query create",
      "description": "Query create",
      "location": "Application",
      "locationType": null,
      "app": "WorkFlowEngine",
      "type": "operation",
      "displayName": "WorkFlowEngine",
      "variables": {
        "incoming": {
          "pass_on_null": false,
          "query": "create",
          "obj": "$var.job.artifact"
        },
        "outgoing": {
          "return_data": null
        },
        "error": ""
      },
      "deprecated": false,
      "matched": [
        {
          "key": "canvasName",
          "highlightString": "<span class='highlight-string'>query</span>"
        },
        {
          "key": "summary",
          "highlightString": "<span class='highlight-string'>Query</span> Data Using 'json-query' Format"
        },
        {
          "key": "description",
          "highlightString": "<span class='highlight-string'>Query</span> data using a dot/bracket notation string and a matching key/value pair."
        }
      ],
      "groups": [],
      "x": 1.39765554553652,
      "y": 0.484877126654064,
      "scheduled": false
    },
    "753f": {
      "name": "childJob",
      "canvasName": "childJob",
      "summary": "Create Commit Data",
      "description": "Run a child job inside a workflow.",
      "location": "Application",
      "locationType": null,
      "app": "WorkFlowEngine",
      "type": "operation",
      "displayName": "WorkFlowEngine",
      "variables": {
        "incoming": {
          "task": "",
          "workflow": "Push Bundles to Gitlab Commit Data",
          "variables": {
            "artifact": {
              "variable": "",
              "task": "e48d",
              "value": "fixedArray"
            },
            "action": {
              "variable": "",
              "task": "static",
              "value": "create"
            }
          },
          "data_array": "",
          "transformation": "",
          "loopType": ""
        },
        "outgoing": {
          "job_details": null
        }
      },
      "deprecated": false,
      "matched": [
        {
          "key": "canvasName",
          "highlightString": "<span class='highlight-string'>child</span><span class='highlight-string'>Job</span>"
        },
        {
          "key": "summary",
          "highlightString": "Run <span class='highlight-string'>Child</span> <span class='highlight-string'>Job</span>"
        },
        {
          "key": "description",
          "highlightString": "Run a <span class='highlight-string'>child</span> <span class='highlight-string'>job</span> inside a workflow."
        }
      ],
      "groups": [],
      "actor": "job",
      "x": 1.70423805229937,
      "y": 0.47069943289225
    },
    "871d": {
      "name": "query",
      "canvasName": "query",
      "summary": "Query create commit data",
      "description": "Query create commit data",
      "location": "Application",
      "locationType": null,
      "app": "WorkFlowEngine",
      "type": "operation",
      "displayName": "WorkFlowEngine",
      "variables": {
        "incoming": {
          "pass_on_null": false,
          "query": "commitActions",
          "obj": "$var.753f.job_details"
        },
        "outgoing": {
          "return_data": null
        },
        "error": ""
      },
      "deprecated": false,
      "matched": [
        {
          "key": "canvasName",
          "highlightString": "<span class='highlight-string'>query</span>"
        },
        {
          "key": "summary",
          "highlightString": "<span class='highlight-string'>Query</span> Data Using 'json-query' Format"
        },
        {
          "key": "description",
          "highlightString": "<span class='highlight-string'>Query</span> data using a dot/bracket notation string and a matching key/value pair."
        }
      ],
      "groups": [],
      "x": 1.88277727682597,
      "y": 0.464083175803403,
      "scheduled": false
    },
    "14f0": {
      "name": "merge",
      "canvasName": "merge",
      "summary": "Merge Data",
      "description": "Merge data into a single object",
      "location": "Application",
      "locationType": null,
      "app": "WorkFlowEngine",
      "type": "operation",
      "displayName": "WorkFlowEngine",
      "variables": {
        "incoming": {
          "data_to_merge": [
            {
              "key": "branch",
              "value": {
                "task": "static",
                "variable": "master"
              }
            },
            {
              "key": "commit_message",
              "value": {
                "task": "static",
                "variable": "initial commit"
              }
            },
            {
              "key": "actions",
              "value": {
                "task": "871d",
                "variable": "return_data"
              }
            }
          ]
        },
        "outgoing": {
          "merged_object": null
        }
      },
      "deprecated": false,
      "matched": [
        {
          "key": "canvasName",
          "highlightString": "<span class='highlight-string'>merge</span>"
        },
        {
          "key": "summary",
          "highlightString": "<span class='highlight-string'>Merge</span> Data"
        },
        {
          "key": "description",
          "highlightString": "<span class='highlight-string'>Merge</span> data into a single object"
        }
      ],
      "groups": [],
      "x": 2.03697024346258,
      "y": 0.468809073724008
    },
    "d299": {
      "name": "restCall",
      "canvasName": "restCall",
      "summary": "POST Create Commit",
      "description": "Execute a REST call",
      "location": "Application",
      "locationType": null,
      "app": "WorkFlowEngine",
      "type": "automatic",
      "displayName": "Tools",
      "variables": {
        "incoming": {
          "uri": "$var.542c.gitlabCommitURI",
          "verb": "POST",
          "user": "",
          "password": "",
          "headers": "$var.726d.object",
          "body": "$var.14f0.merged_object",
          "responseHeaders": true
        },
        "outgoing": {
          "response": null
        },
        "error": ""
      },
      "deprecated": false,
      "matched": [
        {
          "key": "canvasName",
          "highlightString": "<span class='highlight-string'>rest</span><span class='highlight-string'>Call</span>"
        },
        {
          "key": "summary",
          "highlightString": "<span class='highlight-string'>REST</span> <span class='highlight-string'>Call</span>"
        },
        {
          "key": "description",
          "highlightString": "Execute a <span class='highlight-string'>REST</span> <span class='highlight-string'>call</span>"
        }
      ],
      "groups": [],
      "actor": "Pronghorn",
      "x": 2.4165915238954,
      "y": 0.477315689981096,
      "scheduled": false
    },
    "3b3e": {
      "name": "ViewData",
      "canvasName": "ViewData",
      "summary": "View Data",
      "description": "View data in a pretty format",
      "location": "Application",
      "app": "WorkFlowEngine",
      "displayName": "Tools",
      "type": "manual",
      "variables": {
        "incoming": {
          "header": "Error",
          "message": "",
          "body": "Error making commit to repository on GitLab. Try again?",
          "variables": {},
          "btn_success": "Retry",
          "btn_failure": ""
        },
        "outgoing": {},
        "error": ""
      },
      "view": "/workflow_engine/task/ViewData",
      "deprecated": false,
      "matched": [
        {
          "key": "canvasName",
          "highlightString": "<span class='highlight-string'>View</span><span class='highlight-string'>Data</span>"
        },
        {
          "key": "summary",
          "highlightString": "<span class='highlight-string'>View</span> <span class='highlight-string'>Data</span>"
        },
        {
          "key": "description",
          "highlightString": "<span class='highlight-string'>View</span> <span class='highlight-string'>data</span> in a pretty format"
        }
      ],
      "groups": [],
      "x": 2.42560865644725,
      "y": 0.252362948960302,
      "scheduled": false
    },
    "542c": {
      "name": "transformation",
      "canvasName": "transformation",
      "summary": "JSON Transformation",
      "description": "Perform a JSON Transformation using the JST library.",
      "location": "Application",
      "locationType": null,
      "app": "WorkFlowEngine",
      "type": "operation",
      "displayName": "WorkFlowEngine",
      "variables": {
        "incoming": {
          "tr_id": "5f6b7b40b7a0a706e5b1058e",
          "variableMap": {
            "repoId": "$var.5168.return_data"
          },
          "options": {
            "extractOutput": true
          }
        },
        "outgoing": {
          "gitlabCommitURI": null
        }
      },
      "deprecated": false,
      "matched": [
        {
          "key": "description",
          "highlightString": "Perform a JSON Transformation using the <span class='highlight-string'>JST</span> library."
        }
      ],
      "groups": [],
      "x": 2.20378719567178,
      "y": 0.468809073724008
    },
    "e90f": {
      "name": "transformation",
      "canvasName": "transformation",
      "summary": "JSON Transformation",
      "description": "Perform a JSON Transformation using the JST library.",
      "location": "Application",
      "locationType": null,
      "app": "WorkFlowEngine",
      "type": "operation",
      "displayName": "WorkFlowEngine",
      "variables": {
        "incoming": {
          "tr_id": "5f6cb4a3b7a0a706e5b10592",
          "variableMap": {
            "errorMessage": "$var.job.createRepoError"
          },
          "options": {
            "extractOutput": false
          }
        },
        "outgoing": {
          "nameBool": null,
          "pathBool": null
        }
      },
      "deprecated": false,
      "matched": [
        {
          "key": "description",
          "highlightString": "Perform a JSON Transformation using the <span class='highlight-string'>JST</span> library."
        }
      ],
      "groups": [],
      "x": 1.03543307086614,
      "y": 0.649350649350649
    },
    "a848": {
      "name": "evaluation",
      "canvasName": "evaluation",
      "summary": "Repo name or path already taken?",
      "description": "Repo name or path already taken?",
      "location": "Application",
      "locationType": null,
      "app": "WorkFlowEngine",
      "type": "operation",
      "displayName": "WorkFlowEngine",
      "variables": {
        "incoming": {
          "all_true_flag": false,
          "evaluation_groups": [
            {
              "all_true_flag": false,
              "evaluations": [
                {
                  "query": "",
                  "operand_1": {
                    "variable": "pathBool",
                    "task": "e90f"
                  },
                  "operator": "==",
                  "operand_2": {
                    "variable": true,
                    "task": "static"
                  }
                },
                {
                  "query": "",
                  "operand_1": {
                    "variable": "nameBool",
                    "task": "e90f"
                  },
                  "operator": "==",
                  "operand_2": {
                    "variable": true,
                    "task": "static"
                  }
                }
              ]
            }
          ]
        },
        "outgoing": {
          "return_value": null
        }
      },
      "deprecated": false,
      "matched": [
        {
          "key": "canvasName",
          "highlightString": "<span class='highlight-string'>eval</span>uation"
        },
        {
          "key": "summary",
          "highlightString": "Run <span class='highlight-string'>Eval</span>uation Task"
        },
        {
          "key": "description",
          "highlightString": "Run an <span class='highlight-string'>eval</span>uation"
        }
      ],
      "groups": [],
      "x": 1.03779527559055,
      "y": 0.763872491145218
    },
    "38fc": {
      "name": "ViewData",
      "canvasName": "ViewData",
      "summary": "View Data",
      "description": "View data in a pretty format",
      "location": "Application",
      "app": "WorkFlowEngine",
      "displayName": "Tools",
      "type": "manual",
      "variables": {
        "incoming": {
          "header": "Failed",
          "message": "Failed to create repository",
          "body": "",
          "variables": {},
          "btn_success": "Retry",
          "btn_failure": ""
        },
        "outgoing": {},
        "error": ""
      },
      "view": "/workflow_engine/task/ViewData",
      "deprecated": false,
      "matched": [
        {
          "key": "canvasName",
          "highlightString": "<span class='highlight-string'>View</span><span class='highlight-string'>Data</span>"
        },
        {
          "key": "summary",
          "highlightString": "<span class='highlight-string'>View</span> <span class='highlight-string'>Data</span>"
        },
        {
          "key": "description",
          "highlightString": "<span class='highlight-string'>View</span> <span class='highlight-string'>data</span> in a pretty format"
        }
      ],
      "groups": [],
      "x": 0.959842519685039,
      "y": 0.913813459268005,
      "scheduled": false
    },
    "c46b": {
      "name": "merge",
      "canvasName": "merge",
      "summary": "Merge Data",
      "description": "Merge data into a single object",
      "location": "Application",
      "locationType": null,
      "app": "WorkFlowEngine",
      "type": "operation",
      "displayName": "WorkFlowEngine",
      "variables": {
        "incoming": {
          "data_to_merge": [
            {
              "key": "branch",
              "value": {
                "task": "job",
                "variable": "mrBranchName",
                "editable": true
              }
            },
            {
              "key": "ref",
              "value": {
                "task": "job",
                "variable": "targetBranch",
                "editable": true
              }
            }
          ]
        },
        "outgoing": {
          "merged_object": null
        }
      },
      "deprecated": false,
      "matched": [
        {
          "key": "canvasName",
          "highlightString": "<span class='highlight-string'>merge</span>"
        },
        {
          "key": "summary",
          "highlightString": "<span class='highlight-string'>Merge</span> Data"
        },
        {
          "key": "description",
          "highlightString": "<span class='highlight-string'>Merge</span> data into a single object"
        }
      ],
      "groups": [],
      "x": 1.3772954924874792,
      "y": 0.77307366638442
    },
    "9d6f": {
      "name": "restCall",
      "canvasName": "restCall",
      "summary": "Create branch for MR",
      "description": "Execute a REST call",
      "location": "Application",
      "locationType": null,
      "app": "WorkFlowEngine",
      "type": "automatic",
      "displayName": "Tools",
      "variables": {
        "incoming": {
          "uri": "$var.3c4a.repoURL",
          "verb": "POST",
          "user": "",
          "password": "",
          "headers": "$var.726d.object",
          "body": "$var.c46b.merged_object",
          "responseHeaders": true
        },
        "outgoing": {
          "response": null
        },
        "error": "$var.job.createRepoError"
      },
      "deprecated": false,
      "matched": [
        {
          "key": "canvasName",
          "highlightString": "<span class='highlight-string'>restCall</span>"
        }
      ],
      "groups": [],
      "actor": "Pronghorn",
      "x": 1.5459016393442624,
      "y": 0.7648305084745762,
      "scheduled": false
    },
    "af69": {
      "name": "query",
      "canvasName": "query",
      "summary": "Query update",
      "description": "Query update",
      "location": "Application",
      "locationType": null,
      "app": "WorkFlowEngine",
      "type": "operation",
      "displayName": "WorkFlowEngine",
      "variables": {
        "incoming": {
          "pass_on_null": false,
          "query": "update",
          "obj": "$var.job.artifactCreateAndUpdate"
        },
        "outgoing": {
          "return_data": null
        },
        "error": ""
      },
      "deprecated": false,
      "matched": [
        {
          "key": "canvasName",
          "highlightString": "<span class='highlight-string'>query</span>"
        },
        {
          "key": "summary",
          "highlightString": "<span class='highlight-string'>Query</span> Data Using 'json-query' Format"
        },
        {
          "key": "description",
          "highlightString": "<span class='highlight-string'>Query</span> data using a dot/bracket notation string and a matching key/value pair."
        }
      ],
      "groups": [],
      "x": 1.7120200333889817,
      "y": 0.7679932260795935,
      "scheduled": false
    },
    "edbd": {
      "name": "childJob",
      "canvasName": "childJob",
      "summary": "Create Commit Data",
      "description": "Run a child job inside a workflow.",
      "location": "Application",
      "locationType": null,
      "app": "WorkFlowEngine",
      "type": "operation",
      "displayName": "WorkFlowEngine",
      "variables": {
        "incoming": {
          "task": "",
          "workflow": "Push Bundles to Gitlab Commit Data",
          "variables": {
            "artifact": {
              "variable": "",
              "task": "d425",
              "value": "fixedArray"
            },
            "action": {
              "variable": "",
              "task": "static",
              "value": "update"
            }
          },
          "data_array": "",
          "transformation": "",
          "loopType": ""
        },
        "outgoing": {
          "job_details": null
        }
      },
      "deprecated": false,
      "matched": [
        {
          "key": "canvasName",
          "highlightString": "<span class='highlight-string'>child</span><span class='highlight-string'>Job</span>"
        },
        {
          "key": "summary",
          "highlightString": "Run <span class='highlight-string'>Child</span> <span class='highlight-string'>Job</span>"
        },
        {
          "key": "description",
          "highlightString": "Run a <span class='highlight-string'>child</span> <span class='highlight-string'>job</span> inside a workflow."
        }
      ],
      "groups": [],
      "actor": "job",
      "x": 2.471619365609349,
      "y": 0.7705334462320068
    },
    "25d8": {
      "name": "merge",
      "canvasName": "merge",
      "summary": "Merge Data",
      "description": "Merge data into a single object",
      "location": "Application",
      "locationType": null,
      "app": "WorkFlowEngine",
      "type": "operation",
      "displayName": "WorkFlowEngine",
      "variables": {
        "incoming": {
          "data_to_merge": [
            {
              "key": "branch",
              "value": {
                "task": "job",
                "variable": "mrBranchName",
                "editable": true
              }
            },
            {
              "key": "commit_message",
              "value": {
                "task": "job",
                "variable": "commitMessage",
                "editable": true
              }
            },
            {
              "key": "actions",
              "value": {
                "task": "592",
                "variable": "return_data"
              }
            }
          ]
        },
        "outgoing": {
          "merged_object": null
        }
      },
      "deprecated": false,
      "matched": [
        {
          "key": "canvasName",
          "highlightString": "<span class='highlight-string'>merge</span>"
        },
        {
          "key": "summary",
          "highlightString": "<span class='highlight-string'>Merge</span> Data"
        },
        {
          "key": "description",
          "highlightString": "<span class='highlight-string'>Merge</span> data into a single object"
        }
      ],
      "groups": [],
      "x": 2.798831385642738,
      "y": 0.7646062658763759
    },
    "5c05": {
      "name": "restCall",
      "canvasName": "restCall",
      "summary": "POST Create Commit",
      "description": "Execute a REST call",
      "location": "Application",
      "locationType": null,
      "app": "WorkFlowEngine",
      "type": "automatic",
      "displayName": "Tools",
      "variables": {
        "incoming": {
          "uri": "$var.92e3.gitlabCommitURI",
          "verb": "POST",
          "user": "",
          "password": "",
          "headers": "$var.726d.object",
          "body": "$var.d1bf.filteredCommit",
          "responseHeaders": true
        },
        "outgoing": {
          "response": null
        },
        "error": ""
      },
      "deprecated": false,
      "matched": [
        {
          "key": "canvasName",
          "highlightString": "<span class='highlight-string'>rest</span><span class='highlight-string'>Call</span>"
        },
        {
          "key": "summary",
          "highlightString": "<span class='highlight-string'>REST</span> <span class='highlight-string'>Call</span>"
        },
        {
          "key": "description",
          "highlightString": "Execute a <span class='highlight-string'>REST</span> <span class='highlight-string'>call</span>"
        }
      ],
      "groups": [],
      "actor": "Pronghorn",
      "x": 4.138564273789649,
      "y": 0.7578323454699407,
      "scheduled": false
    },
    "b529": {
      "name": "ViewData",
      "canvasName": "ViewData",
      "summary": "View Data",
      "description": "View data in a pretty format",
      "location": "Application",
      "app": "WorkFlowEngine",
      "displayName": "Tools",
      "type": "manual",
      "variables": {
        "incoming": {
          "header": "Failed",
          "message": "failed to update MR branch",
          "body": "failed",
          "variables": {},
          "btn_success": "Retry",
          "btn_failure": "Cancel"
        },
        "outgoing": {},
        "error": ""
      },
      "view": "/workflow_engine/task/ViewData",
      "deprecated": false,
      "matched": [
        {
          "key": "canvasName",
          "highlightString": "<span class='highlight-string'>View</span><span class='highlight-string'>Data</span>"
        },
        {
          "key": "summary",
          "highlightString": "<span class='highlight-string'>View</span> <span class='highlight-string'>Data</span>"
        },
        {
          "key": "description",
          "highlightString": "<span class='highlight-string'>View</span> <span class='highlight-string'>data</span> in a pretty format"
        }
      ],
      "groups": [],
      "x": 4.142737896494157,
      "y": 1.033869602032176,
      "scheduled": false
    },
    "dd20": {
      "name": "merge",
      "canvasName": "merge",
      "summary": "Merge Data",
      "description": "Merge data into a single object",
      "location": "Application",
      "locationType": null,
      "app": "WorkFlowEngine",
      "type": "operation",
      "displayName": "WorkFlowEngine",
      "variables": {
        "incoming": {
          "data_to_merge": [
            {
              "key": "source_branch",
              "value": {
                "task": "job",
                "variable": "mrBranchName",
                "editable": true
              }
            },
            {
              "key": "target_branch",
              "value": {
                "task": "job",
                "variable": "targetBranch",
                "editable": true
              }
            },
            {
              "key": "title",
              "value": {
                "task": "job",
                "variable": "mrBranchName",
                "editable": true
              }
            },
            {
              "key": "description",
              "value": {
                "task": "ddb4",
                "variable": "combinedStrings",
                "editable": true
              }
            }
          ]
        },
        "outgoing": {
          "merged_object": null
        }
      },
      "deprecated": false,
      "matched": [
        {
          "key": "canvasName",
          "highlightString": "<span class='highlight-string'>merge</span>"
        },
        {
          "key": "summary",
          "highlightString": "<span class='highlight-string'>Merge</span> Data"
        },
        {
          "key": "description",
          "highlightString": "<span class='highlight-string'>Merge</span> data into a single object"
        }
      ],
      "groups": [],
      "x": 5.128547579298831,
      "y": 0.7790008467400508
    },
    "1d1f": {
      "name": "restCall",
      "canvasName": "restCall",
      "summary": "POST Create Merge Request",
      "description": "Execute a REST call",
      "location": "Application",
      "locationType": null,
      "app": "WorkFlowEngine",
      "type": "automatic",
      "displayName": "Tools",
      "variables": {
        "incoming": {
          "uri": "$var.a653.combinedStrings",
          "verb": "POST",
          "user": "",
          "password": "",
          "headers": "$var.726d.object",
          "body": "$var.dd20.merged_object",
          "responseHeaders": true
        },
        "outgoing": {
          "response": null
        },
        "error": ""
      },
      "deprecated": false,
      "matched": [
        {
          "key": "canvasName",
          "highlightString": "<span class='highlight-string'>rest</span><span class='highlight-string'>Call</span>"
        },
        {
          "key": "summary",
          "highlightString": "<span class='highlight-string'>REST</span> <span class='highlight-string'>Call</span>"
        },
        {
          "key": "description",
          "highlightString": "Execute a <span class='highlight-string'>REST</span> <span class='highlight-string'>call</span>"
        }
      ],
      "groups": [],
      "actor": "Pronghorn",
      "x": 5.295492487479132,
      "y": 0.7722269263336156,
      "scheduled": false
    },
    "92e3": {
      "name": "transformation",
      "canvasName": "transformation",
      "summary": "JSON Transformation",
      "description": "Perform a JSON Transformation using the JST library.",
      "location": "Application",
      "locationType": null,
      "app": "WorkFlowEngine",
      "type": "operation",
      "displayName": "WorkFlowEngine",
      "variables": {
        "incoming": {
          "tr_id": "5f6b7b40b7a0a706e5b1058e",
          "variableMap": {
            "repoId": "$var.3c4a.repoId"
          },
          "options": {
            "extractOutput": true
          }
        },
        "outgoing": {
          "gitlabCommitURI": null
        }
      },
      "deprecated": false,
      "matched": [
        {
          "key": "description",
          "highlightString": "Perform a JSON Transformation using the <span class='highlight-string'>JST</span> library."
        }
      ],
      "groups": [],
      "x": 2.9440734557595993,
      "y": 0.77307366638442
    },
    "9a5a": {
      "name": "numberToString",
      "canvasName": "toString",
      "summary": "Convert repo id to string",
      "description": "Convert repo id to string",
      "location": "Application",
      "locationType": null,
      "app": "WorkFlowEngine",
      "type": "automatic",
      "displayName": "Number",
      "variables": {
        "incoming": {
          "num": "$var.3c4a.repoId",
          "radix": ""
        },
        "outgoing": {
          "numToString": null
        },
        "error": ""
      },
      "deprecated": false,
      "matched": [
        {
          "key": "canvasName",
          "highlightString": "to<span class='highlight-string'>String</span>"
        },
        {
          "key": "summary",
          "highlightString": "Convert number to <span class='highlight-string'>string</span>."
        },
        {
          "key": "description",
          "highlightString": "Returns a <span class='highlight-string'>string</span> representing the specified Number object."
        }
      ],
      "groups": [],
      "actor": "Pronghorn",
      "x": 4.365609348914858,
      "y": 0.7654530059271804,
      "scheduled": false
    },
    "a653": {
      "name": "stringConcat",
      "canvasName": "concat",
      "summary": "Create merge uri",
      "description": "Create merge uri",
      "location": "Application",
      "locationType": null,
      "app": "WorkFlowEngine",
      "type": "automatic",
      "displayName": "String",
      "variables": {
        "incoming": {
          "str": "$var.1fc1.combinedStrings",
          "stringN": "/merge_requests"
        },
        "outgoing": {
          "combinedStrings": null
        },
        "error": ""
      },
      "deprecated": false,
      "matched": [
        {
          "key": "canvasName",
          "highlightString": "<span class='highlight-string'>concat</span>"
        },
        {
          "key": "summary",
          "highlightString": "<span class='highlight-string'>Concat</span>enates strings together."
        },
        {
          "key": "description",
          "highlightString": "<span class='highlight-string'>Concat</span>enates a string with a second string(s). The second parameter can be a string or array."
        }
      ],
      "groups": [],
      "actor": "Pronghorn",
      "x": 4.792153589315526,
      "y": 0.7790008467400508,
      "scheduled": false
    },
    "1fc1": {
      "name": "stringConcat",
      "canvasName": "concat",
      "summary": "Concatenates strings together.",
      "description": "Concatenates a string with a second string(s). The second parameter can be a string or array.",
      "location": "Application",
      "locationType": null,
      "app": "WorkFlowEngine",
      "type": "automatic",
      "displayName": "String",
      "variables": {
        "incoming": {
          "str": "https://gitlab.com/api/v4/projects/",
          "stringN": "$var.9a5a.numToString"
        },
        "outgoing": {
          "combinedStrings": null
        },
        "error": ""
      },
      "deprecated": false,
      "matched": [
        {
          "key": "canvasName",
          "highlightString": "<span class='highlight-string'>concat</span>"
        },
        {
          "key": "summary",
          "highlightString": "<span class='highlight-string'>Concat</span>enates strings together."
        },
        {
          "key": "description",
          "highlightString": "<span class='highlight-string'>Concat</span>enates a string with a second string(s). The second parameter can be a string or array."
        }
      ],
      "groups": [],
      "actor": "Pronghorn",
      "x": 4.595158597662771,
      "y": 0.77307366638442,
      "scheduled": false
    },
    "3c4a": {
      "name": "transformation",
      "canvasName": "transformation",
      "summary": "JSON Transformation",
      "description": "Perform a JSON Transformation using the JST library.",
      "location": "Application",
      "locationType": null,
      "app": "WorkFlowEngine",
      "type": "operation",
      "displayName": "WorkFlowEngine",
      "variables": {
        "incoming": {
          "tr_id": "5f6cc886b7a0a706e5b10595",
          "variableMap": {
            "repoSearchName": "$var.job.repoName",
            "repoSearchResults": "$var.619.return_data"
          },
          "options": {
            "extractOutput": false
          }
        },
        "outgoing": {
          "repoURL": null,
          "repoId": null,
          "httpURL": null
        }
      },
      "deprecated": false,
      "matched": [
        {
          "key": "description",
          "highlightString": "Perform a JSON Transformation using the <span class='highlight-string'>JST</span> library."
        }
      ],
      "groups": [],
      "x": 1.2504173622704509,
      "y": 0.7747671464860287
    },
    "7d5b": {
      "name": "restCall",
      "canvasName": "restCall",
      "summary": "Get Package Json content",
      "description": "Execute a REST call",
      "location": "Application",
      "locationType": null,
      "app": "WorkFlowEngine",
      "type": "automatic",
      "displayName": "Tools",
      "variables": {
        "incoming": {
          "uri": "$var.f382.getPackageJsonURL",
          "verb": "GET",
          "user": "",
          "password": "",
          "headers": "$var.726d.object",
          "body": "",
          "responseHeaders": true
        },
        "outgoing": {
          "response": null
        },
        "error": "$var.job.createRepoError"
      },
      "deprecated": false,
      "matched": [
        {
          "key": "canvasName",
          "highlightString": "<span class='highlight-string'>restCall</span>"
        }
      ],
      "groups": [],
      "actor": "Pronghorn",
      "x": 2.006677796327212,
      "y": 0.77307366638442,
      "scheduled": false
    },
    "f382": {
      "name": "transformation",
      "canvasName": "transformation",
      "summary": "JSON Transformation",
      "description": "Perform a JSON Transformation using the JST library.",
      "location": "Application",
      "locationType": null,
      "app": "WorkFlowEngine",
      "type": "operation",
      "displayName": "WorkFlowEngine",
      "variables": {
        "incoming": {
          "tr_id": "5f7246dab7a0a706e5b105a9",
          "variableMap": {
            "repoId": "$var.3c4a.repoId",
            "targetBranch": "$var.job.targetBranch"
          },
          "options": {
            "extractOutput": true
          }
        },
        "outgoing": {
          "getPackageJsonURL": null
        }
      },
      "deprecated": false,
      "matched": [
        {
          "key": "description",
          "highlightString": "Perform a JSON Transformation using the <span class='highlight-string'>JST</span> library."
        }
      ],
      "groups": [],
      "x": 1.8363939899833055,
      "y": 0.7739204064352244
    },
    "40bf": {
      "name": "query",
      "canvasName": "query",
      "summary": "Query version",
      "description": "Query version",
      "location": "Application",
      "locationType": null,
      "app": "WorkFlowEngine",
      "type": "operation",
      "displayName": "WorkFlowEngine",
      "variables": {
        "incoming": {
          "pass_on_null": false,
          "query": "body.version",
          "obj": "$var.7d5b.response"
        },
        "outgoing": {
          "return_data": null
        },
        "error": ""
      },
      "deprecated": false,
      "matched": [
        {
          "key": "canvasName",
          "highlightString": "<span class='highlight-string'>query</span>"
        },
        {
          "key": "summary",
          "highlightString": "<span class='highlight-string'>Query</span> Data Using 'json-query' Format"
        },
        {
          "key": "description",
          "highlightString": "<span class='highlight-string'>Query</span> data using a dot/bracket notation string and a matching key/value pair."
        }
      ],
      "groups": [],
      "x": 2.1636060100166943,
      "y": 0.7722269263336156,
      "scheduled": false
    },
    "ddb4": {
      "name": "stringConcat",
      "canvasName": "concat",
      "summary": "Merge request description",
      "description": "Merge request description",
      "location": "Application",
      "locationType": null,
      "app": "WorkFlowEngine",
      "type": "automatic",
      "displayName": "String",
      "variables": {
        "incoming": {
          "str": "Merge request created by:",
          "stringN": "$var.job.username"
        },
        "outgoing": {
          "combinedStrings": null
        },
        "error": ""
      },
      "deprecated": false,
      "matched": [
        {
          "key": "canvasName",
          "highlightString": "<span class='highlight-string'>concat</span>"
        },
        {
          "key": "summary",
          "highlightString": "<span class='highlight-string'>Concat</span>enates strings together."
        },
        {
          "key": "description",
          "highlightString": "<span class='highlight-string'>Concat</span>enates a string with a second string(s). The second parameter can be a string or array."
        }
      ],
      "groups": [],
      "actor": "Pronghorn",
      "x": 4.979131886477463,
      "y": 0.7696867061812024,
      "scheduled": false
    },
    "d1bf": {
      "name": "transformation",
      "canvasName": "transformation",
      "summary": "JSON Transformation",
      "description": "Perform a JSON Transformation using the JST library.",
      "location": "Application",
      "locationType": null,
      "app": "WorkFlowEngine",
      "type": "operation",
      "displayName": "WorkFlowEngine",
      "variables": {
        "incoming": {
          "tr_id": "5f806109ae462065b2fd0976",
          "variableMap": {
            "branch": "$var.ae5b.branch",
            "commit_message": "$var.ae5b.commit_message",
            "filterActions": "$var.ae5b.actions"
          },
          "options": {
            "extractOutput": true
          }
        },
        "outgoing": {
          "filteredCommit": null
        }
      },
      "deprecated": false,
      "matched": [
        {
          "key": "description",
          "highlightString": "Perform a JSON Transformation using the <span class='highlight-string'>JST</span> library."
        }
      ],
      "groups": [],
      "x": 3.9858096828046743,
      "y": 0.7679932260795935
    },
    "ae5b": {
      "name": "transformation",
      "canvasName": "transformation",
      "summary": "JSON Transformation",
      "description": "Perform a JSON Transformation using the JST library.",
      "location": "Application",
      "locationType": null,
      "app": "WorkFlowEngine",
      "type": "operation",
      "displayName": "WorkFlowEngine",
      "variables": {
        "incoming": {
          "tr_id": "5f806064ae462065b2fd0974",
          "variableMap": {
            "commitUpdate": "$var.25d8.merged_object"
          },
          "options": {
            "extractOutput": false
          }
        },
        "outgoing": {
          "branch": null,
          "commit_message": null,
          "actions": null
        }
      },
      "deprecated": false,
      "matched": [
        {
          "key": "description",
          "highlightString": "Perform a JSON Transformation using the <span class='highlight-string'>JST</span> library."
        }
      ],
      "groups": [],
      "x": 3.877295492487479,
      "y": 0.7722269263336156
    },
    "e0ff": {
      "name": "transformation",
      "canvasName": "transformation",
      "summary": "JSON Transformation",
      "description": "Perform a JSON Transformation using the JST library.",
      "location": "Application",
      "locationType": null,
      "app": "WorkFlowEngine",
      "type": "operation",
      "displayName": "WorkFlowEngine",
      "variables": {
        "incoming": {
          "tr_id": "5f805d71ae462065b2fd0972",
          "variableMap": {
            "bodyFromGetCall": "$var.2890.return_data"
          },
          "options": {
            "extractOutput": true
          }
        },
        "outgoing": {
          "filteredBody": null
        }
      },
      "deprecated": false,
      "matched": [
        {
          "key": "description",
          "highlightString": "Perform a JSON Transformation using the <span class='highlight-string'>JST</span> library."
        }
      ],
      "groups": [],
      "x": 3.4991652754590983,
      "y": 0.7722269263336156
    },
    "b09d": {
      "name": "restCall",
      "canvasName": "restCall",
      "summary": "Get Branch Files Call",
      "description": "Get Branch Files Call",
      "location": "Application",
      "locationType": null,
      "app": "WorkFlowEngine",
      "type": "automatic",
      "displayName": "Tools",
      "variables": {
        "incoming": {
          "uri": "$var.2dcc.uriForGet",
          "verb": "GET",
          "user": "",
          "password": "",
          "headers": "$var.726d.object",
          "body": "",
          "responseHeaders": true
        },
        "outgoing": {
          "response": null
        },
        "error": ""
      },
      "deprecated": false,
      "matched": [
        {
          "key": "canvasName",
          "highlightString": "<span class='highlight-string'>restC</span>all"
        }
      ],
      "groups": [],
      "actor": "Pronghorn",
      "x": 3.2153589315525877,
      "y": 0.7756138865368332,
      "scheduled": false
    },
    "522c": {
      "name": "restCall",
      "canvasName": "restCall",
      "summary": "Delete Call",
      "description": "Delete Call",
      "location": "Application",
      "locationType": null,
      "app": "WorkFlowEngine",
      "type": "automatic",
      "displayName": "Tools",
      "variables": {
        "incoming": {
          "uri": "$var.92e3.gitlabCommitURI",
          "verb": "POST",
          "user": "",
          "password": "",
          "headers": "$var.726d.object",
          "body": "$var.274.commitDeleteBody",
          "responseHeaders": true
        },
        "outgoing": {
          "response": null
        },
        "error": ""
      },
      "deprecated": false,
      "matched": [
        {
          "key": "canvasName",
          "highlightString": "<span class='highlight-string'>restC</span>all"
        }
      ],
      "groups": [],
      "actor": "Pronghorn",
      "x": 3.7554257095158596,
      "y": 0.7662997459779848,
      "scheduled": false
    },
    "2dcc": {
      "name": "transformation",
      "canvasName": "transformation",
      "summary": "JSON Transformation",
      "description": "Perform a JSON Transformation using the JST library.",
      "location": "Application",
      "locationType": null,
      "app": "WorkFlowEngine",
      "type": "operation",
      "displayName": "WorkFlowEngine",
      "variables": {
        "incoming": {
          "tr_id": "5f807048ae462065b2fd097a",
          "variableMap": {
            "repoID": "$var.3c4a.repoId"
          },
          "options": {
            "extractOutput": true
          }
        },
        "outgoing": {
          "uriForGet": null
        }
      },
      "deprecated": false,
      "matched": [
        {
          "key": "description",
          "highlightString": "Perform a JSON Transformation using the <span class='highlight-string'>JST</span> library."
        }
      ],
      "groups": [],
      "x": 3.0626043405676127,
      "y": 0.7679932260795935
    },
    "b5af": {
      "name": "stringConcat",
      "canvasName": "concat",
      "summary": "Make repo Url",
      "description": "Concatenates a string with a second string(s). The second parameter can be a string or array.",
      "location": "Application",
      "locationType": null,
      "app": "WorkFlowEngine",
      "type": "automatic",
      "displayName": "String",
      "variables": {
        "incoming": {
          "str": "https://gitlab.com/api/v4/projects/",
          "stringN": "$var.5168.return_data"
        },
        "outgoing": {
          "combinedStrings": null
        },
        "error": ""
      },
      "deprecated": false,
      "matched": [
        {
          "key": "canvasName",
          "highlightString": "<span class='highlight-string'>conca</span>t"
        },
        {
          "key": "summary",
          "highlightString": "<span class='highlight-string'>Conca</span>tenates strings together."
        },
        {
          "key": "description",
          "highlightString": "<span class='highlight-string'>Conca</span>tenates a string with a second string(s). The second parameter can be a string or array."
        }
      ],
      "groups": [],
      "actor": "Pronghorn",
      "x": 2.8614754098360655,
      "y": 0.461864406779661,
      "scheduled": false
    },
    "679f": {
      "name": "childJob",
      "canvasName": "childJob",
      "summary": "Run Child Job",
      "description": "Runs a child job inside a workflow.",
      "location": "Application",
      "locationType": null,
      "app": "WorkFlowEngine",
      "type": "operation",
      "displayName": "WorkFlowEngine",
      "variables": {
        "incoming": {
          "task": "",
          "workflow": "Push Bundle to Gitlab Compliance Commit",
          "variables": {
            "token": {
              "variable": "",
              "task": "726d",
              "value": "object"
            },
            "url": {
              "variable": "",
              "task": "b5af",
              "value": "combinedStrings"
            },
            "artifact": {
              "variable": "",
              "task": "14f0",
              "value": "merged_object"
            }
          },
          "data_array": "",
          "transformation": "",
          "loopType": ""
        },
        "outgoing": {
          "job_details": null
        }
      },
      "deprecated": false,
      "matched": [
        {
          "key": "canvasName",
          "highlightString": "<span class='highlight-string'>child</span>Job"
        },
        {
          "key": "summary",
          "highlightString": "Run <span class='highlight-string'>Child</span> Job"
        },
        {
          "key": "description",
          "highlightString": "Runs a <span class='highlight-string'>child</span> job inside a workflow."
        }
      ],
      "groups": [],
      "actor": "job",
      "x": 2.872950819672131,
      "y": 0.2457627118644068
    },
    "e48d": {
      "name": "transformation",
      "canvasName": "transformation",
      "summary": "updatePackageJSON",
      "description": "Perform a JSON Transformation using the JST library.",
      "location": "Application",
      "locationType": null,
      "app": "WorkFlowEngine",
      "type": "operation",
      "displayName": "WorkFlowEngine",
      "variables": {
        "incoming": {
          "tr_id": "5f6e2a3db7a0a706e5b105a1",
          "variableMap": {
            "filesArray": "$var.5a7e.return_data",
            "packageJsonName": "$var.job.packageJsonName",
            "packageJsonVersion": "0.0.1"
          },
          "options": {
            "extractOutput": false,
            "validateIncoming": true,
            "revertToDefaultValue": true
          }
        },
        "outgoing": {
          "fixedArray": null
        }
      },
      "deprecated": false,
      "matched": [
        {
          "key": "description",
          "highlightString": "Perform a JSON Transformation using the <span class='highlight-string'>JST</span> library."
        }
      ],
      "groups": [],
      "x": 1.5226519337016575,
      "y": 0.4914134742404227,
      "task_name": "updatePackageJSON"
    },
    "d425": {
      "name": "transformation",
      "canvasName": "transformation",
      "summary": "updatePackageJSON",
      "description": "Perform a JSON Transformation using the JST library.",
      "location": "Application",
      "locationType": null,
      "app": "WorkFlowEngine",
      "type": "operation",
      "displayName": "WorkFlowEngine",
      "variables": {
        "incoming": {
          "tr_id": "5f6e2a3db7a0a706e5b105a1",
          "variableMap": {
            "filesArray": "$var.af69.return_data",
            "packageJsonName": "$var.job.packageJsonName",
            "packageJsonVersion": "$var.40bf.return_data"
          },
          "options": {
            "extractOutput": false,
            "validateIncoming": true,
            "revertToDefaultValue": true
          }
        },
        "outgoing": {
          "fixedArray": null
        }
      },
      "deprecated": false,
      "matched": [
        {
          "key": "description",
          "highlightString": "Perform a JSON Transformation using the <span class='highlight-string'>JST</span> library."
        }
      ],
      "groups": [],
      "x": 2.3,
      "y": 0.7556142668428005,
      "task_name": "updatePackageJSON"
    }
  },
  "transitions": {
    "274": {
      "522c": {
        "type": "standard",
        "state": "success"
      }
    },
    "592": {
      "25d8": {
        "type": "standard",
        "state": "success"
      }
    },
    "619": {
      "3c4a": {
        "type": "standard",
        "state": "success"
      }
    },
    "1751": {
      "fa4d": {
        "type": "standard",
        "state": "success"
      }
    },
    "2890": {
      "e0ff": {
        "type": "standard",
        "state": "success"
      }
    },
    "5168": {
      "5a9c": {
        "type": "standard",
        "state": "success"
      }
    },
    "7100": {
      "1d1f": {
        "type": "revert",
        "state": "success"
      },
      "workflow_end": {
        "type": "standard",
        "state": "failure"
      }
    },
    "workflow_start": {
      "726d": {
        "type": "standard",
        "state": "success"
      }
    },
    "workflow_end": {},
    "4d8d": {
      "8f53": {
        "type": "standard",
        "state": "success"
      }
    },
    "726d": {
      "4d8d": {
        "type": "standard",
        "state": "success"
      }
    },
    "8f53": {
      "1751": {
        "type": "standard",
        "state": "success"
      }
    },
    "fa4d": {
      "29b": {
        "type": "standard",
        "state": "success"
      }
    },
    "3a3b": {
      "5168": {
        "type": "standard",
        "state": "success"
      },
      "cfa6": {
        "type": "standard",
        "state": "success"
      },
      "190d": {
        "type": "standard",
        "state": "success"
      },
      "e90f": {
        "type": "standard",
        "state": "error"
      }
    },
    "29b": {
      "3a3b": {
        "type": "standard",
        "state": "success"
      }
    },
    "190d": {
      "5a9c": {
        "type": "standard",
        "state": "success"
      }
    },
    "cfa6": {
      "5a9c": {
        "type": "standard",
        "state": "success"
      }
    },
    "5a9c": {
      "5a7e": {
        "type": "standard",
        "state": "success"
      }
    },
    "5a7e": {
      "e48d": {
        "type": "standard",
        "state": "success"
      }
    },
    "753f": {
      "871d": {
        "type": "standard",
        "state": "success"
      }
    },
    "871d": {
      "14f0": {
        "type": "standard",
        "state": "success"
      }
    },
    "14f0": {
      "542c": {
        "type": "standard",
        "state": "success"
      }
    },
    "d299": {
      "3b3e": {
        "type": "standard",
        "state": "error"
      },
      "b5af": {
        "type": "standard",
        "state": "success"
      }
    },
    "3b3e": {
      "d299": {
        "type": "revert",
        "state": "success"
      }
    },
    "583c": {},
    "ba52": {},
    "542c": {
      "d299": {
        "type": "standard",
        "state": "success"
      }
    },
    "e90f": {
      "a848": {
        "type": "standard",
        "state": "success"
      }
    },
    "a848": {
      "619": {
        "type": "standard",
        "state": "success"
      },
      "38fc": {
        "type": "standard",
        "state": "failure"
      }
    },
    "38fc": {
      "3a3b": {
        "type": "revert",
        "state": "success"
      }
    },
    "c60": {},
    "c46b": {
      "9d6f": {
        "type": "standard",
        "state": "success"
      }
    },
    "9d6f": {
      "af69": {
        "type": "standard",
        "state": "success"
      }
    },
    "af69": {
      "f382": {
        "type": "standard",
        "state": "success"
      }
    },
    "edbd": {
      "592": {
        "type": "standard",
        "state": "success"
      }
    },
    "25d8": {
      "92e3": {
        "type": "standard",
        "state": "success"
      }
    },
    "5c05": {
      "b529": {
        "type": "standard",
        "state": "error"
      },
      "9a5a": {
        "type": "standard",
        "state": "success"
      }
    },
    "b529": {
      "5c05": {
        "type": "revert",
        "state": "success"
      }
    },
    "dd20": {
      "1d1f": {
        "type": "standard",
        "state": "success"
      }
    },
    "1d1f": {
      "7100": {
        "type": "standard",
        "state": "error"
      },
      "workflow_end": {
        "type": "standard",
        "state": "success"
      }
    },
    "683e": {},
    "2c42": {},
    "33ba": {},
    "92e3": {
      "2dcc": {
        "type": "standard",
        "state": "success"
      }
    },
    "9a5a": {
      "1fc1": {
        "type": "standard",
        "state": "success"
      }
    },
    "a653": {
      "ddb4": {
        "type": "standard",
        "state": "success"
      }
    },
    "1fc1": {
      "a653": {
        "type": "standard",
        "state": "success"
      }
    },
    "3c4a": {
      "c46b": {
        "type": "standard",
        "state": "success"
      }
    },
    "7d5b": {
      "40bf": {
        "type": "standard",
        "state": "success"
      }
    },
    "f382": {
      "7d5b": {
        "type": "standard",
        "state": "success"
      }
    },
    "40bf": {
      "d425": {
        "type": "standard",
        "state": "success"
      }
    },
    "ddb4": {
      "dd20": {
        "type": "standard",
        "state": "success"
      }
    },
    "80b1": {},
    "d1bf": {
      "5c05": {
        "type": "standard",
        "state": "success"
      }
    },
    "ae5b": {
      "d1bf": {
        "type": "standard",
        "state": "success"
      }
    },
    "e0ff": {
      "274": {
        "type": "standard",
        "state": "success"
      }
    },
    "b09d": {
      "2890": {
        "type": "standard",
        "state": "success"
      }
    },
    "522c": {
      "ae5b": {
        "type": "standard",
        "state": "success"
      }
    },
    "2dcc": {
      "b09d": {
        "type": "standard",
        "state": "success"
      }
    },
    "b5af": {
      "679f": {
        "type": "standard",
        "state": "success"
      }
    },
    "5a0d": {},
    "a613": {},
    "679f": {
      "workflow_end": {
        "type": "standard",
        "state": "success"
      }
    },
    "e48d": {
      "753f": {
        "type": "standard",
        "state": "success"
      }
    },
    "d425": {
      "edbd": {
        "type": "standard",
        "state": "success"
      }
    }
  },
  "font_size": 12,
  "created": "2020-09-18T17:56:01.699Z",
  "created_by": {
    "provenance": "Itential AAA LDAP",
    "username": "prit.shah",
    "firstname": "Prit",
    "inactive": true
  },
  "createdVersion": "5.10.4-2020.1.22.0",
  "last_updated": "2021-07-19T15:59:35.039Z",
  "last_updated_by": {
    "provenance": "local_aaa",
    "username": "admin@pronghorn",
    "firstname": "admin",
    "inactive": false,
    "email": ""
  },
  "lastUpdatedVersion": "5.40.5-2021.1.8.0",
  "type": "automation",
  "description": null,
  "inputSchema": {
    "type": "object",
    "properties": {
      "mrBranchName": {
        "$id": "branch",
        "type": "string"
      },
      "repoName": {
        "$id": "artifactFullName",
        "type": "string",
        "examples": [
          "New Artifact"
        ]
      },
      "uri": {
        "title": "uri",
        "type": "string",
        "examples": [
          "https://se-demo-1.itential.io/login"
        ]
      },
      "token": {
        "title": "value",
        "type": [
          "string",
          "number",
          "integer",
          "object",
          "array",
          "boolean"
        ],
        "examples": [
          {
            "third": "last"
          }
        ]
      },
      "artifact": {
        "type": "object",
        "examples": [
          {
            "name": "value"
          }
        ]
      },
      "targetBranch": {
        "$id": "targetBranch",
        "type": "string",
        "examples": [
          "fdsf"
        ]
      },
      "artifactCreateAndUpdate": {
        "type": "object",
        "examples": [
          {
            "name": "value"
          }
        ]
      },
      "commitMessage": {
        "type": [
          "array",
          "boolean",
          "null",
          "number",
          "object",
          "string"
        ]
      },
      "username": {
        "title": "stringN",
        "type": [
          "array",
          "string",
          "boolean",
          "number"
        ],
        "items": {
          "type": "string"
        },
        "examples": [
          [
            " World"
          ]
        ]
      },
      "packageJsonName": {
        "$id": "packageJsonName",
        "type": "string",
        "examples": [
          "sdfsa"
        ]
      }
    },
    "required": [
      "mrBranchName",
      "repoName",
      "uri",
      "token",
      "artifact",
      "targetBranch",
      "artifactCreateAndUpdate",
      "commitMessage",
      "username",
      "packageJsonName"
    ]
  },
  "outputSchema": {
    "type": "object",
    "properties": {
      "mrBranchName": {
        "$id": "branch",
        "type": "string"
      },
      "repoName": {
        "$id": "artifactFullName",
        "type": "string",
        "examples": [
          "New Artifact"
        ]
      },
      "uri": {
        "title": "uri",
        "type": "string",
        "examples": [
          "https://se-demo-1.itential.io/login"
        ]
      },
      "token": {
        "title": "value",
        "type": [
          "string",
          "number",
          "integer",
          "object",
          "array",
          "boolean"
        ],
        "examples": [
          {
            "third": "last"
          }
        ]
      },
      "artifact": {
        "type": "object",
        "examples": [
          {
            "name": "value"
          }
        ]
      },
      "targetBranch": {
        "$id": "targetBranch",
        "type": "string",
        "examples": [
          "fdsf"
        ]
      },
      "artifactCreateAndUpdate": {
        "type": "object",
        "examples": [
          {
            "name": "value"
          }
        ]
      },
      "commitMessage": {
        "type": [
          "array",
          "boolean",
          "null",
          "number",
          "object",
          "string"
        ]
      },
      "username": {
        "title": "stringN",
        "type": [
          "array",
          "string",
          "boolean",
          "number"
        ],
        "items": {
          "type": "string"
        },
        "examples": [
          [
            " World"
          ]
        ]
      },
      "packageJsonName": {
        "$id": "packageJsonName",
        "type": "string",
        "examples": [
          "sdfsa"
        ]
      },
      "_id": {
        "type": "string",
        "pattern": "^[0-9a-f]{24}$"
      },
      "initiator": {
        "type": "string"
      },
      "postRepoURI": {
        "type": "string"
      },
      "createRepoError": {
        "type": [
          "array",
          "boolean",
          "null",
          "number",
          "object",
          "string"
        ]
      }
    }
  },
  "tags": [],
  "groups": []
}