{
  "_id": "5f805d71ae462065b2fd0972",
  "name": "filterBody",
  "description": "",
  "incoming": [
    {
      "$id": "bodyFromGetCall",
      "type": "array",
      "items": {
        "type": "object",
        "properties": {
          "id": {
            "type": "string",
            "examples": [
              "791bb17eb88379d50a494b08692c3ffd1d3b1731"
            ]
          },
          "name": {
            "type": "string",
            "examples": [
              "bundles"
            ]
          },
          "type": {
            "type": "string",
            "examples": [
              "tree"
            ]
          },
          "path": {
            "type": "string",
            "examples": [
              "bundles"
            ]
          },
          "mode": {
            "type": "string",
            "examples": [
              "040000"
            ]
          }
        },
        "required": []
      }
    }
  ],
  "outgoing": [
    {
      "$id": "filteredBody",
      "type": "array",
      "items": {
        "type": "object",
        "properties": {
          "id": {
            "type": "string",
            "examples": [
              "791bb17eb88379d50a494b08692c3ffd1d3b1731"
            ]
          },
          "name": {
            "type": "string",
            "examples": [
              "bundles"
            ]
          },
          "type": {
            "type": "string",
            "examples": [
              "tree"
            ]
          },
          "path": {
            "type": "string",
            "examples": [
              "bundles"
            ]
          },
          "mode": {
            "type": "string",
            "examples": [
              "040000"
            ]
          }
        },
        "required": []
      }
    }
  ],
  "steps": [
    {
      "id": 2,
      "type": "assign",
      "from": {
        "location": "incoming",
        "name": "bodyFromGetCall",
        "ptr": ""
      },
      "to": {
        "location": "method",
        "name": 1,
        "ptr": "/args/0/value"
      }
    },
    {
      "id": 1,
      "type": "method",
      "library": "Array",
      "method": "filter",
      "args": [
        null,
        "ƒ_query_1"
      ],
      "view": {
        "row": 1,
        "col": 1
      }
    },
    {
      "id": 3,
      "type": "assign",
      "from": {
        "location": "method",
        "name": 1,
        "ptr": "/return"
      },
      "to": {
        "location": "outgoing",
        "name": "filteredBody",
        "ptr": ""
      }
    }
  ],
  "functions": [
    {
      "incoming": [
        {
          "type": "object",
          "properties": {
            "id": {
              "type": "string",
              "examples": [
                "791bb17eb88379d50a494b08692c3ffd1d3b1731"
              ]
            },
            "name": {
              "type": "string",
              "examples": [
                "bundles"
              ]
            },
            "type": {
              "type": "string",
              "examples": [
                "tree"
              ]
            },
            "path": {
              "type": "string",
              "examples": [
                "bundles"
              ]
            },
            "mode": {
              "type": "string",
              "examples": [
                "040000"
              ]
            }
          },
          "required": [],
          "$id": "element"
        },
        {
          "title": "index",
          "type": "number",
          "optional": true,
          "$id": "index"
        },
        {
          "$id": "array",
          "type": "array",
          "items": {
            "type": "object",
            "properties": {
              "id": {
                "type": "string",
                "examples": [
                  "791bb17eb88379d50a494b08692c3ffd1d3b1731"
                ]
              },
              "name": {
                "type": "string",
                "examples": [
                  "bundles"
                ]
              },
              "type": {
                "type": "string",
                "examples": [
                  "tree"
                ]
              },
              "path": {
                "type": "string",
                "examples": [
                  "bundles"
                ]
              },
              "mode": {
                "type": "string",
                "examples": [
                  "040000"
                ]
              }
            },
            "required": []
          },
          "optional": true
        },
        {
          "$id": "thisArg",
          "type": "object",
          "properties": {},
          "isContext": true,
          "isThis": true
        }
      ],
      "outgoing": [
        {
          "title": "return",
          "type": "boolean",
          "$id": "return"
        }
      ],
      "functions": [],
      "name": "ƒ_query_1",
      "steps": [
        {
          "id": 4,
          "type": "assign",
          "from": {
            "location": "incoming",
            "name": "element",
            "ptr": "/path"
          },
          "to": {
            "location": "method",
            "name": 1,
            "ptr": "/args/0/value"
          }
        },
        {
          "id": 5,
          "type": "assign",
          "from": {
            "location": "incoming",
            "name": "element",
            "ptr": "/path"
          },
          "to": {
            "location": "method",
            "name": 2,
            "ptr": "/args/0/value"
          }
        },
        {
          "id": 6,
          "type": "assign",
          "from": {
            "location": "incoming",
            "name": "element",
            "ptr": "/type"
          },
          "to": {
            "location": "method",
            "name": 3,
            "ptr": "/args/0/value"
          }
        },
        {
          "id": 1,
          "type": "method",
          "library": "String",
          "method": "includes",
          "args": [
            null,
            "bundles/",
            null
          ],
          "view": {
            "row": 1,
            "col": 2
          }
        },
        {
          "id": 2,
          "type": "method",
          "library": "String",
          "method": "includes",
          "args": [
            null,
            "manifest.json",
            null
          ],
          "view": {
            "row": 2,
            "col": 2
          }
        },
        {
          "id": 3,
          "type": "method",
          "library": "String",
          "method": "includes",
          "args": [
            null,
            "blob",
            null
          ],
          "view": {
            "row": 3,
            "col": 2
          }
        },
        {
          "id": 9,
          "type": "assign",
          "from": {
            "location": "method",
            "name": 1,
            "ptr": "/return"
          },
          "to": {
            "location": "method",
            "name": 8,
            "ptr": "/args/0/value"
          }
        },
        {
          "id": 10,
          "type": "assign",
          "from": {
            "location": "method",
            "name": 2,
            "ptr": "/return"
          },
          "to": {
            "location": "method",
            "name": 8,
            "ptr": "/args/1/value"
          }
        },
        {
          "id": 11,
          "type": "assign",
          "from": {
            "location": "method",
            "name": 3,
            "ptr": "/return"
          },
          "to": {
            "location": "method",
            "name": 7,
            "ptr": "/args/1/value"
          }
        },
        {
          "id": 8,
          "type": "method",
          "library": "Logical",
          "method": "or",
          "args": [
            null,
            null
          ],
          "view": {
            "row": 1,
            "col": 3
          }
        },
        {
          "id": 12,
          "type": "assign",
          "from": {
            "location": "method",
            "name": 8,
            "ptr": "/return"
          },
          "to": {
            "location": "method",
            "name": 7,
            "ptr": "/args/0/value"
          }
        },
        {
          "id": 7,
          "type": "method",
          "library": "Logical",
          "method": "and",
          "args": [
            null,
            null
          ],
          "view": {
            "row": 2,
            "col": 3
          }
        },
        {
          "id": 13,
          "type": "assign",
          "from": {
            "location": "method",
            "name": 7,
            "ptr": "/return"
          },
          "to": {
            "location": "outgoing",
            "name": "return",
            "ptr": ""
          }
        }
      ],
      "view": {
        "col": 3,
        "row": 6
      },
      "id": "ƒ_query_1",
      "comments": []
    }
  ],
  "view": {
    "col": 1,
    "row": 6
  },
  "created": "2020-10-09T12:54:09.348Z",
  "createdBy": {
    "_id": "5f6511f18bdbd806e1efcf30",
    "provenance": "Itential AAA LDAP",
    "username": "nick.andreano"
  },
  "lastUpdated": "2020-10-09T12:54:09.348Z",
  "lastUpdatedBy": {
    "_id": "5f6511f18bdbd806e1efcf30",
    "provenance": "Itential AAA LDAP",
    "username": "nick.andreano"
  }
}