{
  "_id": "61b774f10dcbac0184295e1a",
  "name": "formatGitlabFormData",
  "description": "",
  "incoming": [
    {
      "$id": "formData",
      "type": "object",
      "properties": {
        "checkInArtifact": {
          "type": "object",
          "properties": {
            "reDiscoverArtifact": {
              "type": "boolean",
              "examples": [
                true,
                false
              ]
            },
            "forExistingGitLabProjects": {
              "type": "object",
              "properties": {
                "mrType": {
                  "type": "string",
                  "default": "patch",
                  "examples": [
                    "patch"
                  ]
                },
                "commitMessage": {
                  "type": "string",
                  "default": "Initial commit",
                  "examples": [
                    "testing"
                  ]
                },
                "targetBranch": {
                  "type": "string",
                  "default": "master",
                  "examples": [
                    "master"
                  ]
                }
              },
              "required": []
            },
            "gitLabProjectName": {
              "type": "string",
              "examples": [
                "aw-test-name-1"
              ]
            },
            "gitLabLink": {
              "type": "string",
              "examples": [
                "https://gitlab%2Ecom/api/v4/groups/itentialopensource/pre-built-automations/staging"
              ]
            },
            "accessToken": {
              "type": "string",
              "examples": [
                "glpat-y7BPk2iDmExEmNzc8zXz"
              ]
            },
            "artifact": {
              "type": "string",
              "examples": [
                "61a93712c37f9d9efe2c74fc"
              ]
            }
          },
          "required": []
        }
      },
      "required": []
    }
  ],
  "outgoing": [
    {
      "$id": "reDiscoverArtifact",
      "type": "boolean"
    },
    {
      "$id": "mrType",
      "type": "string"
    },
    {
      "$id": "commitMessage",
      "type": "string"
    },
    {
      "$id": "targetBranch",
      "type": "string"
    },
    {
      "$id": "gitLabProjectName",
      "type": "string"
    },
    {
      "$id": "gitLabLink",
      "type": "string"
    },
    {
      "$id": "accessToken",
      "type": "string"
    },
    {
      "$id": "artifactName",
      "type": "string"
    }
  ],
  "steps": [
    {
      "id": 1,
      "type": "assign",
      "from": {
        "location": "incoming",
        "name": "formData",
        "ptr": "/checkInArtifact/reDiscoverArtifact"
      },
      "to": {
        "location": "outgoing",
        "name": "reDiscoverArtifact",
        "ptr": ""
      }
    },
    {
      "id": 2,
      "type": "assign",
      "from": {
        "location": "incoming",
        "name": "formData",
        "ptr": "/checkInArtifact/artifact"
      },
      "to": {
        "location": "outgoing",
        "name": "artifactName",
        "ptr": ""
      }
    },
    {
      "id": 3,
      "type": "assign",
      "from": {
        "location": "incoming",
        "name": "formData",
        "ptr": "/checkInArtifact/accessToken"
      },
      "to": {
        "location": "outgoing",
        "name": "accessToken",
        "ptr": ""
      }
    },
    {
      "id": 4,
      "type": "assign",
      "from": {
        "location": "incoming",
        "name": "formData",
        "ptr": "/checkInArtifact/gitLabLink"
      },
      "to": {
        "location": "outgoing",
        "name": "gitLabLink",
        "ptr": ""
      }
    },
    {
      "id": 5,
      "type": "assign",
      "from": {
        "location": "incoming",
        "name": "formData",
        "ptr": "/checkInArtifact/gitLabProjectName"
      },
      "to": {
        "location": "outgoing",
        "name": "gitLabProjectName",
        "ptr": ""
      }
    },
    {
      "id": 6,
      "type": "assign",
      "from": {
        "location": "incoming",
        "name": "formData",
        "ptr": "/checkInArtifact/forExistingGitLabProjects/targetBranch"
      },
      "to": {
        "location": "outgoing",
        "name": "targetBranch",
        "ptr": ""
      }
    },
    {
      "id": 7,
      "type": "assign",
      "from": {
        "location": "incoming",
        "name": "formData",
        "ptr": "/checkInArtifact/forExistingGitLabProjects/commitMessage"
      },
      "to": {
        "location": "outgoing",
        "name": "commitMessage",
        "ptr": ""
      }
    },
    {
      "id": 8,
      "type": "assign",
      "from": {
        "location": "incoming",
        "name": "formData",
        "ptr": "/checkInArtifact/forExistingGitLabProjects/mrType"
      },
      "to": {
        "location": "outgoing",
        "name": "mrType",
        "ptr": ""
      }
    }
  ],
  "functions": [],
  "comments": [],
  "view": {
    "col": 2,
    "row": 5
  },
  "created": "2021-12-13T16:29:37.634Z",
  "createdBy": {
    "_id": "61782f9b219c1990fad010ee",
    "provenance": "Itential-Okta",
    "username": "clarisa.colton@itential.com"
  },
  "lastUpdated": "2022-01-13T18:55:28.175Z",
  "lastUpdatedBy": {
    "_id": "61782f9b219c1990fad010ee",
    "provenance": "Itential-Okta",
    "username": "clarisa.colton@itential.com"
  },
  "version": "3.20.5",
  "tags": []
}