{
  "_id": "5f807048ae462065b2fd097a",
  "name": "getUriForFiles",
  "description": "",
  "incoming": [
    {
      "$id": "repoID",
      "type": "integer"
    }
  ],
  "outgoing": [
    {
      "$id": "uriForGet",
      "type": "string"
    }
  ],
  "steps": [
    {
      "id": 3,
      "type": "declaration",
      "library": "String",
      "method": "new String",
      "args": [
        "https://gitlab.com/api/v4/projects/"
      ],
      "view": {
        "row": 1,
        "col": 2
      }
    },
    {
      "id": 7,
      "type": "assign",
      "from": {
        "location": "incoming",
        "name": "repoID",
        "ptr": ""
      },
      "to": {
        "location": "method",
        "name": 1,
        "ptr": "/args/0/value"
      }
    },
    {
      "id": 1,
      "type": "method",
      "library": "Number",
      "method": "toString",
      "args": [
        null,
        null
      ],
      "view": {
        "row": 1,
        "col": 1
      }
    },
    {
      "id": 5,
      "type": "assign",
      "from": {
        "location": "declaration",
        "name": 3,
        "ptr": "/return"
      },
      "to": {
        "location": "method",
        "name": 4,
        "ptr": "/args/0/value"
      }
    },
    {
      "id": 8,
      "type": "assign",
      "from": {
        "location": "method",
        "name": 1,
        "ptr": "/return"
      },
      "to": {
        "location": "method",
        "name": 4,
        "ptr": "/args/1/value"
      }
    },
    {
      "id": 4,
      "type": "method",
      "library": "String",
      "method": "concat",
      "args": [
        null,
        null,
        "/repository/tree",
        "?recursive=true",
        "&per_page=5000"
      ],
      "view": {
        "row": 2,
        "col": 2
      }
    },
    {
      "id": 6,
      "type": "assign",
      "from": {
        "location": "method",
        "name": 4,
        "ptr": "/return"
      },
      "to": {
        "location": "outgoing",
        "name": "uriForGet",
        "ptr": ""
      }
    }
  ],
  "functions": [],
  "view": {
    "col": 3,
    "row": 5
  },
  "created": "2020-10-09T14:14:32.078Z",
  "createdBy": {
    "_id": "5f6511f18bdbd806e1efcf30",
    "provenance": "Itential AAA LDAP",
    "username": "nick.andreano"
  },
  "lastUpdated": "2020-10-13T13:55:41.456Z",
  "lastUpdatedBy": {
    "_id": "5f36a3352554207e49a23f0b",
    "provenance": "Itential AAA LDAP",
    "username": "itential-artifacts"
  }
}