{
  "iapVersions": [
    "2023.2"
  ],
  "externalDependencyList": [
    {
      "name": "App-Artifacts",
      "apiVersion": "^6.5.5-2023.2.0"
    }
  ],
  "capabilities": [
    {
      "capability": "Take in the name of the Pre-Built installed in Admin Essentials and update it with any new or removed IAP components for an existing network use case or automation"
    }
  ],
  "entryPoint": {
    "name": "Pre-Built Wizard Re-Discover",
    "type": "Operations Manager Automation"
  },
  "inputs": [
    {
      "name": "prebuilt",
      "type": "string",
      "required": "yes",
      "description": "Name of an existing Pre-Built installed in Admin Essentials",
      "exampleValue": "@scope/pre-built-name"
    }
  ],
  "apiLinks": [
    {
      "title": "Using Pre-Builts in IAP",
      "link": "https://docs.itential.com/docs/using-pre-builts-in-iap"
    },
    {
      "title": "Updating a Pre-Built",
      "link": "https://docs.itential.com/docs/updating-a-pre-built"
    }
  ],
  "exampleInputsAndOutputs": [
    {
      "exampleInput": "{\n  \"formData\": {\n    \"prebuilt\": \"@scope/pre-built-name\"\n  }\n}",
      "exampleOutput": "{}"
    }
  ],
  "queryOutput": {},
  "name": "Pre-Built Wizard Re-Discovery",
  "webName": "Pre-Built Wizard Re-Discovery",
  "assetType": "Workflow",
  "overview": "Pre-Built Wizard Re-Discovery provides the ability to update an existing Pre-Built in Admin Essentials with any new or removed IAP components for a particular use case or automation",
  "additionalOverviewDetails": [
    {
      "title": "Running Pre-Built Wizard Re-Discovery to Update A Pre-Built Bundle",
      "detail": "If there are components that are no longer included in the Pre-Built that need to be recreated with Pre-Built Wizard Re-Discovery, be sure to remove them when interacting with the first manual task shown during runtime of the job. Further, if there are any components that were manually added to the Pre-Built, ensure that those components are still present in this manual task.\n\nAfter updating IAP components from which to discover any related IAP components, the discovered IAP components will be shown in a second manual task. On that being accepted, Pre-Built Wizard Re-Discovery will update the existing Pre-Built in Admin Essentials with the newly created Pre-Built."
    }
  ],
  "dependencyConfigurations": [
    {
      "dependency": "App-Artifacts",
      "configuration": "Users need to install App-Artifacts to be able to run Pre-Built Wizard. If you do not currently have App-Artifacts installed as a service on your node, the .tgz file or \"tarball\" can be obtained from the <a href='https://registry.aws.itential.com/#browse/browse:app-prebuilt_automations' target='_blank'>Nexus repository</a>. This webpage requires an active account with Itential.\n\nPlease use your Itential Customer Success account if you need support for this or do not have credentials for Nexus. After downloading the latest App-Artifacts app, please refer to the instructions included in the App-Artifacts README to install it."
    }
  ]
}