{
  "name": "Pre-Built Wizard Re-Discover",
  "tasks": {
    "5709": {
      "name": "newVariable",
      "canvasName": "newVariable",
      "summary": "Create a Job Variable",
      "description": "Create a new Job variable by Job ID and assign it a value.",
      "location": "Application",
      "locationType": null,
      "app": "WorkFlowEngine",
      "type": "operation",
      "displayName": "WorkFlowEngine",
      "variables": {
        "incoming": {
          "name": "modules",
          "value": [
            {
              "package_id": "@itential/app-ag_manager",
              "version": ""
            },
            {
              "package_id": "@itential/app-admin_essentials",
              "version": ""
            },
            {
              "package_id": "@itential/app-golden_services",
              "version": ""
            },
            {
              "package_id": "@itential/app-form_builder",
              "version": ""
            },
            {
              "package_id": "@itential/app-artifacts",
              "version": ""
            },
            {
              "package_id": "@itential/app-automation_studio",
              "version": ""
            },
            {
              "package_id": "@itential/app-json_forms",
              "version": ""
            },
            {
              "package_id": "@itential/app-configuration_manager",
              "version": ""
            },
            {
              "package_id": "@itential/app-golden_config",
              "version": ""
            },
            {
              "package_id": "@itential/adapter-local_aaa",
              "version": ""
            },
            {
              "package_id": "@itential/app-mop",
              "version": ""
            },
            {
              "package_id": "@itential/app-nso_manager",
              "version": ""
            },
            {
              "package_id": "@itential/app-policy_manager",
              "version": ""
            },
            {
              "package_id": "@itential/app-service_management",
              "version": ""
            },
            {
              "package_id": "@itential/search",
              "version": ""
            },
            {
              "package_id": "@itential/app-service_catalog",
              "version": ""
            },
            {
              "package_id": "@itential/app-smart_template",
              "version": ""
            },
            {
              "package_id": "@itential/app-task_worker",
              "version": ""
            },
            {
              "package_id": "@itential/app-template_builder",
              "version": ""
            },
            {
              "package_id": "@itential/tags",
              "version": ""
            },
            {
              "package_id": "@itential/adapter-mongo",
              "version": ""
            },
            {
              "package_id": "@itential/adapter-redis",
              "version": ""
            },
            {
              "package_id": "@itential/app-workflow_engine",
              "version": ""
            },
            {
              "package_id": "@itential/app-workflow_builder",
              "version": ""
            }
          ]
        },
        "outgoing": {
          "value": null
        }
      },
      "groups": [],
      "nodeLocation": {
        "x": 2904,
        "y": 1116
      }
    },
    "5979": {
      "name": "componentDiscovery",
      "canvasName": "componentDiscovery",
      "summary": "Performs discovery on Automation Catalogs or Workflows",
      "description": "Discovers any referenced components within automation catalogs",
      "location": "Application",
      "locationType": null,
      "app": "AppArtifacts",
      "type": "automatic",
      "displayName": "AppArtifacts",
      "variables": {
        "incoming": {
          "entryPoint": "$var.b668.discoveryEntryPoint"
        },
        "outgoing": {
          "discovery": null
        },
        "error": ""
      },
      "groups": [],
      "actor": "Pronghorn",
      "scheduled": false,
      "nodeLocation": {
        "x": 1284,
        "y": 1116
      }
    },
    "7393": {
      "name": "transformation",
      "canvasName": "transformation",
      "summary": "Merge form output with discovered components",
      "description": "Merge form output with discovered components",
      "location": "Application",
      "locationType": null,
      "app": "WorkFlowEngine",
      "type": "operation",
      "displayName": "WorkFlowEngine",
      "variables": {
        "incoming": {
          "tr_id": "605b86f821c795008dc26118",
          "variableMap": {
            "formOutput": "$var.6c56.export",
            "discoveryOutput": "$var.5979.discovery"
          },
          "options": {
            "extractOutput": true,
            "validateIncoming": false,
            "revertToDefaultValue": true
          }
        },
        "outgoing": {
          "formInput": null
        },
        "decorators": []
      },
      "groups": [],
      "task_name": "mergeFormWithDiscoveryGitHub",
      "retrySettings": null,
      "nodeLocation": {
        "x": 1608,
        "y": 1116
      }
    },
    "workflow_start": {
      "name": "workflow_start",
      "groups": [],
      "nodeLocation": {
        "x": -1248,
        "y": 1116
      }
    },
    "workflow_end": {
      "name": "workflow_end",
      "groups": [],
      "nodeLocation": {
        "x": 3804,
        "y": 1116
      }
    },
    "5dec": {
      "name": "gatherInternalGET",
      "canvasName": "gatherInternalGET",
      "summary": "Gather Selected Artifact Info",
      "description": "Gather Selected Artifact Info",
      "location": "Application",
      "app": "AppArtifacts",
      "displayName": "AppArtifacts",
      "type": "manual",
      "variables": {
        "incoming": {
          "internalURL": "$var.9cfa.output"
        },
        "outgoing": {
          "responseBody": null
        },
        "error": "",
        "decorators": []
      },
      "view": "/app_artifacts/views/tasks/gatherInternalGET",
      "groups": [],
      "scheduled": false,
      "nodeLocation": {
        "x": -672,
        "y": 1116
      }
    },
    "76d1": {
      "name": "transformation",
      "canvasName": "transformation",
      "summary": "convertArtifactInfoToForm",
      "description": "Convert artifact data into format for JSON Form.",
      "location": "Application",
      "locationType": null,
      "app": "WorkFlowEngine",
      "type": "operation",
      "displayName": "WorkFlowEngine",
      "variables": {
        "incoming": {
          "tr_id": "6210015da161ae00ef6164b4",
          "variableMap": {
            "input": "$var.d5d.return_data"
          },
          "options": {
            "extractOutput": true,
            "validateIncoming": false,
            "revertToDefaultValue": true
          }
        },
        "outgoing": {
          "output": null
        },
        "decorators": []
      },
      "groups": [],
      "task_name": "convertArtifactInfoToFormGithub",
      "retrySettings": null,
      "nodeLocation": {
        "x": -12,
        "y": 1116
      }
    },
    "b668": {
      "name": "transformation",
      "canvasName": "transformation",
      "summary": "convertFormOutputToDiscoveryFormat",
      "description": "Converts form output to format for discovery",
      "location": "Application",
      "locationType": null,
      "app": "WorkFlowEngine",
      "type": "operation",
      "displayName": "WorkFlowEngine",
      "variables": {
        "incoming": {
          "tr_id": "6239fdc572a2f101008f5cf1",
          "variableMap": {
            "formOutput": "$var.6c56.export"
          },
          "options": {
            "extractOutput": true,
            "validateIncoming": false,
            "revertToDefaultValue": true
          }
        },
        "outgoing": {
          "discoveryEntryPoint": null
        },
        "decorators": []
      },
      "groups": [],
      "task_name": "Create Pre-Built - Convert Form Data to Discover Inputs",
      "retrySettings": null,
      "nodeLocation": {
        "x": 960,
        "y": 1116
      }
    },
    "bd16": {
      "name": "ViewData",
      "canvasName": "ViewData",
      "summary": "Confirm",
      "description": "Confirm",
      "location": "Application",
      "app": "WorkFlowEngine",
      "displayName": "WorkFlowEngine",
      "type": "manual",
      "variables": {
        "incoming": {
          "header": "Confirm Artifact Update",
          "message": "Please confirm correctness of the up to date list of components presented by the previous task.",
          "body": "Confirm button will update the list of components inside the Admin Essentials application.<br>Retry will revert to the previous task, so you can pick and choose what documents you may want to omit before discovery.",
          "variables": {},
          "btn_success": "CONFIRM",
          "btn_failure": "RETRY"
        },
        "outgoing": {},
        "error": ""
      },
      "view": "/workflow_engine/task/ViewData",
      "groups": [],
      "scheduled": false,
      "nodeLocation": {
        "x": 2256,
        "y": 1116
      }
    },
    "2b81": {
      "name": "ViewData",
      "canvasName": "ViewData",
      "summary": "Failed Discovery",
      "description": "View data in a pretty format",
      "location": "Application",
      "app": "WorkFlowEngine",
      "displayName": "WorkFlowEngine",
      "type": "manual",
      "variables": {
        "incoming": {
          "header": "Failed Discovery",
          "message": "Some selected component(s) caused the discovery to fail.<br>Please try again",
          "body": "",
          "variables": {},
          "btn_success": "Try Again",
          "btn_failure": ""
        },
        "outgoing": {},
        "error": ""
      },
      "view": "/workflow_engine/task/ViewData",
      "groups": [],
      "scheduled": false,
      "nodeLocation": {
        "x": 1284,
        "y": 1236
      }
    },
    "8ed7": {
      "name": "createPublishedArtifactFromScratch",
      "canvasName": "createPublishedArtifactFromScratch",
      "summary": "Creates artifact for publishing without DB calls",
      "description": "Creates JSON object containing artifact file structure and all associated data from input tasks without touching database",
      "location": "Application",
      "locationType": null,
      "app": "AppArtifacts",
      "type": "automatic",
      "displayName": "AppArtifacts",
      "variables": {
        "incoming": {
          "artifactData": "$var.eb15.mata",
          "modules": "$var.job.modules",
          "packageJson": "$var.eb15.packageJSON"
        },
        "outgoing": {
          "callback": null
        },
        "error": "",
        "decorators": []
      },
      "groups": [],
      "actor": "Pronghorn",
      "scheduled": false,
      "nodeLocation": {
        "x": 3228,
        "y": 1116
      }
    },
    "eb15": {
      "name": "transformation",
      "canvasName": "transformation",
      "summary": "Create Pre-Built - Create Artifact to Publish",
      "description": "Create Artifact for publish",
      "location": "Application",
      "locationType": null,
      "app": "WorkFlowEngine",
      "type": "operation",
      "displayName": "WorkFlowEngine",
      "variables": {
        "incoming": {
          "tr_id": "64b6c7f0af50070141c7da21",
          "variableMap": {
            "AEartifactInfo": "$var.d5d.return_data",
            "formOutput": "$var.a078.export",
            "discovery": "$var.5979.discovery"
          },
          "options": {
            "extractOutput": false,
            "validateIncoming": false,
            "revertToDefaultValue": true
          }
        },
        "outgoing": {
          "mata": null,
          "packageJSON": null
        },
        "decorators": []
      },
      "groups": [],
      "task_name": "Create Pre-Built - Create Artifact to Publish",
      "retrySettings": null,
      "nodeLocation": {
        "x": 2580,
        "y": 1116
      }
    },
    "cd71": {
      "name": "replaceArtifactAdminEssentials",
      "canvasName": "replaceArtifactAdminEssentials",
      "summary": "Replaces an artifact in AE via direct mongo injection",
      "description": "Replaces an artifact created from a published artifact in admin essentials",
      "location": "Application",
      "locationType": null,
      "app": "AppArtifacts",
      "type": "automatic",
      "displayName": "AppArtifacts",
      "variables": {
        "incoming": {
          "artifactBundle": "$var.8ed7.callback"
        },
        "outgoing": {
          "modifiedCount": null
        },
        "error": ""
      },
      "groups": [],
      "actor": "Pronghorn",
      "scheduled": false,
      "nodeLocation": {
        "x": 3552,
        "y": 1116
      }
    },
    "6c56": {
      "name": "ShowJsonForm",
      "canvasName": "ShowJsonForm",
      "summary": "Show Current Components",
      "description": "Show Current Components",
      "location": "Application",
      "app": "JsonForms",
      "displayName": "JsonForms",
      "type": "manual",
      "variables": {
        "incoming": {
          "form_id": "Review Re-Discovered Components",
          "instance_data": "$var.f80d.componentEditorFormInput"
        },
        "outgoing": {
          "export": null
        },
        "error": "",
        "decorators": []
      },
      "view": "/json-forms/task/ShowJsonForm",
      "groups": [],
      "scheduled": false,
      "nodeLocation": {
        "x": 636,
        "y": 1116
      }
    },
    "a078": {
      "name": "ShowJsonForm",
      "canvasName": "ShowJsonForm",
      "summary": "Show New Components",
      "description": "Show New Components",
      "location": "Application",
      "app": "JsonForms",
      "displayName": "JsonForms",
      "type": "manual",
      "variables": {
        "incoming": {
          "form_id": "Review Re-Discovered Components",
          "instance_data": "$var.7393.formInput"
        },
        "outgoing": {
          "export": null
        },
        "error": "",
        "decorators": []
      },
      "view": "/json-forms/task/ShowJsonForm",
      "groups": [],
      "scheduled": false,
      "nodeLocation": {
        "x": 1932,
        "y": 1116
      }
    },
    "f80d": {
      "name": "transformation",
      "canvasName": "transformation",
      "summary": "Create Pre-Built - Map Components for Form",
      "description": "Takes in the output of the componentDiscovery task in appartifacts and outputs a format that can be used in a form where the components can be edited.",
      "location": "Application",
      "locationType": null,
      "app": "WorkFlowEngine",
      "type": "operation",
      "displayName": "WorkFlowEngine",
      "variables": {
        "incoming": {
          "tr_id": "621002baa161ae00ef6164b5",
          "variableMap": {
            "componentDiscoveryOutput": "$var.76d1.output"
          },
          "options": {
            "extractOutput": true,
            "validateIncoming": true,
            "revertToDefaultValue": true
          }
        },
        "outgoing": {
          "componentEditorFormInput": null
        }
      },
      "groups": [],
      "task_name": "Create Pre-Built - Map Components for Form",
      "retrySettings": null,
      "nodeLocation": {
        "x": 312,
        "y": 1116
      }
    },
    "9cfa": {
      "name": "makeData",
      "canvasName": "makeData",
      "summary": "Create endpoint",
      "description": "This task takes an input and converts it to a different data type. For example, converting a number into a string.",
      "location": "Application",
      "locationType": null,
      "app": "WorkFlowEngine",
      "type": "automatic",
      "displayName": "Tools",
      "variables": {
        "incoming": {
          "input": "/prebuilts?&skip=0&order=1&sort=name&contains=<!prebuilt!>&containsField=name",
          "outputType": "string",
          "variables": "$var.job.formData"
        },
        "outgoing": {
          "output": null
        },
        "error": "",
        "decorators": []
      },
      "groups": [],
      "actor": "Pronghorn",
      "scheduled": false,
      "nodeLocation": {
        "x": -996,
        "y": 1116
      }
    },
    "d5d": {
      "name": "query",
      "canvasName": "query",
      "summary": "Query artifact data",
      "description": "Query artifact data",
      "location": "Application",
      "locationType": null,
      "app": "WorkFlowEngine",
      "type": "operation",
      "displayName": "WorkFlowEngine",
      "variables": {
        "incoming": {
          "pass_on_null": false,
          "query": "results[0]",
          "obj": "$var.5dec.responseBody"
        },
        "outgoing": {
          "return_data": null
        },
        "error": "",
        "decorators": []
      },
      "groups": [],
      "scheduled": false,
      "nodeLocation": {
        "x": -336,
        "y": 1116
      }
    }
  },
  "transitions": {
    "5709": {
      "8ed7": {
        "type": "standard",
        "state": "success"
      }
    },
    "5979": {
      "7393": {
        "type": "standard",
        "state": "success"
      },
      "2b81": {
        "type": "standard",
        "state": "error"
      }
    },
    "6355": {},
    "7393": {
      "a078": {
        "type": "standard",
        "state": "success"
      }
    },
    "workflow_start": {
      "9cfa": {
        "type": "standard",
        "state": "success"
      }
    },
    "workflow_end": {},
    "5dec": {
      "d5d": {
        "type": "standard",
        "state": "success"
      }
    },
    "76d1": {
      "f80d": {
        "type": "standard",
        "state": "success"
      }
    },
    "b668": {
      "5979": {
        "type": "standard",
        "state": "success"
      }
    },
    "bd16": {
      "5dec": {
        "type": "revert",
        "state": "failure"
      },
      "eb15": {
        "type": "standard",
        "state": "success"
      }
    },
    "2b81": {
      "5dec": {
        "type": "revert",
        "state": "success"
      }
    },
    "8ed7": {
      "cd71": {
        "type": "standard",
        "state": "success"
      }
    },
    "eb15": {
      "5709": {
        "type": "standard",
        "state": "success"
      }
    },
    "cd71": {
      "workflow_end": {
        "type": "standard",
        "state": "success"
      }
    },
    "6c56": {
      "b668": {
        "type": "standard",
        "state": "success"
      }
    },
    "a078": {
      "bd16": {
        "type": "standard",
        "state": "success"
      }
    },
    "f80d": {
      "6c56": {
        "type": "standard",
        "state": "success"
      }
    },
    "9cfa": {
      "5dec": {
        "type": "standard",
        "state": "success"
      }
    },
    "d5d": {
      "76d1": {
        "type": "standard",
        "state": "success"
      }
    }
  },
  "inputSchema": {
    "type": "object",
    "properties": {
      "formData": {
        "title": "variables",
        "type": "object",
        "properties": {}
      }
    },
    "required": [
      "formData"
    ]
  },
  "outputSchema": {
    "type": "object",
    "properties": {
      "formData": {
        "title": "variables",
        "type": "object",
        "properties": {}
      },
      "_id": {
        "type": "string",
        "pattern": "^[0-9a-f]{24}$"
      },
      "initiator": {
        "type": "string"
      },
      "modules": {
        "type": "array",
        "items": {
          "type": "object",
          "properties": {
            "package_id": {
              "type": "string"
            },
            "version": {
              "type": "string"
            }
          }
        }
      }
    }
  },
  "canvasVersion": 3,
  "created": "2022-03-21T19:44:38.709Z",
  "createdVersion": "5.40.5-2021.1.69.0",
  "created_by": {
    "provenance": "local_aaa",
    "username": "admin@pronghorn",
    "firstname": "admin",
    "inactive": false,
    "gitTokens": {
      "GitLab": "$ENC84e6972b5038a454a9ec7b399ca14d5cf7c067e6f3d845f42a71c444a2494692008de9b76e0868c9399b"
    },
    "email": ""
  },
  "font_size": 12,
  "lastUpdatedVersion": "5.55.2-2023.2.3.0",
  "last_updated": "2024-04-29T15:45:11.964Z",
  "last_updated_by": {
    "provenance": "local_aaa",
    "username": "admin@pronghorn",
    "firstname": "admin",
    "inactive": false,
    "gitTokens": {
      "GitLab": "$ENC84e6972b5038a454a9ec7b399ca14d5cf7c067e6f3d845f42a71c444a2494692008de9b76e0868c9399b"
    },
    "email": ""
  },
  "preAutomationTime": 0,
  "sla": 0,
  "type": "automation",
  "tags": [],
  "groups": [],
  "migrationVersion": 3
}