{
  "name": "Prebuilt Promotion Gitlab Create Link",
  "tasks": {
    "592": {
      "name": "query",
      "canvasName": "query",
      "summary": "Query update commit data",
      "description": "Query update commit data",
      "location": "Application",
      "locationType": null,
      "app": "WorkFlowEngine",
      "type": "operation",
      "displayName": "WorkFlowEngine",
      "variables": {
        "incoming": {
          "pass_on_null": false,
          "query": "commitActions",
          "obj": "$var.46fe.output"
        },
        "outgoing": {
          "return_data": null
        },
        "error": "",
        "decorators": []
      },
      "groups": [],
      "scheduled": false,
      "nodeLocation": {
        "x": 8148,
        "y": 1128
      }
    },
    "1751": {
      "name": "transformation",
      "canvasName": "transformation",
      "summary": "Generate Artifact Path Name - GitLab",
      "description": "Generate Artifact Path Name - GitLab",
      "location": "Application",
      "locationType": null,
      "app": "WorkFlowEngine",
      "type": "operation",
      "displayName": "WorkFlowEngine",
      "variables": {
        "incoming": {
          "tr_id": "6075cef28c016f0098c7284c",
          "variableMap": {
            "artifactFullName": "$var.job.repoName"
          },
          "options": {
            "extractOutput": true,
            "validateIncoming": true,
            "revertToDefaultValue": true
          }
        },
        "outgoing": {
          "artifactName": null
        }
      },
      "groups": [],
      "task_name": "Generate Artifact Path Name - GitLab",
      "nodeLocation": {
        "x": 3612,
        "y": 1128
      }
    },
    "2890": {
      "name": "query",
      "canvasName": "query",
      "summary": "Query Project Repository Tree Response",
      "description": "Query project repository tree response",
      "location": "Application",
      "locationType": null,
      "app": "WorkFlowEngine",
      "type": "operation",
      "displayName": "WorkFlowEngine",
      "variables": {
        "incoming": {
          "pass_on_null": false,
          "query": "response",
          "obj": "$var.c6d7.result"
        },
        "outgoing": {
          "return_data": null
        },
        "error": ""
      },
      "groups": [],
      "scheduled": false,
      "nodeLocation": {
        "x": 9768,
        "y": 1128
      }
    },
    "2995": {
      "name": "query",
      "canvasName": "query",
      "summary": "Query time value",
      "description": "Query time value",
      "location": "Application",
      "locationType": null,
      "app": "WorkFlowEngine",
      "type": "operation",
      "displayName": "WorkFlowEngine",
      "variables": {
        "incoming": {
          "pass_on_null": false,
          "query": "time",
          "obj": "$var.b99e.time"
        },
        "outgoing": {
          "return_data": null
        },
        "error": ""
      },
      "groups": [],
      "scheduled": false,
      "nodeLocation": {
        "x": 8808,
        "y": 1632
      }
    },
    "3495": {
      "name": "transformation",
      "canvasName": "transformation",
      "summary": "Generate New Project Request - GitLab",
      "description": "Creates request object for new project call",
      "location": "Application",
      "locationType": null,
      "app": "WorkFlowEngine",
      "type": "operation",
      "displayName": "WorkFlowEngine",
      "variables": {
        "incoming": {
          "tr_id": "63effc7c2680b700eb4eeefa",
          "variableMap": {
            "foundGroups": "$var.fb.result",
            "path": "$var.job.url",
            "projectName": "$var.job.repoName"
          },
          "options": {
            "extractOutput": true,
            "validateIncoming": true,
            "revertToDefaultValue": false
          }
        },
        "outgoing": {
          "createProjectRequest": null
        },
        "decorators": []
      },
      "groups": [],
      "task_name": "Generate New Project Request - GitLab",
      "retrySettings": null,
      "nodeLocation": {
        "x": 5232,
        "y": 1632
      }
    },
    "5168": {
      "name": "query",
      "canvasName": "query",
      "summary": "Query repo id",
      "description": "Query repo id",
      "location": "Application",
      "locationType": null,
      "app": "WorkFlowEngine",
      "type": "operation",
      "displayName": "WorkFlowEngine",
      "variables": {
        "incoming": {
          "pass_on_null": false,
          "query": "response.id",
          "obj": "$var.6c1.result"
        },
        "outgoing": {
          "return_data": null
        },
        "error": ""
      },
      "groups": [],
      "scheduled": false,
      "nodeLocation": {
        "x": 5880,
        "y": 1752
      }
    },
    "6825": {
      "name": "setObjectKey",
      "canvasName": "setObjectKey",
      "summary": "Set pipeline file content",
      "description": "Set the GitLab CI/CD pipeline file content",
      "location": "Application",
      "locationType": null,
      "app": "WorkFlowEngine",
      "type": "automatic",
      "displayName": "Object",
      "variables": {
        "incoming": {
          "obj": {
            "name": ".gitlab-ci.yml"
          },
          "path": [
            "content"
          ],
          "value": "default:\n  image: alpine:3.19\n\n  before_script:\n    - apk add --no-cache git\n    - apk add bash\n    - apk update && apk add --no-cache nodejs~=20 npm\n    - apk add --no-cache python3 py3-pip\n    - apk add --update --no-cache openssh\n\n  after_script:\n    - rm -rf ~/.ssh\n\nstages:\n  # Lint code, test code quality, and ensure there are no insecure dependencies\n  - security\n  # Run unit and integration test suites\n  - unit_test\n  # Generate artifact.json file for Merge Request\n  - generate_artifact_for_merge_request\n  # Generate artifact.json and perform version bump\n  - generate_artifact_and_version_bump\n  # Promote artifact.json to IAP\n  - promote_artifact\n\nsecurity:\n  allow_failure: true\n  stage: security\n  rules:\n    - if: '$CI_PIPELINE_SOURCE == \"merge_request_event\"'\n    - if: '$CI_COMMIT_BRANCH == \"master\"'\n  script:\n    - npm i\n    # check node version:\n    - 'echo \"node version: $(node --version)\"'\n    # check npm version\n    - 'echo \"npm version: $(npm --version)\"'\n    - npm audit --registry=https://registry.npmjs.org\n\nschema_validation:\n  allow_failure: false\n  stage: unit_test\n  rules:\n    - if: '$CI_PIPELINE_SOURCE == \"merge_request_event\"'\n    - if: '$CI_COMMIT_BRANCH == \"master\"'\n  script:\n    - npm i\n    # check node version:\n    - 'echo \"node version: $(node --version)\"'\n    # check npm version\n    - 'echo \"npm version: $(npm --version)\"'\n    - npm run validateSchema\n\nschemaLinks_validation:\n  allow_failure: false\n  stage: unit_test\n  rules:\n    - if: '$CI_PIPELINE_SOURCE == \"merge_request_event\"'\n    - if: '$CI_COMMIT_BRANCH == \"master\"'\n  script:\n    - npm i\n    # check node version:\n    - 'echo \"node version: $(node --version)\"'\n    # check npm version\n    - 'echo \"npm version: $(npm --version)\"'\n    - npm run validateSchemaLinks\n\n# Generates a new artifact.json on commit to branch in MR\ngenerate_artifact_for_merge_request:\n  allow_failure: false\n  stage: generate_artifact_for_merge_request\n  rules:\n    - if: '$CI_PIPELINE_SOURCE == \"merge_request_event\"'\n    - if: '$CI_COMMIT_BRANCH == \"master\"'\n      when: never\n  artifacts:\n    paths:\n    - artifact.json\n    expire_in: 5 mins\n  script:\n    - sh ./scripts/commit.sh\n\n# Bumps the version of package/package-lock and generates a new artifact.json\n# Runs on commit to master branch\ngenerate_artifact_and_version_bump:\n  stage: generate_artifact_and_version_bump\n  rules:\n    - if: '$CI_COMMIT_BRANCH == \"master\"'\n  artifacts:\n    paths:\n    - artifact.json\n    expire_in: 5 mins\n  script:\n    - sh ./scripts/version_bump.sh\n    - sh ./scripts/commit.sh\n\n# Attempts to import generated artifact.json to target IAP. Runs on commit\n# to master and if set to be run by CI/CD variable\npromote_to_iap:\n  allow_failure: false\n  rules:\n    - if: '$CI_COMMIT_BRANCH == \"master\" && $PROMOTE == \"True\"'\n  stage: promote_artifact\n  script:\n    - |\n      python3 -m venv .venv\n      source .venv/bin/activate\n      python3 -m pip install requests\n      if ! python3 ./scripts/promote.py ./artifact.json; then\n        echo -e \"\\033[0;31mERROR: ***********************************************************************************\"\n        echo \"ERROR: There was an issue promoting artifact.json to IAP.\"\n        echo -e \"ERROR: ***********************************************************************************\\033[0m\"\n        exit 1\n      fi\n"
        },
        "outgoing": {
          "object": null
        },
        "error": "",
        "decorators": []
      },
      "groups": [],
      "actor": "Pronghorn",
      "scheduled": false,
      "nodeLocation": {
        "x": 1668,
        "y": 1128
      }
    },
    "6891": {
      "name": "getV4ProjectsIdRepositoryBranchesBranch",
      "canvasName": "getV4ProjectsIdRepositoryBranchesBranch",
      "summary": "Get a single branch",
      "description": "Get a single branch",
      "location": "Adapter",
      "locationType": "Gitlab",
      "app": "Gitlab",
      "type": "automatic",
      "displayName": "Gitlab",
      "variables": {
        "incoming": {
          "id": "$var.3c4a.repoId",
          "branch": "$var.job.targetBranch",
          "adapter_id": "$var.job.adapter_id"
        },
        "outgoing": {
          "result": null
        },
        "error": "",
        "decorators": []
      },
      "groups": [],
      "actor": "Pronghorn",
      "scheduled": false,
      "nodeLocation": {
        "x": 5556,
        "y": 1128
      }
    },
    "7100": {
      "name": "ViewData",
      "canvasName": "ViewData",
      "summary": "View Data",
      "description": "View data in a pretty format",
      "location": "Application",
      "app": "WorkFlowEngine",
      "displayName": "Tools",
      "type": "manual",
      "variables": {
        "incoming": {
          "header": "Failed",
          "message": "Failed to create merge request",
          "body": "Try again?",
          "variables": {},
          "btn_success": "Try Again",
          "btn_failure": "Cancel job"
        },
        "outgoing": {},
        "error": "",
        "decorators": []
      },
      "view": "/workflow_engine/task/ViewData",
      "groups": [],
      "scheduled": false,
      "nodeLocation": {
        "x": 12684,
        "y": 1248
      }
    },
    "9900": {
      "name": "getV4GroupsIdProjectsWithOptions",
      "canvasName": "getV4GroupsIdProjectsWithOptions",
      "summary": "Search for Repository",
      "description": "Search for Repository",
      "location": "Adapter",
      "locationType": "Gitlab",
      "app": "Gitlab",
      "type": "automatic",
      "displayName": "Gitlab",
      "variables": {
        "incoming": {
          "id": "$var.job.url",
          "queryData": "$var.c0e1.merged_object",
          "adapter_id": "$var.job.adapter_id"
        },
        "outgoing": {
          "result": null
        },
        "error": "",
        "decorators": []
      },
      "groups": [],
      "actor": "Pronghorn",
      "scheduled": false,
      "nodeLocation": {
        "x": 4260,
        "y": 1128
      }
    },
    "workflow_start": {
      "name": "workflow_start",
      "groups": [],
      "nodeLocation": {
        "x": 1092,
        "y": 1128
      }
    },
    "workflow_end": {
      "name": "workflow_end",
      "groups": [],
      "nodeLocation": {
        "x": 13248,
        "y": 1488
      }
    },
    "29b": {
      "name": "newVariable",
      "canvasName": "newVariable",
      "summary": "Initialize GitLab Projects API Base Path",
      "description": "Initialize GitLab Projects API Base Path",
      "location": "Application",
      "locationType": null,
      "app": "WorkFlowEngine",
      "type": "operation",
      "displayName": "WorkFlowEngine",
      "variables": {
        "incoming": {
          "name": "postRepoURI",
          "value": "https://gitlab.com/api/v4/projects"
        },
        "outgoing": {
          "value": null
        }
      },
      "groups": [],
      "nodeLocation": {
        "x": 3936,
        "y": 1128
      }
    },
    "190d": {
      "name": "query",
      "canvasName": "query",
      "summary": "Query homepage",
      "description": "Query homepage",
      "location": "Application",
      "locationType": null,
      "app": "WorkFlowEngine",
      "type": "operation",
      "displayName": "WorkFlowEngine",
      "variables": {
        "incoming": {
          "pass_on_null": false,
          "query": "response.web_url",
          "obj": "$var.6c1.result"
        },
        "outgoing": {
          "return_data": null
        },
        "error": ""
      },
      "groups": [],
      "scheduled": false,
      "nodeLocation": {
        "x": 5880,
        "y": 1632
      }
    },
    "cfa6": {
      "name": "query",
      "canvasName": "query",
      "summary": "Query ssh url",
      "description": "Query ssh url",
      "location": "Application",
      "locationType": null,
      "app": "WorkFlowEngine",
      "type": "operation",
      "displayName": "WorkFlowEngine",
      "variables": {
        "incoming": {
          "pass_on_null": false,
          "query": "response.ssh_url_to_repo",
          "obj": "$var.6c1.result"
        },
        "outgoing": {
          "return_data": null
        },
        "error": ""
      },
      "groups": [],
      "scheduled": false,
      "nodeLocation": {
        "x": 5880,
        "y": 1512
      }
    },
    "5a9c": {
      "name": "merge",
      "canvasName": "merge",
      "summary": "Merge SSH URL and Homepage Values of new Project",
      "description": "Merge SSH URL and Homepage Values of new Project",
      "location": "Application",
      "locationType": null,
      "app": "WorkFlowEngine",
      "type": "operation",
      "displayName": "WorkFlowEngine",
      "variables": {
        "incoming": {
          "data_to_merge": [
            {
              "key": "git",
              "value": {
                "task": "cfa6",
                "variable": "return_data"
              }
            },
            {
              "key": "homepage",
              "value": {
                "task": "190d",
                "variable": "return_data"
              }
            }
          ]
        },
        "outgoing": {
          "merged_object": null
        }
      },
      "groups": [],
      "nodeLocation": {
        "x": 6216,
        "y": 1632
      }
    },
    "5a7e": {
      "name": "query",
      "canvasName": "query",
      "summary": "Query create",
      "description": "Query create",
      "location": "Application",
      "locationType": null,
      "app": "WorkFlowEngine",
      "type": "operation",
      "displayName": "WorkFlowEngine",
      "variables": {
        "incoming": {
          "pass_on_null": false,
          "query": "create",
          "obj": "$var.99e6.createArray"
        },
        "outgoing": {
          "return_data": null
        },
        "error": "",
        "decorators": []
      },
      "groups": [],
      "scheduled": false,
      "nodeLocation": {
        "x": 6540,
        "y": 1632
      }
    },
    "871d": {
      "name": "query",
      "canvasName": "query",
      "summary": "Query create commit data",
      "description": "Query create commit data",
      "location": "Application",
      "locationType": null,
      "app": "WorkFlowEngine",
      "type": "operation",
      "displayName": "WorkFlowEngine",
      "variables": {
        "incoming": {
          "pass_on_null": false,
          "query": "commitActions",
          "obj": "$var.1a1d.output"
        },
        "outgoing": {
          "return_data": null
        },
        "error": "",
        "decorators": []
      },
      "groups": [],
      "scheduled": false,
      "nodeLocation": {
        "x": 7512,
        "y": 1632
      }
    },
    "14f0": {
      "name": "merge",
      "canvasName": "merge",
      "summary": "Merge Target Branch, Commit Message, and Commit Data",
      "description": "Merge Target Branch, Commit Message, and Commit Data",
      "location": "Application",
      "locationType": null,
      "app": "WorkFlowEngine",
      "type": "operation",
      "displayName": "WorkFlowEngine",
      "variables": {
        "incoming": {
          "data_to_merge": [
            {
              "key": "branch",
              "value": {
                "task": "job",
                "variable": "targetBranch",
                "editable": true
              }
            },
            {
              "key": "commit_message",
              "value": {
                "task": "job",
                "variable": "commitMessage",
                "editable": true
              }
            },
            {
              "key": "actions",
              "value": {
                "task": "871d",
                "variable": "return_data"
              }
            }
          ]
        },
        "outgoing": {
          "merged_object": null
        }
      },
      "groups": [],
      "nodeLocation": {
        "x": 7836,
        "y": 1632
      }
    },
    "3b3e": {
      "name": "ViewData",
      "canvasName": "ViewData",
      "summary": "View Data",
      "description": "View data in a pretty format",
      "location": "Application",
      "app": "WorkFlowEngine",
      "displayName": "Tools",
      "type": "manual",
      "variables": {
        "incoming": {
          "header": "Error",
          "message": "Error making commit to repository on GitLab. ",
          "body": "Try again?",
          "variables": {},
          "btn_success": "Try Again",
          "btn_failure": "Cancel Job"
        },
        "outgoing": {},
        "error": "",
        "decorators": []
      },
      "view": "/workflow_engine/task/ViewData",
      "groups": [],
      "scheduled": false,
      "nodeLocation": {
        "x": 9132,
        "y": 1764
      }
    },
    "542c": {
      "name": "transformation",
      "canvasName": "transformation",
      "summary": "Create Request URL for Project Commit Operation - GitLab",
      "description": "Create Request URL for Project Commit Operation - GitLab",
      "location": "Application",
      "locationType": null,
      "app": "WorkFlowEngine",
      "type": "operation",
      "displayName": "WorkFlowEngine",
      "variables": {
        "incoming": {
          "tr_id": "6075cfe68c016f0098c7284d",
          "variableMap": {
            "repoId": "$var.5168.return_data"
          },
          "options": {
            "extractOutput": true,
            "validateIncoming": true,
            "revertToDefaultValue": true
          }
        },
        "outgoing": {
          "gitlabCommitURI": null
        }
      },
      "groups": [],
      "task_name": "Create Request URL for Project Commit Operation - GitLab",
      "nodeLocation": {
        "x": 8160,
        "y": 1632
      }
    },
    "38fc": {
      "name": "ViewData",
      "canvasName": "ViewData",
      "summary": "Failed to create project",
      "description": "View data in a pretty format",
      "location": "Application",
      "app": "WorkFlowEngine",
      "displayName": "Tools",
      "type": "manual",
      "variables": {
        "incoming": {
          "header": "Failed",
          "message": "Failed to create project repository. Try again?",
          "body": "",
          "variables": {},
          "btn_success": "Try again",
          "btn_failure": "Cancel job"
        },
        "outgoing": {},
        "error": "",
        "decorators": []
      },
      "view": "/workflow_engine/task/ViewData",
      "groups": [],
      "scheduled": false,
      "nodeLocation": {
        "x": 5556,
        "y": 1752
      }
    },
    "c46b": {
      "name": "merge",
      "canvasName": "merge",
      "summary": "Merge MR Source Branch and Target Branch Values",
      "description": "Merge MR Source Branch and Target Branch Values",
      "location": "Application",
      "locationType": null,
      "app": "WorkFlowEngine",
      "type": "operation",
      "displayName": "WorkFlowEngine",
      "variables": {
        "incoming": {
          "data_to_merge": [
            {
              "key": "branch",
              "value": {
                "task": "job",
                "variable": "mrBranchName",
                "editable": true
              }
            },
            {
              "key": "ref",
              "value": {
                "task": "job",
                "variable": "targetBranch",
                "editable": true
              }
            }
          ]
        },
        "outgoing": {
          "merged_object": null
        }
      },
      "groups": [],
      "nodeLocation": {
        "x": 5232,
        "y": 1128
      }
    },
    "af69": {
      "name": "query",
      "canvasName": "query",
      "summary": "Query update",
      "description": "Query update",
      "location": "Application",
      "locationType": null,
      "app": "WorkFlowEngine",
      "type": "operation",
      "displayName": "WorkFlowEngine",
      "variables": {
        "incoming": {
          "pass_on_null": false,
          "query": "update",
          "obj": "$var.99e6.updateArray"
        },
        "outgoing": {
          "return_data": null
        },
        "error": "",
        "decorators": []
      },
      "groups": [],
      "scheduled": false,
      "nodeLocation": {
        "x": 6204,
        "y": 1128
      }
    },
    "25d8": {
      "name": "merge",
      "canvasName": "merge",
      "summary": "Merge MR Source Branch, Commit Message, and Update Commit Data Values",
      "description": "Merge MR Source Branch, Commit Message, and Update Commit Data Values",
      "location": "Application",
      "locationType": null,
      "app": "WorkFlowEngine",
      "type": "operation",
      "displayName": "WorkFlowEngine",
      "variables": {
        "incoming": {
          "data_to_merge": [
            {
              "key": "branch",
              "value": {
                "task": "job",
                "variable": "mrBranchName",
                "editable": true
              }
            },
            {
              "key": "commit_message",
              "value": {
                "task": "job",
                "variable": "commitMessage",
                "editable": true
              }
            },
            {
              "key": "actions",
              "value": {
                "task": "592",
                "variable": "return_data"
              }
            }
          ]
        },
        "outgoing": {
          "merged_object": null
        }
      },
      "groups": [],
      "nodeLocation": {
        "x": 8472,
        "y": 1128
      }
    },
    "b529": {
      "name": "ViewData",
      "canvasName": "ViewData",
      "summary": "View Data",
      "description": "View data in a pretty format",
      "location": "Application",
      "app": "WorkFlowEngine",
      "displayName": "Tools",
      "type": "manual",
      "variables": {
        "incoming": {
          "header": "Failed",
          "message": "Failed to update MR branch",
          "body": "Try again?",
          "variables": {},
          "btn_success": "Try Again",
          "btn_failure": "Cancel Job"
        },
        "outgoing": {},
        "error": "",
        "decorators": []
      },
      "view": "/workflow_engine/task/ViewData",
      "groups": [],
      "scheduled": false,
      "nodeLocation": {
        "x": 11712,
        "y": 1260
      }
    },
    "dd20": {
      "name": "merge",
      "canvasName": "merge",
      "summary": "Merge MR Description, Source Branch, and Target Branch Values",
      "description": "Merge MR Description, Source Branch, and Target Branch Values",
      "location": "Application",
      "locationType": null,
      "app": "WorkFlowEngine",
      "type": "operation",
      "displayName": "WorkFlowEngine",
      "variables": {
        "incoming": {
          "data_to_merge": [
            {
              "key": "source_branch",
              "value": {
                "task": "job",
                "variable": "mrBranchName",
                "editable": true
              }
            },
            {
              "key": "target_branch",
              "value": {
                "task": "job",
                "variable": "targetBranch",
                "editable": true
              }
            },
            {
              "key": "title",
              "value": {
                "task": "job",
                "variable": "mrBranchName",
                "editable": true
              }
            },
            {
              "key": "description",
              "value": {
                "task": "ddb4",
                "variable": "combinedStrings",
                "editable": true
              }
            }
          ]
        },
        "outgoing": {
          "merged_object": null
        }
      },
      "groups": [],
      "nodeLocation": {
        "x": 12360,
        "y": 1128
      }
    },
    "92e3": {
      "name": "transformation",
      "canvasName": "transformation",
      "summary": "Create Request URL for Project Commit Operation - GitLab",
      "description": "Create Request URL for Project Commit Operation - GitLab",
      "location": "Application",
      "locationType": null,
      "app": "WorkFlowEngine",
      "type": "operation",
      "displayName": "WorkFlowEngine",
      "variables": {
        "incoming": {
          "tr_id": "6075cfe68c016f0098c7284d",
          "variableMap": {
            "repoId": "$var.3c4a.repoId"
          },
          "options": {
            "extractOutput": true,
            "validateIncoming": true,
            "revertToDefaultValue": true
          }
        },
        "outgoing": {
          "gitlabCommitURI": null
        }
      },
      "groups": [],
      "task_name": "Create Request URL for Project Commit Operation - GitLab",
      "nodeLocation": {
        "x": 8796,
        "y": 1128
      }
    },
    "3c4a": {
      "name": "transformation",
      "canvasName": "transformation",
      "summary": "Parse Repository URL and ID - GitLab",
      "description": "Parse Repository URL and ID - GitLab",
      "location": "Application",
      "locationType": null,
      "app": "WorkFlowEngine",
      "type": "operation",
      "displayName": "WorkFlowEngine",
      "variables": {
        "incoming": {
          "tr_id": "64356046770ce80183cec91d",
          "variableMap": {
            "repoSearchName": "$var.job.repoName",
            "incomingRepo": "$var.9900.result"
          },
          "options": {
            "extractOutput": false,
            "validateIncoming": false,
            "revertToDefaultValue": true
          }
        },
        "outgoing": {
          "repoURL": null,
          "repoId": null,
          "httpURL": null
        },
        "decorators": []
      },
      "groups": [],
      "task_name": "Parse Repository URL and ID - GitLab",
      "retrySettings": null,
      "nodeLocation": {
        "x": 4908,
        "y": 1128
      }
    },
    "f382": {
      "name": "transformation",
      "canvasName": "transformation",
      "summary": "Create Package JSON URL - GitLab",
      "description": "Create Package JSON URL - GitLab",
      "location": "Application",
      "locationType": null,
      "app": "WorkFlowEngine",
      "type": "operation",
      "displayName": "WorkFlowEngine",
      "variables": {
        "incoming": {
          "tr_id": "6075d09d8c016f0098c7284e",
          "variableMap": {
            "repoId": "$var.3c4a.repoId",
            "targetBranch": "$var.job.targetBranch"
          },
          "options": {
            "extractOutput": true,
            "validateIncoming": false,
            "revertToDefaultValue": true
          }
        },
        "outgoing": {
          "getPackageJsonURL": null
        }
      },
      "groups": [],
      "task_name": "Create Package JSON URL - GitLab",
      "nodeLocation": {
        "x": 6528,
        "y": 1128
      }
    },
    "40bf": {
      "name": "query",
      "canvasName": "query",
      "summary": "Query version",
      "description": "Query version",
      "location": "Application",
      "locationType": null,
      "app": "WorkFlowEngine",
      "type": "operation",
      "displayName": "WorkFlowEngine",
      "variables": {
        "incoming": {
          "pass_on_null": false,
          "query": "response.version",
          "obj": "$var.c16e.result"
        },
        "outgoing": {
          "return_data": null
        },
        "error": "",
        "decorators": []
      },
      "groups": [],
      "scheduled": false,
      "nodeLocation": {
        "x": 7176,
        "y": 1128
      }
    },
    "ddb4": {
      "name": "stringConcat",
      "canvasName": "concat",
      "summary": "Merge request description",
      "description": "Merge request description",
      "location": "Application",
      "locationType": null,
      "app": "WorkFlowEngine",
      "type": "automatic",
      "displayName": "String",
      "variables": {
        "incoming": {
          "str": "Merge request created by:",
          "stringN": "$var.job.username"
        },
        "outgoing": {
          "combinedStrings": null
        },
        "error": ""
      },
      "groups": [],
      "actor": "Pronghorn",
      "scheduled": false,
      "nodeLocation": {
        "x": 12036,
        "y": 1128
      }
    },
    "d1bf": {
      "name": "transformation",
      "canvasName": "transformation",
      "summary": "Filter Commit Objects - GitLab",
      "description": "Filter Commit Objects - GitLab",
      "location": "Application",
      "locationType": null,
      "app": "WorkFlowEngine",
      "type": "operation",
      "displayName": "WorkFlowEngine",
      "variables": {
        "incoming": {
          "tr_id": "6075bcc58c016f0098c72846",
          "variableMap": {
            "branch": "$var.ae5b.branch",
            "commit_message": "$var.ae5b.commit_message",
            "filterActions": "$var.ae5b.actions"
          },
          "options": {
            "extractOutput": true,
            "validateIncoming": true,
            "revertToDefaultValue": true
          }
        },
        "outgoing": {
          "filteredCommit": null
        },
        "decorators": []
      },
      "groups": [],
      "task_name": "Filter Commit Objects - GitLab",
      "retrySettings": null,
      "nodeLocation": {
        "x": 11388,
        "y": 1128
      }
    },
    "ae5b": {
      "name": "transformation",
      "canvasName": "transformation",
      "summary": "actionsCreateGitlab",
      "description": "actionsCreateGitlab",
      "location": "Application",
      "locationType": null,
      "app": "WorkFlowEngine",
      "type": "operation",
      "displayName": "WorkFlowEngine",
      "variables": {
        "incoming": {
          "tr_id": "6075d1cf8c016f0098c72852",
          "variableMap": {
            "commitUpdate": "$var.25d8.merged_object"
          },
          "options": {
            "extractOutput": false,
            "validateIncoming": true,
            "revertToDefaultValue": true
          }
        },
        "outgoing": {
          "branch": null,
          "commit_message": null,
          "actions": null
        },
        "decorators": []
      },
      "groups": [],
      "task_name": "Parse Commit Data - GitLab",
      "retrySettings": null,
      "nodeLocation": {
        "x": 11064,
        "y": 1128
      }
    },
    "2dcc": {
      "name": "transformation",
      "canvasName": "transformation",
      "summary": "Create Request URL for Project Tree Files - GitLab",
      "description": "Create Request URL for Project Tree Files - GitLab",
      "location": "Application",
      "locationType": null,
      "app": "WorkFlowEngine",
      "type": "operation",
      "displayName": "WorkFlowEngine",
      "variables": {
        "incoming": {
          "tr_id": "6075d13d8c016f0098c7284f",
          "variableMap": {
            "repoID": "$var.3c4a.repoId"
          },
          "options": {
            "extractOutput": true,
            "validateIncoming": true,
            "revertToDefaultValue": true
          }
        },
        "outgoing": {
          "uriForGet": null
        }
      },
      "groups": [],
      "task_name": "Create Request URL for Project Tree Files - GitLab",
      "nodeLocation": {
        "x": 9120,
        "y": 1128
      }
    },
    "6c1": {
      "name": "postV4Projects",
      "canvasName": "postV4Projects",
      "summary": "Create new project",
      "description": "Create new project",
      "location": "Adapter",
      "locationType": "Gitlab",
      "app": "Gitlab",
      "type": "automatic",
      "displayName": "Gitlab",
      "variables": {
        "incoming": {
          "body": "$var.3495.createProjectRequest",
          "adapter_id": "$var.job.adapter_id"
        },
        "outgoing": {
          "result": null
        },
        "error": "$var.job.error",
        "decorators": []
      },
      "groups": [],
      "actor": "Pronghorn",
      "scheduled": false,
      "nodeLocation": {
        "x": 5556,
        "y": 1632
      }
    },
    "2b32": {
      "name": "postV4ProjectsIdRepositoryBranches",
      "canvasName": "postV4ProjectsIdRepositoryBranches",
      "summary": "Create branch",
      "description": "Create branch",
      "location": "Adapter",
      "locationType": "Gitlab",
      "app": "Gitlab",
      "type": "automatic",
      "displayName": "Gitlab",
      "variables": {
        "incoming": {
          "id": "$var.3c4a.repoId",
          "body": "$var.c46b.merged_object",
          "adapter_id": "$var.job.adapter_id"
        },
        "outgoing": {
          "result": null
        },
        "error": "",
        "decorators": []
      },
      "groups": [],
      "actor": "Pronghorn",
      "scheduled": false,
      "nodeLocation": {
        "x": 5880,
        "y": 1128
      }
    },
    "c16e": {
      "name": "getV4ProjectsRepositoryFilesRaw",
      "canvasName": "getV4ProjectsRepositoryFilesRaw",
      "summary": "Get raw file from repository",
      "description": "Get raw file from repository",
      "location": "Adapter",
      "locationType": "Gitlab",
      "app": "Gitlab",
      "type": "automatic",
      "displayName": "Gitlab",
      "variables": {
        "incoming": {
          "ref": "master",
          "id": "$var.3c4a.repoId",
          "filePath": "package.json",
          "adapter_id": "$var.job.adapter_id"
        },
        "outgoing": {
          "result": null
        },
        "error": ""
      },
      "groups": [],
      "actor": "Pronghorn",
      "scheduled": false,
      "nodeLocation": {
        "x": 6852,
        "y": 1128
      }
    },
    "57f8": {
      "name": "postV4ProjectsIdRepositoryCommits",
      "canvasName": "postV4ProjectsIdRepositoryCommits",
      "summary": "Commit multiple file changes as one commit",
      "description": "This feature was introduced in GitLab 8.13",
      "location": "Adapter",
      "locationType": "Gitlab",
      "app": "Gitlab",
      "type": "automatic",
      "displayName": "Gitlab",
      "variables": {
        "incoming": {
          "id": "$var.3c4a.repoId",
          "body": "$var.a161.commitDeleteBody",
          "adapter_id": "$var.job.adapter_id"
        },
        "outgoing": {
          "result": null
        },
        "error": ""
      },
      "groups": [],
      "actor": "Pronghorn",
      "scheduled": false,
      "nodeLocation": {
        "x": 10740,
        "y": 1128
      }
    },
    "3ed9": {
      "name": "postV4ProjectsIdRepositoryCommits",
      "canvasName": "postV4ProjectsIdRepositoryCommits",
      "summary": "Commit multiple file changes as one commit",
      "description": "This feature was introduced in GitLab 8.13",
      "location": "Adapter",
      "locationType": "Gitlab",
      "app": "Gitlab",
      "type": "automatic",
      "displayName": "Gitlab",
      "variables": {
        "incoming": {
          "id": "$var.3c4a.repoId",
          "body": "$var.d1bf.filteredCommit",
          "adapter_id": "$var.job.adapter_id"
        },
        "outgoing": {
          "result": null
        },
        "error": ""
      },
      "groups": [],
      "actor": "Pronghorn",
      "scheduled": false,
      "nodeLocation": {
        "x": 11712,
        "y": 1128
      }
    },
    "9c59": {
      "name": "postV4ProjectsIdMergeRequests",
      "canvasName": "postV4ProjectsIdMergeRequests",
      "summary": "Create a merge request",
      "description": "Create a merge request",
      "location": "Adapter",
      "locationType": "Gitlab",
      "app": "Gitlab",
      "type": "automatic",
      "displayName": "Gitlab",
      "variables": {
        "incoming": {
          "id": "$var.3c4a.repoId",
          "body": "$var.dd20.merged_object",
          "adapter_id": "$var.job.adapter_id"
        },
        "outgoing": {
          "result": null
        },
        "error": ""
      },
      "groups": [],
      "actor": "Pronghorn",
      "scheduled": false,
      "nodeLocation": {
        "x": 12684,
        "y": 1128
      }
    },
    "5c14": {
      "name": "postV4ProjectsIdRepositoryCommits",
      "canvasName": "postV4ProjectsIdRepositoryCommits",
      "summary": "Commit multiple file changes as one commit",
      "description": "Commit multiple file changes as one commit",
      "location": "Adapter",
      "locationType": "Gitlab",
      "app": "Gitlab",
      "type": "automatic",
      "displayName": "Gitlab",
      "variables": {
        "incoming": {
          "id": "$var.5168.return_data",
          "body": "$var.14f0.merged_object",
          "adapter_id": "$var.job.adapter_id"
        },
        "outgoing": {
          "result": null
        },
        "error": "",
        "decorators": []
      },
      "groups": [],
      "actor": "Pronghorn",
      "scheduled": false,
      "retrySettings": {
        "state": [
          "error"
        ],
        "autoRetry": true,
        "limit": 3,
        "delay": 10000
      },
      "nodeLocation": {
        "x": 9132,
        "y": 1632
      }
    },
    "f3e4": {
      "name": "transformation",
      "canvasName": "transformation",
      "summary": "Filter For Artifact Components from Project Tree - GitLab",
      "description": "Filter For Artifact Components from Project Tree - GitLab",
      "location": "Application",
      "locationType": null,
      "app": "WorkFlowEngine",
      "type": "operation",
      "displayName": "WorkFlowEngine",
      "variables": {
        "incoming": {
          "tr_id": "6075d17e8c016f0098c72850",
          "variableMap": {
            "bodyFromGetCall": "$var.2890.return_data"
          },
          "options": {
            "extractOutput": true,
            "validateIncoming": true,
            "revertToDefaultValue": true
          }
        },
        "outgoing": {
          "filteredBody": null
        },
        "decorators": []
      },
      "groups": [],
      "task_name": "Filter For Artifact Components from Project Tree - GitLab",
      "retrySettings": null,
      "nodeLocation": {
        "x": 10092,
        "y": 1128
      }
    },
    "a161": {
      "name": "transformation",
      "canvasName": "transformation",
      "summary": "Generate Delete Commit Object - GitLab",
      "description": "Generate Delete Commit Object - GitLab",
      "location": "Application",
      "locationType": null,
      "app": "WorkFlowEngine",
      "type": "operation",
      "displayName": "WorkFlowEngine",
      "variables": {
        "incoming": {
          "tr_id": "6075d19a8c016f0098c72851",
          "variableMap": {
            "commit_message": "Clean Repo [skip ci]",
            "branch": "$var.job.mrBranchName",
            "filteredBody": "$var.f3e4.filteredBody"
          },
          "options": {
            "extractOutput": true,
            "validateIncoming": true,
            "revertToDefaultValue": true
          }
        },
        "outgoing": {
          "commitDeleteBody": null
        },
        "decorators": []
      },
      "groups": [],
      "task_name": "Generate Delete Commit Object - GitLab",
      "retrySettings": null,
      "nodeLocation": {
        "x": 10416,
        "y": 1128
      }
    },
    "c6d7": {
      "name": "getV4ProjectsIdRepositoryTree",
      "canvasName": "getV4ProjectsIdRepositoryTree",
      "summary": "Get a project repository tree",
      "description": "Get a project repository tree",
      "location": "Adapter",
      "locationType": "Gitlab",
      "app": "Gitlab",
      "type": "automatic",
      "displayName": "Gitlab",
      "variables": {
        "incoming": {
          "id": "$var.3c4a.repoId",
          "ref": "$var.job.mrBranchName",
          "pathParam": "",
          "recursive": true,
          "perPage": 5000,
          "adapter_id": "$var.job.adapter_id"
        },
        "outgoing": {
          "result": null
        },
        "error": ""
      },
      "groups": [],
      "actor": "Pronghorn",
      "scheduled": false,
      "nodeLocation": {
        "x": 9444,
        "y": 1128
      }
    },
    "b99e": {
      "name": "getTime",
      "canvasName": "getTime",
      "summary": "Get Time in Timezone UTC -05:00",
      "description": "Get Time in Timezone UTC -05:00 with no Format",
      "location": "Application",
      "locationType": null,
      "app": "WorkFlowEngine",
      "type": "automatic",
      "displayName": "Time",
      "variables": {
        "incoming": {
          "timezone": "-05:00",
          "offsetDuration": "",
          "format": ""
        },
        "outgoing": {
          "time": null
        },
        "error": ""
      },
      "groups": [],
      "actor": "Pronghorn",
      "scheduled": false,
      "nodeLocation": {
        "x": 8484,
        "y": 1632
      }
    },
    "b51": {
      "name": "ViewData",
      "canvasName": "ViewData",
      "summary": "SubGroup Not Found",
      "description": "SubGroup Not Found",
      "location": "Application",
      "app": "WorkFlowEngine",
      "displayName": "Tools",
      "type": "manual",
      "variables": {
        "incoming": {
          "header": "SubGroup Not Found",
          "message": "Failed to find subgroup listed below in GitLab. Make sure the inputted subgroup exists. Select Try Again to re-attempt subgroup search or Cancel Job to cancel this job.",
          "body": "$var.job.url",
          "variables": {},
          "btn_success": "Try Again",
          "btn_failure": "Cancel Job"
        },
        "outgoing": {},
        "error": "",
        "decorators": []
      },
      "view": "/workflow_engine/task/ViewData",
      "groups": [],
      "scheduled": false,
      "nodeLocation": {
        "x": 4260,
        "y": 1476
      }
    },
    "ea3c": {
      "name": "transformation",
      "canvasName": "transformation",
      "summary": "Update Package JSON before Commit",
      "description": "Update Package JSON before Commit",
      "location": "Application",
      "locationType": null,
      "app": "WorkFlowEngine",
      "type": "operation",
      "displayName": "WorkFlowEngine",
      "variables": {
        "incoming": {
          "tr_id": "6075bc6c8c016f0098c7283f",
          "variableMap": {
            "filesArray": "$var.5a7e.return_data",
            "packageJsonName": "$var.job.packageJsonName",
            "packageJsonVersion": "0.0.1"
          },
          "options": {
            "extractOutput": true,
            "validateIncoming": true,
            "revertToDefaultValue": true
          }
        },
        "outgoing": {
          "fixedArray": null
        }
      },
      "groups": [],
      "task_name": "Update Package JSON before Commit",
      "retrySettings": null,
      "nodeLocation": {
        "x": 6864,
        "y": 1632
      }
    },
    "7f02": {
      "name": "transformation",
      "canvasName": "transformation",
      "summary": "Update Package JSON before Commit",
      "description": "Update Package JSON before Commit",
      "location": "Application",
      "locationType": null,
      "app": "WorkFlowEngine",
      "type": "operation",
      "displayName": "WorkFlowEngine",
      "variables": {
        "incoming": {
          "tr_id": "6075bc6c8c016f0098c7283f",
          "variableMap": {
            "filesArray": "$var.af69.return_data",
            "packageJsonName": "$var.job.packageJsonName",
            "packageJsonVersion": "$var.40bf.return_data"
          },
          "options": {
            "extractOutput": true,
            "validateIncoming": true,
            "revertToDefaultValue": true
          }
        },
        "outgoing": {
          "fixedArray": null
        }
      },
      "groups": [],
      "task_name": "Update Package JSON before Commit",
      "retrySettings": null,
      "nodeLocation": {
        "x": 7500,
        "y": 1128
      }
    },
    "1a1d": {
      "name": "transformation",
      "canvasName": "transformation",
      "summary": "Generate Commit Actions - GitLab",
      "description": "Generate Commit Actions - GitLab",
      "location": "Application",
      "locationType": null,
      "app": "WorkFlowEngine",
      "type": "operation",
      "displayName": "WorkFlowEngine",
      "variables": {
        "incoming": {
          "tr_id": "621fd789da0c6c470881bdab",
          "variableMap": {
            "fixedArray": "$var.ea3c.fixedArray",
            "action": "create"
          },
          "options": {
            "extractOutput": true,
            "validateIncoming": true,
            "revertToDefaultValue": true
          }
        },
        "outgoing": {
          "output": null
        },
        "decorators": []
      },
      "groups": [],
      "task_name": "Generate Commit Actions - GitLab",
      "retrySettings": null,
      "nodeLocation": {
        "x": 7188,
        "y": 1632
      }
    },
    "46fe": {
      "name": "transformation",
      "canvasName": "transformation",
      "summary": "Generate Commit Actions - GitLab",
      "description": "Generate Commit Actions - GitLab",
      "location": "Application",
      "locationType": null,
      "app": "WorkFlowEngine",
      "type": "operation",
      "displayName": "WorkFlowEngine",
      "variables": {
        "incoming": {
          "tr_id": "621fd789da0c6c470881bdab",
          "variableMap": {
            "action": "update",
            "fixedArray": "$var.7f02.fixedArray"
          },
          "options": {
            "extractOutput": true,
            "validateIncoming": true,
            "revertToDefaultValue": true
          }
        },
        "outgoing": {
          "output": null
        }
      },
      "groups": [],
      "task_name": "Generate Commit Actions - GitLab",
      "retrySettings": null,
      "nodeLocation": {
        "x": 7824,
        "y": 1128
      }
    },
    "a7e2": {
      "name": "evaluation",
      "canvasName": "evaluation",
      "summary": "Check if project exists",
      "description": "Check if project exists",
      "location": "Application",
      "locationType": null,
      "app": "WorkFlowEngine",
      "type": "operation",
      "displayName": "WorkFlowEngine",
      "variables": {
        "incoming": {
          "all_true_flag": false,
          "evaluation_groups": [
            {
              "all_true_flag": false,
              "evaluations": [
                {
                  "query": "response[*].name",
                  "operand_1": {
                    "variable": "result",
                    "task": "9900"
                  },
                  "operator": "contains",
                  "operand_2": {
                    "variable": "repoName",
                    "task": "job"
                  },
                  "rightQuery": ""
                }
              ]
            }
          ]
        },
        "outgoing": {
          "return_value": null
        }
      },
      "groups": [],
      "nodeLocation": {
        "x": 4584,
        "y": 1128
      }
    },
    "da5e": {
      "name": "ViewData",
      "canvasName": "ViewData",
      "summary": "Target Branch Not Found",
      "description": "View data in a pretty format",
      "location": "Application",
      "app": "WorkFlowEngine",
      "displayName": "Tools",
      "type": "manual",
      "variables": {
        "incoming": {
          "header": "Target Branch Not Found",
          "message": "Failed to get Target Branch. Check that the inputted Target Branch exists.",
          "body": "",
          "variables": {},
          "btn_success": "Cancel Job",
          "btn_failure": ""
        },
        "outgoing": {},
        "error": "",
        "decorators": []
      },
      "view": "/workflow_engine/task/ViewData",
      "groups": [],
      "scheduled": false,
      "nodeLocation": {
        "x": 5556,
        "y": 1272
      }
    },
    "defc": {
      "name": "childJob",
      "canvasName": "childJob",
      "summary": "Run Prebuilt Promotion Gitlab Add Files",
      "description": "Run Prebuilt Promotion Gitlab Add Files",
      "location": "Application",
      "locationType": null,
      "app": "WorkFlowEngine",
      "type": "operation",
      "displayName": "WorkFlowEngine",
      "variables": {
        "incoming": {
          "task": "",
          "workflow": "Prebuilt Promotion Gitlab Add Files",
          "variables": {},
          "data_array": "",
          "transformation": "",
          "loopType": ""
        },
        "outgoing": {
          "job_details": null
        }
      },
      "groups": [],
      "actor": "job",
      "nodeLocation": {
        "x": 1992,
        "y": 1128
      }
    },
    "716f": {
      "name": "query",
      "canvasName": "query",
      "summary": "Query GitLab Repository Script Files",
      "description": "Query GitLab Repository Script Files",
      "location": "Application",
      "locationType": null,
      "app": "WorkFlowEngine",
      "type": "operation",
      "displayName": "WorkFlowEngine",
      "variables": {
        "incoming": {
          "pass_on_null": false,
          "query": "scriptFiles",
          "obj": "$var.defc.job_details"
        },
        "outgoing": {
          "return_data": null
        },
        "error": "",
        "decorators": []
      },
      "groups": [],
      "scheduled": false,
      "nodeLocation": {
        "x": 2316,
        "y": 1128
      }
    },
    "3fff": {
      "name": "query",
      "canvasName": "query",
      "summary": "Query GitLab Repository Test Files",
      "description": "Query GitLab Repository Test Files",
      "location": "Application",
      "locationType": null,
      "app": "WorkFlowEngine",
      "type": "operation",
      "displayName": "WorkFlowEngine",
      "variables": {
        "incoming": {
          "pass_on_null": false,
          "query": "testFiles",
          "obj": "$var.defc.job_details"
        },
        "outgoing": {
          "return_data": null
        },
        "error": "",
        "decorators": []
      },
      "groups": [],
      "scheduled": false,
      "nodeLocation": {
        "x": 2640,
        "y": 1128
      }
    },
    "c290": {
      "name": "transformation",
      "canvasName": "transformation",
      "summary": "Map Project Files from Arrays to Objects - GitLab",
      "description": "Map Project Files from Arrays to Objects - GitLab",
      "location": "Application",
      "locationType": null,
      "app": "WorkFlowEngine",
      "type": "operation",
      "displayName": "WorkFlowEngine",
      "variables": {
        "incoming": {
          "tr_id": "621d05685da44100e455a1d1",
          "variableMap": {
            "scriptsArr": "$var.716f.return_data",
            "ymlFile": "$var.6825.object",
            "testFiles": "$var.3fff.return_data"
          },
          "options": {
            "extractOutput": false,
            "validateIncoming": false,
            "revertToDefaultValue": true
          }
        },
        "outgoing": {
          "scriptsFolder": null,
          "YMLFile": null,
          "testFolder": null
        }
      },
      "groups": [],
      "task_name": "Map Project Files from Arrays to Objects - GitLab",
      "retrySettings": null,
      "nodeLocation": {
        "x": 2964,
        "y": 1128
      }
    },
    "99e6": {
      "name": "transformation",
      "canvasName": "transformation",
      "summary": "Generate Create and Update Arrays - GitLab",
      "description": "Generate Create and Update Arrays - GitLab",
      "location": "Application",
      "locationType": null,
      "app": "WorkFlowEngine",
      "type": "operation",
      "displayName": "WorkFlowEngine",
      "variables": {
        "incoming": {
          "tr_id": "621d36785da44100e455a1d3",
          "variableMap": {
            "artifact": "$var.job.artifact",
            "scriptsObject": "$var.c290.scriptsFolder",
            "ymlFile": "$var.c290.YMLFile",
            "testsObject": "$var.c290.testFolder"
          },
          "options": {
            "extractOutput": false,
            "validateIncoming": false,
            "revertToDefaultValue": true
          }
        },
        "outgoing": {
          "createArray": null,
          "updateArray": null
        },
        "decorators": []
      },
      "groups": [],
      "task_name": "Generate Create and Update Arrays - GitLab",
      "retrySettings": null,
      "nodeLocation": {
        "x": 3288,
        "y": 1128
      }
    },
    "c0e1": {
      "name": "merge",
      "canvasName": "merge",
      "summary": "Create Object with Repository Name",
      "description": "Create Object with Repository Name",
      "location": "Application",
      "locationType": null,
      "app": "WorkFlowEngine",
      "type": "operation",
      "displayName": "WorkFlowEngine",
      "variables": {
        "incoming": {
          "data_to_merge": [
            {
              "key": "search",
              "value": {
                "task": "job",
                "variable": "repoName",
                "editable": true
              }
            }
          ]
        },
        "outgoing": {
          "merged_object": null
        }
      },
      "groups": [],
      "nodeLocation": {
        "x": 1344,
        "y": 1128
      }
    },
    "c944": {
      "name": "stub",
      "canvasName": "stub",
      "summary": "Failure path",
      "description": "Failure path",
      "location": "Application",
      "locationType": null,
      "app": "WorkFlowEngine",
      "type": "automatic",
      "displayName": "Tools",
      "variables": {
        "incoming": {
          "type": "success",
          "delay": "",
          "response": ""
        },
        "outgoing": {
          "response": null
        },
        "error": "",
        "decorators": []
      },
      "groups": [],
      "actor": "Pronghorn",
      "scheduled": false,
      "nodeLocation": {
        "x": 4260,
        "y": 1824
      }
    },
    "91a2": {
      "name": "stub",
      "canvasName": "stub",
      "summary": "Failure path",
      "description": "Failure path",
      "location": "Application",
      "locationType": null,
      "app": "WorkFlowEngine",
      "type": "automatic",
      "displayName": "Tools",
      "variables": {
        "incoming": {
          "type": "success",
          "delay": "",
          "response": ""
        },
        "outgoing": {
          "response": null
        },
        "error": "",
        "decorators": []
      },
      "groups": [],
      "actor": "Pronghorn",
      "scheduled": false,
      "nodeLocation": {
        "x": 9636,
        "y": 1860
      }
    },
    "fb": {
      "name": "getV4Groups",
      "canvasName": "getV4Groups",
      "summary": "Get a groups list",
      "description": "Get a groups list",
      "location": "Adapter",
      "locationType": "Gitlab",
      "app": "Gitlab",
      "type": "automatic",
      "displayName": "Gitlab",
      "variables": {
        "incoming": {
          "statistics": "",
          "allAvailable": "",
          "search": "$var.job.url",
          "orderBy": "",
          "sort": "",
          "skipGroups": "",
          "withCustomAttributes": "",
          "owned": "",
          "minAccessLevel": "",
          "adapter_id": "$var.job.adapter_id"
        },
        "outgoing": {
          "result": null
        },
        "error": "",
        "decorators": []
      },
      "groups": [],
      "actor": "Pronghorn",
      "scheduled": false,
      "nodeLocation": {
        "x": 4584,
        "y": 1632
      }
    },
    "cbd6": {
      "name": "evaluation",
      "canvasName": "evaluation",
      "summary": "Check if provided path for group exists",
      "description": "Check if provided path for group exists",
      "location": "Application",
      "locationType": null,
      "app": "WorkFlowEngine",
      "type": "operation",
      "displayName": "WorkFlowEngine",
      "variables": {
        "incoming": {
          "all_true_flag": false,
          "evaluation_groups": [
            {
              "all_true_flag": false,
              "evaluations": [
                {
                  "query": "response[*].full_path",
                  "operand_1": {
                    "variable": "result",
                    "task": "fb"
                  },
                  "operator": "contains",
                  "operand_2": {
                    "variable": "url",
                    "task": "job"
                  },
                  "rightQuery": ""
                }
              ]
            }
          ]
        },
        "outgoing": {
          "return_value": null
        }
      },
      "groups": [],
      "nodeLocation": {
        "x": 4908,
        "y": 1632
      }
    }
  },
  "transitions": {
    "592": {
      "25d8": {
        "type": "standard",
        "state": "success"
      }
    },
    "985": {},
    "1290": {},
    "1751": {
      "29b": {
        "type": "standard",
        "state": "success"
      }
    },
    "2890": {
      "f3e4": {
        "type": "standard",
        "state": "success"
      }
    },
    "2995": {
      "5c14": {
        "type": "standard",
        "state": "success"
      }
    },
    "3495": {
      "6c1": {
        "type": "standard",
        "state": "success"
      }
    },
    "5168": {
      "5a9c": {
        "type": "standard",
        "state": "success"
      }
    },
    "6825": {
      "defc": {
        "type": "standard",
        "state": "success"
      }
    },
    "6891": {
      "2b32": {
        "type": "standard",
        "state": "success"
      },
      "da5e": {
        "type": "standard",
        "state": "error"
      }
    },
    "7100": {
      "workflow_end": {
        "type": "standard",
        "state": "failure"
      },
      "9c59": {
        "type": "revert",
        "state": "success"
      }
    },
    "9900": {
      "b51": {
        "type": "standard",
        "state": "error"
      },
      "a7e2": {
        "type": "standard",
        "state": "success"
      }
    },
    "workflow_start": {
      "c0e1": {
        "type": "standard",
        "state": "success"
      }
    },
    "workflow_end": {},
    "29b": {
      "9900": {
        "type": "standard",
        "state": "success"
      }
    },
    "190d": {
      "5a9c": {
        "type": "standard",
        "state": "success"
      }
    },
    "cfa6": {
      "5a9c": {
        "type": "standard",
        "state": "success"
      }
    },
    "5a9c": {
      "5a7e": {
        "type": "standard",
        "state": "success"
      }
    },
    "5a7e": {
      "ea3c": {
        "type": "standard",
        "state": "success"
      }
    },
    "871d": {
      "14f0": {
        "type": "standard",
        "state": "success"
      }
    },
    "14f0": {
      "542c": {
        "type": "standard",
        "state": "success"
      }
    },
    "3b3e": {
      "542c": {
        "type": "revert",
        "state": "success"
      },
      "workflow_end": {
        "type": "standard",
        "state": "failure"
      }
    },
    "542c": {
      "b99e": {
        "type": "standard",
        "state": "success"
      }
    },
    "38fc": {
      "6c1": {
        "type": "revert",
        "state": "success"
      },
      "c944": {
        "type": "standard",
        "state": "failure"
      }
    },
    "c46b": {
      "6891": {
        "type": "standard",
        "state": "success"
      }
    },
    "af69": {
      "f382": {
        "type": "standard",
        "state": "success"
      }
    },
    "25d8": {
      "92e3": {
        "type": "standard",
        "state": "success"
      }
    },
    "b529": {
      "3ed9": {
        "type": "revert",
        "state": "success"
      },
      "workflow_end": {
        "type": "standard",
        "state": "failure"
      }
    },
    "dd20": {
      "9c59": {
        "type": "standard",
        "state": "success"
      }
    },
    "92e3": {
      "2dcc": {
        "type": "standard",
        "state": "success"
      }
    },
    "3c4a": {
      "c46b": {
        "type": "standard",
        "state": "success"
      }
    },
    "f382": {
      "c16e": {
        "type": "standard",
        "state": "success"
      }
    },
    "40bf": {
      "7f02": {
        "type": "standard",
        "state": "success"
      }
    },
    "ddb4": {
      "dd20": {
        "type": "standard",
        "state": "success"
      }
    },
    "d1bf": {
      "3ed9": {
        "type": "standard",
        "state": "success"
      }
    },
    "ae5b": {
      "d1bf": {
        "type": "standard",
        "state": "success"
      }
    },
    "2dcc": {
      "c6d7": {
        "type": "standard",
        "state": "success"
      }
    },
    "6c1": {
      "5168": {
        "type": "standard",
        "state": "success"
      },
      "cfa6": {
        "type": "standard",
        "state": "success"
      },
      "190d": {
        "type": "standard",
        "state": "success"
      },
      "38fc": {
        "type": "standard",
        "state": "error"
      }
    },
    "2b32": {
      "af69": {
        "type": "standard",
        "state": "success"
      }
    },
    "c16e": {
      "40bf": {
        "type": "standard",
        "state": "success"
      }
    },
    "57f8": {
      "ae5b": {
        "type": "standard",
        "state": "success"
      }
    },
    "3ed9": {
      "b529": {
        "type": "standard",
        "state": "error"
      },
      "ddb4": {
        "type": "standard",
        "state": "success"
      }
    },
    "9c59": {
      "7100": {
        "type": "standard",
        "state": "error"
      },
      "workflow_end": {
        "type": "standard",
        "state": "success"
      }
    },
    "5c14": {
      "workflow_end": {
        "type": "standard",
        "state": "success"
      },
      "3b3e": {
        "type": "standard",
        "state": "error"
      }
    },
    "f3e4": {
      "a161": {
        "type": "standard",
        "state": "success"
      }
    },
    "a161": {
      "57f8": {
        "type": "standard",
        "state": "success"
      }
    },
    "c6d7": {
      "2890": {
        "type": "standard",
        "state": "success"
      }
    },
    "b99e": {
      "2995": {
        "type": "standard",
        "state": "success"
      }
    },
    "b51": {
      "9900": {
        "type": "revert",
        "state": "success"
      },
      "c944": {
        "type": "standard",
        "state": "failure"
      }
    },
    "ea3c": {
      "1a1d": {
        "type": "standard",
        "state": "success"
      }
    },
    "7f02": {
      "46fe": {
        "type": "standard",
        "state": "success"
      }
    },
    "1a1d": {
      "871d": {
        "type": "standard",
        "state": "success"
      }
    },
    "46fe": {
      "592": {
        "type": "standard",
        "state": "success"
      }
    },
    "a7e2": {
      "3c4a": {
        "type": "standard",
        "state": "success"
      },
      "fb": {
        "type": "standard",
        "state": "failure"
      }
    },
    "da5e": {
      "workflow_end": {
        "type": "standard",
        "state": "success"
      }
    },
    "defc": {
      "716f": {
        "type": "standard",
        "state": "success"
      }
    },
    "716f": {
      "3fff": {
        "type": "standard",
        "state": "success"
      }
    },
    "3fff": {
      "c290": {
        "type": "standard",
        "state": "success"
      }
    },
    "c290": {
      "99e6": {
        "type": "standard",
        "state": "success"
      }
    },
    "99e6": {
      "1751": {
        "type": "standard",
        "state": "success"
      }
    },
    "c0e1": {
      "6825": {
        "type": "standard",
        "state": "success"
      }
    },
    "c944": {
      "91a2": {
        "type": "standard",
        "state": "success"
      }
    },
    "91a2": {
      "workflow_end": {
        "type": "standard",
        "state": "success"
      }
    },
    "fb": {
      "cbd6": {
        "type": "standard",
        "state": "success"
      }
    },
    "cbd6": {
      "3495": {
        "type": "standard",
        "state": "success"
      },
      "b51": {
        "type": "standard",
        "state": "failure"
      }
    },
    "583c": {},
    "ba52": {},
    "c60": {},
    "683e": {},
    "2c42": {},
    "33ba": {},
    "1fc1": {},
    "80b1": {},
    "5a0d": {},
    "a613": {},
    "36fe": {},
    "43dd": {},
    "5d88": {},
    "7c4f": {}
  },
  "inputSchema": {
    "type": "object",
    "properties": {
      "repoName": {
        "$id": "artifactFullName",
        "type": "string",
        "examples": [
          "New Artifact"
        ]
      },
      "url": {
        "$id": "path",
        "type": "string",
        "examples": [
          "test"
        ]
      },
      "targetBranch": {
        "title": "branch",
        "type": "string"
      },
      "adapter_id": {
        "type": [
          "array",
          "boolean",
          "null",
          "number",
          "object",
          "string"
        ]
      },
      "commitMessage": {
        "type": [
          "array",
          "boolean",
          "null",
          "number",
          "object",
          "string"
        ]
      },
      "mrBranchName": {
        "$id": "branch",
        "type": "string"
      },
      "username": {
        "title": "stringN",
        "type": [
          "array",
          "string",
          "boolean",
          "number"
        ],
        "items": {
          "type": "string"
        },
        "examples": [
          [
            " World"
          ]
        ]
      },
      "packageJsonName": {
        "$id": "packageJsonName",
        "type": "string",
        "examples": [
          "sdfsa"
        ]
      },
      "artifact": {
        "$id": "artifact",
        "type": "object",
        "properties": {
          "update": {
            "type": "array",
            "items": {
              "type": "object",
              "required": []
            },
            "$id": "update"
          },
          "create": {
            "type": "array",
            "items": {
              "type": "object",
              "required": []
            },
            "$id": "create"
          }
        },
        "required": []
      }
    },
    "required": [
      "repoName",
      "url",
      "targetBranch",
      "adapter_id",
      "commitMessage",
      "mrBranchName",
      "username",
      "packageJsonName",
      "artifact"
    ]
  },
  "outputSchema": {
    "type": "object",
    "properties": {
      "repoName": {
        "$id": "artifactFullName",
        "type": "string",
        "examples": [
          "New Artifact"
        ]
      },
      "url": {
        "$id": "path",
        "type": "string",
        "examples": [
          "test"
        ]
      },
      "targetBranch": {
        "title": "branch",
        "type": "string"
      },
      "adapter_id": {
        "type": [
          "array",
          "boolean",
          "null",
          "number",
          "object",
          "string"
        ]
      },
      "commitMessage": {
        "type": [
          "array",
          "boolean",
          "null",
          "number",
          "object",
          "string"
        ]
      },
      "mrBranchName": {
        "$id": "branch",
        "type": "string"
      },
      "username": {
        "title": "stringN",
        "type": [
          "array",
          "string",
          "boolean",
          "number"
        ],
        "items": {
          "type": "string"
        },
        "examples": [
          [
            " World"
          ]
        ]
      },
      "packageJsonName": {
        "$id": "packageJsonName",
        "type": "string",
        "examples": [
          "sdfsa"
        ]
      },
      "artifact": {
        "$id": "artifact",
        "type": "object",
        "properties": {
          "update": {
            "type": "array",
            "items": {
              "type": "object",
              "required": []
            },
            "$id": "update"
          },
          "create": {
            "type": "array",
            "items": {
              "type": "object",
              "required": []
            },
            "$id": "create"
          }
        },
        "required": []
      },
      "_id": {
        "type": "string",
        "pattern": "^[0-9a-f]{24}$"
      },
      "initiator": {
        "type": "string"
      },
      "postRepoURI": {
        "type": "string"
      },
      "error": {
        "type": [
          "array",
          "boolean",
          "null",
          "number",
          "object",
          "string"
        ]
      }
    }
  },
  "created": "2022-03-08T14:50:49.785Z",
  "createdVersion": "5.40.5-2021.1.52.0",
  "created_by": {
    "provenance": "local_aaa",
    "username": "admin@pronghorn",
    "firstname": "admin",
    "inactive": false,
    "gitTokens": {
      "GitLab": "$ENC84e6972b5038e910a8d2021cfb8f505782e427d2d9d41cc63904c444a24946920084e2b16e0f68c93892"
    },
    "email": "chris.calloway@itential.com"
  },
  "font_size": 12,
  "lastUpdatedVersion": "5.55.2-2023.2.5",
  "last_updated": "2024-06-12T15:29:50.037Z",
  "preAutomationTime": 0,
  "sla": 0,
  "type": "automation",
  "last_updated_by": {
    "provenance": "local_aaa",
    "username": "admin@pronghorn",
    "firstname": "admin",
    "inactive": false,
    "gitTokens": {
      "GitLab": "$ENC84e6972b5038e910a8d2021cfb8f505782e427d2d9d41cc63904c444a24946920084e2b16e0f68c93892"
    },
    "email": "chris.calloway@itential.com"
  },
  "canvasVersion": 3,
  "tags": [],
  "groups": [],
  "migrationVersion": 3
}