{
  "_id": "6234aa0b329ee901170bd820",
  "name": "Build Query to Get Adapter by Name - IAP",
  "description": "",
  "incoming": [
    {
      "$id": "adapterName",
      "type": "string"
    }
  ],
  "outgoing": [
    {
      "$id": "getAdapterByNameURI",
      "type": "string"
    }
  ],
  "steps": [
    {
      "id": 1,
      "type": "declaration",
      "library": "String",
      "method": "new String",
      "args": [
        "/adapters?"
      ],
      "view": {
        "row": 1,
        "col": 1
      }
    },
    {
      "id": 2,
      "type": "method",
      "library": "String",
      "method": "concat",
      "args": [
        null,
        "contains=",
        null,
        "&containsField=name"
      ],
      "view": {
        "row": 2,
        "col": 2
      }
    },
    {
      "id": 4,
      "type": "assign",
      "from": {
        "location": "declaration",
        "name": 1,
        "ptr": "/return"
      },
      "to": {
        "location": "method",
        "name": 2,
        "ptr": "/args/0/value"
      }
    },
    {
      "id": 5,
      "type": "assign",
      "from": {
        "location": "incoming",
        "name": "adapterName",
        "ptr": ""
      },
      "to": {
        "location": "method",
        "name": 2,
        "ptr": "/args/2/value"
      }
    },
    {
      "id": 6,
      "type": "assign",
      "from": {
        "location": "method",
        "name": 2,
        "ptr": "/return"
      },
      "to": {
        "location": "outgoing",
        "name": "getAdapterByNameURI",
        "ptr": ""
      }
    }
  ],
  "functions": [],
  "comments": [],
  "view": {
    "col": 3,
    "row": 5
  },
  "created": "2023-06-26T14:32:55.660Z",
  "createdBy": {
    "_id": "646fa4422d25720618a4c098",
    "provenance": "local_aaa",
    "username": "admin@pronghorn"
  },
  "lastUpdated": "2023-06-26T14:32:55.660Z",
  "lastUpdatedBy": {
    "_id": "646fa4422d25720618a4c098",
    "provenance": "local_aaa",
    "username": "admin@pronghorn"
  },
  "version": "4.1.2-2023.1.5",
  "tags": []
}