{
  "id": "5e56a97629e427093c4fbc06",
  "bindingSchema": {
    "properties": {
      "deviceS": {
        "items": {
          "properties": {
            "nsoInstance": {
              "binding:method": "GET",
              "binding:link": {
                "$ref": "/links",
                "rel": "collection"
              },
              "binding:target": {
                "propertyPointer": "/enum"
              },
              "binding:hyperSchema": {
                "type": "object",
                "base": "/adapters",
                "links": [
                  {
                    "rel": "collection",
                    "href": "/brokers/mapping",
                    "targetMediaType": "application/json",
                    "targetSchema": {
                      "$ref": "#"
                    },
                    "variables": []
                  }
                ]
              },
              "binding:source": {
                "propertyPointer": "/device",
                "keyPointer": "/"
              }
            },
            "nedId": {
              "binding:method": "GET",
              "binding:link": {
                "$ref": "/links",
                "rel": "collection"
              },
              "binding:target": {
                "propertyPointer": "/enum"
              },
              "binding:hyperSchema": {
                "type": "object",
                "base": "/",
                "links": [
                  {
                    "rel": "collection",
                    "href": "/nso_manager/allNeds",
                    "targetMediaType": "application/json",
                    "targetSchema": {
                      "$ref": "#"
                    },
                    "variables": []
                  }
                ]
              },
              "binding:source": {
                "propertyPointer": "/",
                "keyPointer": "/"
              }
            }
          }
        }
      }
    }
  },
  "created": "2020-01-22T13:30:51.354Z",
  "createdBy": "admin@pronghorn",
  "description": "A JSON form to input device(s)  to be onboarded onto NSO",
  "lastUpdated": "2023-07-13T15:45:20.940Z",
  "lastUpdatedBy": "admin@pronghorn",
  "name": "IAP NSO Device Onboarding",
  "schema": {
    "title": "IAP NSO Device Onboarding",
    "description": "A JSON form to input device(s)  to be onboarded onto NSO",
    "type": "object",
    "required": [],
    "properties": {
      "deviceS": {
        "type": "array",
        "title": "Device(s)",
        "description": "",
        "minItems": 1,
        "items": {
          "type": "object",
          "required": [
            "nsoInstance",
            "name",
            "address",
            "port",
            "authgroup",
            "deviceType",
            "nedId"
          ],
          "properties": {
            "nsoInstance": {
              "type": "string",
              "title": "NSO Instance",
              "_id": "/properties/deviceS/items/properties/nsoInstance",
              "description": "",
              "enum": []
            },
            "name": {
              "type": "string",
              "title": "name",
              "_id": "/properties/deviceS/items/properties/name",
              "description": ""
            },
            "address": {
              "type": "string",
              "title": "address",
              "_id": "/properties/deviceS/items/properties/address",
              "description": ""
            },
            "port": {
              "type": "string",
              "title": "port",
              "_id": "/properties/deviceS/items/properties/port",
              "description": "",
              "pattern": "^[0-9]+$"
            },
            "authgroup": {
              "type": "string",
              "title": "authgroup",
              "_id": "/properties/deviceS/items/properties/authgroup",
              "description": ""
            },
            "deviceType": {
              "type": "string",
              "title": "device-type",
              "_id": "/properties/deviceS/items/properties/deviceType",
              "description": "",
              "enum": [
                "cli"
              ]
            },
            "nedId": {
              "type": "string",
              "title": "ned-id",
              "_id": "/properties/deviceS/items/properties/nedId",
              "description": ""
            },
            "adminState": {
              "type": "string",
              "title": "admin-state",
              "_id": "/properties/deviceS/items/properties/adminState",
              "description": "",
              "enum": [
                "config-locked",
                "locked",
                "southbound-locked",
                "unlocked"
              ]
            },
            "protocol": {
              "type": "string",
              "title": "protocol",
              "_id": "/properties/deviceS/items/properties/protocol",
              "description": "",
              "enum": [
                "ssh"
              ]
            }
          }
        }
      },
      "autoApprove": {
        "type": "boolean",
        "title": "Auto Approve",
        "_id": "/properties/autoApprove",
        "description": "Auto Approve Flag",
        "default": false,
        "enum": [
          true,
          false
        ]
      }
    }
  },
  "struct": {
    "nodeId": "d4a84677-01c5-44aa-9554-95d7c08439a3",
    "type": "array",
    "items": [
      {
        "nodeId": "b7dd49e0-042a-4117-80bd-c8a268b989a0",
        "type": "array",
        "description": "",
        "items": [
          {
            "nodeId": "d22bc099-53ab-4363-a28f-912b49c6fc69",
            "type": "string",
            "title": "NSO Instance",
            "description": "",
            "placeholder": "",
            "required": true,
            "enum": [],
            "binding": true,
            "rel": "collection",
            "targetPointer": "/enum",
            "method": "GET",
            "base": "/adapters",
            "href": "/brokers/mapping",
            "sourcePointer": "/device",
            "sourceKeyPointer": "/"
          },
          {
            "nodeId": "f802cd9c-d639-4c59-b7ce-ff6a6209dbec",
            "type": "string",
            "title": "name",
            "description": "",
            "placeholder": "",
            "required": true
          },
          {
            "nodeId": "1b9e54d4-9fc5-4c0a-befc-05456312bff7",
            "type": "string",
            "title": "address",
            "description": "",
            "placeholder": "",
            "required": true
          },
          {
            "nodeId": "289cc989-ff9d-444b-a4a9-89d5371aa323",
            "type": "string",
            "title": "port",
            "description": "",
            "placeholder": "",
            "required": true,
            "pattern": "^[0-9]+$"
          },
          {
            "nodeId": "328e24e9-e8ab-4948-9f1a-46bc68e90d9e",
            "type": "string",
            "title": "authgroup",
            "description": "",
            "placeholder": "",
            "required": true
          },
          {
            "nodeId": "5a3af07d-d4bb-4f17-92c2-ebe7ec3fccbc",
            "type": "string",
            "title": "device-type",
            "description": "",
            "placeholder": "",
            "required": true,
            "enum": [
              {
                "id": "577dd08f-27c8-4f75-87a2-3674240347fa",
                "value": "cli"
              }
            ],
            "binding": false,
            "rel": "collection",
            "targetPointer": "/enum"
          },
          {
            "nodeId": "43021d76-4456-4c1f-adf3-8fbd71e60f94",
            "type": "string",
            "title": "ned-id",
            "description": "",
            "placeholder": "",
            "required": true,
            "binding": true,
            "rel": "collection",
            "targetPointer": "/enum",
            "method": "GET",
            "base": "/",
            "href": "/nso_manager/allNeds",
            "sourcePointer": "/",
            "sourceKeyPointer": "/"
          },
          {
            "nodeId": "51d2d6ab-5ad5-41a6-9f64-f83e49878f09",
            "type": "string",
            "title": "admin-state",
            "description": "",
            "placeholder": "",
            "required": false,
            "enum": [
              {
                "id": "82a6990c-de0c-4063-a9b3-1591691cbe3e",
                "value": "config-locked"
              },
              {
                "id": "ff076d42-c41c-4963-9063-5fef45609d60",
                "value": "locked"
              },
              {
                "id": "77bca6ad-682f-42e0-bf8d-05c93824a54e",
                "value": "southbound-locked"
              },
              {
                "id": "5cb74d1c-3cda-472a-8255-21bcb7aa3869",
                "value": "unlocked"
              }
            ],
            "binding": false,
            "rel": "collection",
            "targetPointer": "/enum"
          },
          {
            "nodeId": "d93de4bd-52f1-4c3e-b2d0-337964bb25dc",
            "type": "string",
            "title": "protocol",
            "description": "",
            "placeholder": "",
            "required": false,
            "enum": [
              {
                "id": "ae2c570b-5ad1-435a-b662-c34520457e8e",
                "value": "ssh"
              }
            ],
            "binding": false,
            "rel": "collection",
            "targetPointer": "/enum"
          }
        ],
        "title": "Device(s)",
        "minItems": 1
      },
      {
        "nodeId": "fd4594df-f210-42e4-87f3-03f23c29abef",
        "type": "boolean",
        "title": "Auto Approve",
        "description": "Auto Approve Flag",
        "default": false,
        "enum": [
          {
            "id": "0405bca8-c464-4308-a51b-fdc17e849ac7",
            "value": true
          },
          {
            "id": "f44a8cad-7558-4cdd-b721-036ff7c97444",
            "value": false
          }
        ]
      }
    ]
  },
  "uiSchema": {
    "deviceS": {
      "items": {}
    }
  },
  "validationSchema": {
    "deviceS": {}
  },
  "version": "2020.1"
}