{
  "name": "NED Validator",
  "webName": "NED Validator",
  "vendor": "Cisco Systems",
  "product": "NSO",
  "osVersions": [],
  "apiVersions": [],
  "iapVersions": [
    "2021.2.x",
    "2022.1.x",
    "2023.1.x"
  ],
  "method": "",
  "type": "Workflow Project",
  "domains": [
    "Network Services"
  ],
  "tags": [
    "Configuration Management"
  ],
  "useCases": [
    "Validate Device Configuration before/after Network Changes"
  ],
  "deprecated": {
    "isDeprecated": true,
    "deprecatedOn": "2024-05-02",
    "endOfLife": "2025-05-02",
    "replacedBy": {
      "name": "Cisco - NSO",
      "webName": "Cisco NSO - Modular Workflows",
      "isProductFeature": false,
      "overview": "This Pre-Built contains modular workflows that operate when integrated with Cisco Network Services Orchestrator (NSO). Once installed teams will be able to quickly automate common manual tasks for deploying network changes over NSO, saving a significant amount of time and effort. This library can be used as modular components with other libraries and automations to build comprehensive end-to-end orchestrated workflows with Itential's low-code platform.",
      "repoLink": "https://gitlab.com/itentialopensource/pre-built-automations/cisco-nso",
      "docLink": "",
      "webLink": ""
    }
  },
  "brokerSince": "",
  "documentation": {
    "storeLink": "",
    "npmLink": "",
    "repoLink": "https://gitlab.com/itentialopensource/pre-built-automations/ned-validator",
    "docLink": "",
    "demoLinks": [],
    "trainingLinks": [],
    "faqLink": "",
    "contributeLink": "",
    "issueLink": "",
    "webLink": "https://www.itential.com/automations/ned-validator/",
    "vendorLink": "",
    "productLink": "",
    "apiLinks": [
      {
        "title": "Itential Automation Platform - NSO Adapter Overview",
        "link": "https://docs.itential.com/docs/nso-adapter-2023-1",
        "public": true
      }
    ]
  },
  "assets": [],
  "relatedItems": {
    "adapters": [
      {
        "name": "adapter-nso",
        "webName": "Cisco NSO",
        "overview": "Cisco NSO adapter",
        "isDependency": true,
        "repoLink": "",
        "docLink": "https://docs.itential.com/docs/nso-adapter-2023-1",
        "webLink": "https://www.itential.com/adapters/cisco/",
        "configurationNotes": "",
        "versions": [
          "^7.8.39-2023.1.9.0"
        ]
      }
    ],
    "integrations": [],
    "ecosystemApplications": [],
    "workflowProjects": [],
    "transformationProjects": [],
    "exampleProjects": []
  }
}
