{
  "name": "SD-WAN Meraki Claim All Devices",
  "tasks": {
    "workflow_start": {
      "name": "workflow_start",
      "groups": [],
      "x": 0.014197530864197531,
      "y": 0.46526867627785057,
      "summary": "workflow_start",
      "description": "workflow_start"
    },
    "workflow_end": {
      "name": "workflow_end",
      "groups": [],
      "x": 0.971604938271605,
      "y": 0.21363040629095675,
      "summary": "workflow_end",
      "description": "workflow_end"
    },
    "e20d": {
      "name": "forEach",
      "summary": "For Each Loop",
      "description": "Iterate over each item in an array",
      "location": "Application",
      "locationType": null,
      "app": "WorkFlowEngine",
      "displayName": "WorkFlowEngine",
      "type": "operation",
      "variables": {
        "incoming": {
          "data_array": "$var.job.networkDevice"
        },
        "outgoing": {
          "current_item": null
        },
        "error": "",
        "translations": []
      },
      "deprecated": false,
      "matched": [],
      "groups": [],
      "x": 0.477891156462585,
      "y": 0.4744429882044561,
      "scheduled": false
    },
    "9cfb": {
      "name": "childJob",
      "summary": "Run Claim Device Child Job",
      "description": "Run Claim Device Child Job",
      "location": "Application",
      "locationType": null,
      "app": "WorkFlowEngine",
      "displayName": "WorkFlowEngine",
      "type": "operation",
      "variables": {
        "incoming": {
          "task": "",
          "workflow": "SD-WAN Meraki Claim Device",
          "variables": {
            "networkDevice": {
              "variable": "",
              "task": "e20d",
              "value": "current_item"
            },
            "organizationId": {
              "variable": "",
              "task": "job",
              "editable": true,
              "value": "organizationId"
            },
            "networkId": {
              "variable": "",
              "task": "job",
              "editable": true,
              "value": "networkId"
            }
          }
        },
        "outgoing": {
          "job_details": null
        },
        "translations": []
      },
      "deprecated": false,
      "matched": [],
      "groups": [],
      "actor": "job",
      "x": 0.47716049382716047,
      "y": 0.7640891218872871
    },
    "af8d": {
      "name": "evaluation",
      "summary": "Eval Claim Device Child Job = success",
      "description": "Eval Claim Device Child Job = success",
      "location": "Application",
      "locationType": null,
      "app": "WorkFlowEngine",
      "displayName": "WorkFlowEngine",
      "type": "operation",
      "variables": {
        "incoming": {
          "all_true_flag": false,
          "evaluation_groups": [
            {
              "all_true_flag": false,
              "evaluations": [
                {
                  "query": "output.status",
                  "operand_1": {
                    "variable": "job_details",
                    "task": "9cfb"
                  },
                  "operator": "==",
                  "operand_2": {
                    "variable": "success",
                    "task": "static"
                  }
                }
              ]
            }
          ]
        },
        "outgoing": {
          "return_value": null
        },
        "translations": []
      },
      "deprecated": false,
      "matched": [],
      "groups": [],
      "x": 0.6028911564625851,
      "y": 0.7693315858453473
    },
    "68bf": {
      "name": "newVariable",
      "summary": "Create a Job Variable",
      "description": "Create a new Job variable by Job ID and assign it a value.",
      "location": "Application",
      "locationType": null,
      "app": "WorkFlowEngine",
      "displayName": "WorkFlowEngine",
      "type": "operation",
      "variables": {
        "incoming": {
          "name": "resultArray",
          "value": []
        },
        "outgoing": {
          "value": null
        },
        "translations": []
      },
      "deprecated": false,
      "matched": [],
      "groups": [],
      "x": 0.16234567901234567,
      "y": 0.47182175622542594
    },
    "20e6": {
      "name": "query",
      "summary": "Query Error Output",
      "description": "Query Error Output",
      "location": "Application",
      "locationType": null,
      "app": "WorkFlowEngine",
      "displayName": "WorkFlowEngine",
      "type": "operation",
      "variables": {
        "incoming": {
          "pass_on_null": false,
          "query": "output",
          "obj": "$var.9cfb.job_details"
        },
        "outgoing": {
          "return_data": null
        },
        "error": "",
        "translations": []
      },
      "deprecated": false,
      "matched": [],
      "groups": [],
      "x": 0.6972789115646258,
      "y": 0.7785058977719528,
      "scheduled": false
    },
    "906b": {
      "name": "arrayPush",
      "summary": "Adds error to resultArray",
      "description": "Adds error to resultArray",
      "location": "Application",
      "locationType": null,
      "app": "WorkFlowEngine",
      "displayName": "Array",
      "type": "automatic",
      "variables": {
        "incoming": {
          "arr": "$var.job.resultArray",
          "elementN": "$var.9c78.merged_object"
        },
        "outgoing": {
          "pushedArray": "$var.job.resultArray"
        },
        "error": "",
        "translations": [
          {
            "translations": [],
            "type": "*",
            "variable": "resultArray"
          }
        ]
      },
      "deprecated": false,
      "matched": [
        {
          "key": "app",
          "highlightString": "<span class='highlight-string'>Array</span>Methods"
        },
        {
          "key": "summary",
          "highlightString": "Adds an element to the end of the <span class='highlight-string'>array</span>."
        },
        {
          "key": "description",
          "highlightString": "Adds one element to the end of an <span class='highlight-string'>array</span> and returns the (newly modified) array."
        }
      ],
      "groups": [],
      "actor": "Pronghorn",
      "x": 0.95578231292517,
      "y": 0.7824377457404981,
      "scheduled": false,
      "canvasName": "push"
    },
    "60b5": {
      "name": "arrayLength",
      "summary": "Get Length errorArray",
      "description": "Get Length errorArray",
      "location": "Application",
      "locationType": null,
      "app": "WorkFlowEngine",
      "displayName": "Array",
      "type": "automatic",
      "variables": {
        "incoming": {
          "arr": "$var.job.errorArray"
        },
        "outgoing": {
          "length": null
        },
        "error": "",
        "translations": []
      },
      "deprecated": false,
      "matched": [
        {
          "key": "app",
          "highlightString": "<span class='highlight-string'>Array</span>Methods"
        },
        {
          "key": "summary",
          "highlightString": "Gets the length of an <span class='highlight-string'>array</span>."
        },
        {
          "key": "description",
          "highlightString": "Returns the number of elements in that <span class='highlight-string'>array</span>. The value is an unsigned, 32-bit integer  that is always numerically greater than the highest index in the array."
        }
      ],
      "groups": [],
      "actor": "Pronghorn",
      "x": 0.625,
      "y": 0.4783748361730013,
      "scheduled": false,
      "canvasName": "length"
    },
    "301d": {
      "name": "evaluation",
      "summary": "Eval errorArray Length = 0",
      "description": "Eval errorArray Length = 0",
      "location": "Application",
      "locationType": null,
      "app": "WorkFlowEngine",
      "displayName": "WorkFlowEngine",
      "type": "operation",
      "variables": {
        "incoming": {
          "all_true_flag": false,
          "evaluation_groups": [
            {
              "all_true_flag": false,
              "evaluations": [
                {
                  "query": "",
                  "operand_1": {
                    "variable": "length",
                    "task": "60b5"
                  },
                  "operator": "==",
                  "operand_2": {
                    "variable": 0,
                    "task": "static"
                  }
                }
              ]
            }
          ]
        },
        "outgoing": {
          "return_value": null
        },
        "translations": []
      },
      "deprecated": false,
      "matched": [],
      "groups": [],
      "x": 0.7364197530864197,
      "y": 0.5032765399737876
    },
    "9c78": {
      "name": "merge",
      "summary": "Merge Data - Order details",
      "description": "Merge Data - Order details",
      "location": "Application",
      "locationType": null,
      "app": "WorkFlowEngine",
      "displayName": "WorkFlowEngine",
      "type": "operation",
      "variables": {
        "incoming": {
          "data_to_merge": [
            {
              "key": "deviceId",
              "value": {
                "task": "e20d",
                "variable": "current_item"
              }
            },
            {
              "key": "networkId",
              "value": {
                "task": "job",
                "variable": "networkId",
                "editable": true
              }
            },
            {
              "key": "organizationId",
              "value": {
                "task": "job",
                "variable": "organizationId",
                "editable": true
              }
            },
            {
              "key": "response",
              "value": {
                "task": "20e6",
                "variable": "return_data"
              }
            },
            {
              "key": "status",
              "value": {
                "task": "static",
                "variable": "error"
              }
            }
          ]
        },
        "outgoing": {
          "merged_object": null
        },
        "translations": []
      },
      "deprecated": false,
      "matched": [],
      "groups": [],
      "x": 0.8086734693877551,
      "y": 0.7680209698558322
    },
    "c691": {
      "name": "merge",
      "summary": "Merge Data",
      "description": "Merge data into a single object",
      "location": "Application",
      "locationType": null,
      "app": "WorkFlowEngine",
      "displayName": "WorkFlowEngine",
      "type": "operation",
      "variables": {
        "incoming": {
          "data_to_merge": [
            {
              "key": "deviceId",
              "value": {
                "task": "e20d",
                "variable": "current_item"
              }
            },
            {
              "key": "response",
              "value": {
                "task": "static",
                "variable": "claimed"
              }
            },
            {
              "key": "status",
              "value": {
                "task": "static",
                "variable": "success"
              }
            }
          ]
        },
        "outgoing": {
          "merged_object": null
        },
        "translations": []
      },
      "deprecated": false,
      "matched": [],
      "groups": [],
      "x": 0.6105442176870748,
      "y": 1.0262123197903015
    },
    "6c71": {
      "name": "arrayPush",
      "summary": "Adds success to resultArray",
      "description": "Adds success to resultArray",
      "location": "Application",
      "locationType": null,
      "app": "WorkFlowEngine",
      "displayName": "Array",
      "type": "automatic",
      "variables": {
        "incoming": {
          "arr": "$var.job.resultArray",
          "elementN": "$var.c691.merged_object"
        },
        "outgoing": {
          "pushedArray": "$var.job.resultArray"
        },
        "error": "",
        "translations": [
          {
            "translations": [],
            "type": "*",
            "variable": "resultArray"
          }
        ]
      },
      "deprecated": false,
      "matched": [
        {
          "key": "app",
          "highlightString": "<span class='highlight-string'>Array</span>Methods"
        },
        {
          "key": "summary",
          "highlightString": "Adds an element to the end of the <span class='highlight-string'>array</span>."
        },
        {
          "key": "description",
          "highlightString": "Adds one element to the end of an <span class='highlight-string'>array</span> and returns the (newly modified) array."
        }
      ],
      "groups": [],
      "actor": "Pronghorn",
      "x": 0.8163265306122449,
      "y": 1.015727391874181,
      "scheduled": false,
      "canvasName": "push"
    },
    "903e": {
      "name": "newVariable",
      "summary": "Create a Job Variable",
      "description": "Create a new Job variable by Job ID and assign it a value.",
      "location": "Application",
      "locationType": null,
      "app": "WorkFlowEngine",
      "displayName": "WorkFlowEngine",
      "type": "operation",
      "variables": {
        "incoming": {
          "name": "errorArray",
          "value": []
        },
        "outgoing": {
          "value": null
        },
        "translations": []
      },
      "deprecated": false,
      "matched": [],
      "groups": [],
      "x": 0.3074074074074074,
      "y": 0.47313237221494103
    },
    "2d9e": {
      "name": "arrayPush",
      "summary": "Adds error to errorArray",
      "description": "Adds error to errorArray",
      "location": "Application",
      "locationType": null,
      "app": "WorkFlowEngine",
      "displayName": "Array",
      "type": "automatic",
      "variables": {
        "incoming": {
          "arr": "$var.job.errorArray",
          "elementN": "$var.9c78.merged_object"
        },
        "outgoing": {
          "pushedArray": "$var.job.errorArray"
        },
        "error": "",
        "translations": [
          {
            "translations": [],
            "type": "*",
            "variable": "errorArray"
          }
        ]
      },
      "deprecated": false,
      "matched": [
        {
          "key": "app",
          "highlightString": "<span class='highlight-string'>Array</span>Methods"
        },
        {
          "key": "summary",
          "highlightString": "Adds an element to the end of the <span class='highlight-string'>array</span>."
        },
        {
          "key": "description",
          "highlightString": "Adds one element to the end of an <span class='highlight-string'>array</span> and returns the (newly modified) array."
        }
      ],
      "groups": [],
      "actor": "Pronghorn",
      "x": 1.1420068027210883,
      "y": 0.7903014416775884,
      "scheduled": false,
      "canvasName": "push"
    },
    "15fa": {
      "name": "merge",
      "summary": "Merge 401 Error Data",
      "description": "Merge 401 Error Data",
      "location": "Application",
      "locationType": null,
      "app": "WorkFlowEngine",
      "displayName": "WorkFlowEngine",
      "type": "operation",
      "variables": {
        "incoming": {
          "data_to_merge": [
            {
              "key": "code",
              "value": {
                "task": "static",
                "variable": 401
              }
            },
            {
              "key": "status",
              "value": {
                "task": "static",
                "variable": "error"
              }
            },
            {
              "key": "description",
              "value": {
                "task": "static",
                "variable": "An error occurred claiming one (or more) devices."
              }
            },
            {
              "key": "errorStack",
              "value": {
                "task": "job",
                "variable": "resultArray"
              }
            }
          ]
        },
        "outgoing": {
          "merged_object": null
        },
        "translations": []
      },
      "deprecated": false,
      "matched": [
        {
          "key": "name",
          "highlightString": "<span class='highlight-string'>merge</span>"
        },
        {
          "key": "summary",
          "highlightString": "<span class='highlight-string'>Merge</span> Data"
        },
        {
          "key": "description",
          "highlightString": "<span class='highlight-string'>Merge</span> data into a single object"
        }
      ],
      "groups": [],
      "x": 0.7345679012345679,
      "y": 0.21887287024901703
    },
    "a59c": {
      "name": "newVariable",
      "summary": "Create a Job Variable",
      "description": "Create a new Job variable by Job ID and assign it a value.",
      "location": "Application",
      "locationType": null,
      "app": "WorkFlowEngine",
      "displayName": "WorkFlowEngine",
      "type": "operation",
      "variables": {
        "incoming": {
          "name": "output",
          "value": "$var.15fa.merged_object"
        },
        "outgoing": {
          "value": null
        },
        "translations": []
      },
      "deprecated": false,
      "matched": [
        {
          "key": "name",
          "highlightString": "<span class='highlight-string'>newV</span>ariable"
        }
      ],
      "groups": [],
      "x": 0.8580246913580247,
      "y": 0.21494102228047182
    },
    "c39e": {
      "name": "merge",
      "summary": "Merge 200 Success Data",
      "description": "Merge 200 Success Data",
      "location": "Application",
      "locationType": null,
      "app": "WorkFlowEngine",
      "displayName": "WorkFlowEngine",
      "type": "operation",
      "variables": {
        "incoming": {
          "data_to_merge": [
            {
              "key": "code",
              "value": {
                "task": "static",
                "variable": 200
              }
            },
            {
              "key": "status",
              "value": {
                "task": "static",
                "variable": "success"
              }
            },
            {
              "key": "description",
              "value": {
                "task": "static",
                "variable": "All devices successfully claimed"
              }
            }
          ]
        },
        "outgoing": {
          "merged_object": null
        },
        "translations": []
      },
      "deprecated": false,
      "matched": [
        {
          "key": "name",
          "highlightString": "<span class='highlight-string'>merge</span>"
        },
        {
          "key": "summary",
          "highlightString": "<span class='highlight-string'>Merge</span> Data"
        },
        {
          "key": "description",
          "highlightString": "<span class='highlight-string'>Merge</span> data into a single object"
        }
      ],
      "groups": [],
      "x": 0.8462962962962963,
      "y": 0.5006553079947575
    },
    "e861": {
      "name": "newVariable",
      "summary": "Create a Job Variable",
      "description": "Create a new Job variable by Job ID and assign it a value.",
      "location": "Application",
      "locationType": null,
      "app": "WorkFlowEngine",
      "displayName": "WorkFlowEngine",
      "type": "operation",
      "variables": {
        "incoming": {
          "name": "output",
          "value": "$var.c39e.merged_object"
        },
        "outgoing": {
          "value": null
        },
        "translations": []
      },
      "deprecated": false,
      "matched": [
        {
          "key": "name",
          "highlightString": "<span class='highlight-string'>newV</span>ariable"
        }
      ],
      "groups": [],
      "x": 0.9728395061728395,
      "y": 0.5006553079947575
    }
  },
  "transitions": {
    "workflow_start": {
      "68bf": {
        "type": "standard",
        "state": "success"
      }
    },
    "workflow_end": {},
    "e20d": {
      "9cfb": {
        "type": "standard",
        "state": "loop"
      },
      "60b5": {
        "type": "standard",
        "state": "success"
      }
    },
    "9cfb": {
      "af8d": {
        "type": "standard",
        "state": "success"
      }
    },
    "af8d": {
      "20e6": {
        "type": "standard",
        "state": "failure"
      },
      "c691": {
        "type": "standard",
        "state": "success"
      }
    },
    "68bf": {
      "903e": {
        "type": "standard",
        "state": "success"
      }
    },
    "20e6": {
      "9c78": {
        "type": "standard",
        "state": "success"
      }
    },
    "906b": {
      "2d9e": {
        "type": "standard",
        "state": "success"
      }
    },
    "60b5": {
      "301d": {
        "type": "standard",
        "state": "success"
      }
    },
    "301d": {
      "15fa": {
        "type": "standard",
        "state": "failure"
      },
      "c39e": {
        "type": "standard",
        "state": "success"
      }
    },
    "9c78": {
      "906b": {
        "type": "standard",
        "state": "success"
      }
    },
    "c691": {
      "6c71": {
        "type": "standard",
        "state": "success"
      }
    },
    "6c71": {},
    "903e": {
      "e20d": {
        "type": "standard",
        "state": "success"
      }
    },
    "2d9e": {},
    "32b8": {},
    "15fa": {
      "a59c": {
        "type": "standard",
        "state": "success"
      }
    },
    "a59c": {
      "workflow_end": {
        "type": "standard",
        "state": "success"
      }
    },
    "c39e": {
      "e861": {
        "type": "standard",
        "state": "success"
      }
    },
    "e861": {
      "workflow_end": {
        "type": "standard",
        "state": "success"
      }
    }
  },
  "font_size": 12,
  "created": "2020-01-10T12:50:51.492Z",
  "created_by": {
    "provenance": "Local AAA",
    "username": "Itential Artifacts",
    "firstname": "admin",
    "inactive": false,
    "email": ""
  },
  "createdVersion": "4.5.3-2019.2.9.0",
  "groups": [],
  "last_updated": "2020-02-25T15:37:18.720Z",
  "last_updated_by": {
    "provenance": "Local AAA",
    "username": "Itential Artifacts",
    "firstname": "admin",
    "inactive": false,
    "email": ""
  },
  "lastUpdatedVersion": "5.5.9-2019.3.0.0",
  "type": "automation",
  "description": null,
  "tags": []
}