{
  "name": "Kafka Producer",
  "tasks": {
    "4905": {
      "name": "newVariable",
      "canvasName": "newVariable",
      "summary": "Create a Job Variable",
      "description": "Create a new Job variable by Job ID and assign it a value.",
      "location": "Application",
      "locationType": null,
      "app": "WorkFlowEngine",
      "type": "operation",
      "displayName": "WorkFlowEngine",
      "variables": {
        "incoming": {
          "name": "KafkaStatus",
          "value": "Failure"
        },
        "outgoing": {
          "value": null
        }
      },
      "deprecated": false,
      "matched": [
        {
          "key": "summary",
          "highlightString": "Create a <span class='highlight-string'>Job</span> <span class='highlight-string'>Variable</span>"
        },
        {
          "key": "description",
          "highlightString": "Create a new <span class='highlight-string'>Job</span> <span class='highlight-string'>variable</span> by Job ID and assign it a value."
        },
        {
          "key": "canvasName",
          "highlightString": "new<span class='highlight-string'>Variable</span>"
        }
      ],
      "groups": [],
      "x": 1.3834645669291339,
      "y": 0.789405684754522
    },
    "9093": {
      "name": "newVariable",
      "canvasName": "newVariable",
      "summary": "Create a Job Variable",
      "description": "Create a new Job variable by Job ID and assign it a value.",
      "location": "Application",
      "locationType": null,
      "app": "WorkFlowEngine",
      "type": "operation",
      "displayName": "WorkFlowEngine",
      "variables": {
        "incoming": {
          "name": "responseBody",
          "value": "$var.job.KafkaError"
        },
        "outgoing": {
          "value": null
        }
      },
      "deprecated": false,
      "matched": [
        {
          "key": "summary",
          "highlightString": "Create a <span class='highlight-string'>Job</span> <span class='highlight-string'>Variable</span>"
        },
        {
          "key": "description",
          "highlightString": "Create a new <span class='highlight-string'>Job</span> <span class='highlight-string'>variable</span> by Job ID and assign it a value."
        },
        {
          "key": "canvasName",
          "highlightString": "new<span class='highlight-string'>Variable</span>"
        }
      ],
      "groups": [],
      "x": 1.241732283464567,
      "y": 0.9987080103359173
    },
    "workflow_start": {
      "name": "workflow_start",
      "groups": [],
      "x": 0.647244094488189,
      "y": 0.5581395348837209
    },
    "workflow_end": {
      "name": "workflow_end",
      "groups": [],
      "x": 1.999212598425197,
      "y": 0.5542635658914729
    },
    "157a": {
      "name": "evaluation",
      "canvasName": "evaluation",
      "summary": "Evaluate KAFKA response",
      "description": "Evaluate KAFKA response",
      "location": "Application",
      "locationType": null,
      "app": "WorkFlowEngine",
      "type": "operation",
      "displayName": "WorkFlowEngine",
      "variables": {
        "incoming": {
          "all_true_flag": false,
          "evaluation_groups": [
            {
              "all_true_flag": false,
              "evaluations": [
                {
                  "query": "status",
                  "operand_1": {
                    "variable": "KafkaResponse",
                    "task": "job"
                  },
                  "operator": "contains",
                  "operand_2": {
                    "variable": "success",
                    "task": "static"
                  }
                }
              ]
            }
          ]
        },
        "outgoing": {
          "return_value": null
        }
      },
      "deprecated": false,
      "matched": [
        {
          "key": "canvasName",
          "highlightString": "<span class='highlight-string'>eval</span>uation"
        },
        {
          "key": "summary",
          "highlightString": "Run <span class='highlight-string'>Eval</span>uation Task"
        },
        {
          "key": "description",
          "highlightString": "Run an <span class='highlight-string'>eval</span>uation"
        }
      ],
      "groups": [],
      "x": 1.3795275590551181,
      "y": 0.5478036175710594
    },
    "47a3": {
      "name": "sendMessage",
      "canvasName": "sendMessage",
      "summary": "send message",
      "description": "send message",
      "location": "Adapter",
      "locationType": "Kafka",
      "app": "Kafka",
      "type": "automatic",
      "displayName": "Kafka",
      "variables": {
        "incoming": {
          "payloads": "$var.job.messagesArr",
          "adapter_id": "$var.job.adapter_id"
        },
        "outgoing": {
          "result": "$var.job.KafkaResponse"
        },
        "error": "$var.job.KafkaError"
      },
      "deprecated": false,
      "matched": [
        {
          "key": "displayName",
          "highlightString": "<span class='highlight-string'>Kafka</span>"
        }
      ],
      "groups": [],
      "actor": "Pronghorn",
      "x": 1.24251968503937,
      "y": 0.5503875968992248,
      "scheduled": false
    },
    "4d85": {
      "name": "newVariable",
      "canvasName": "newVariable",
      "summary": "Create a Job Variable",
      "description": "Create a new Job variable by Job ID and assign it a value.",
      "location": "Application",
      "locationType": null,
      "app": "WorkFlowEngine",
      "type": "operation",
      "displayName": "WorkFlowEngine",
      "variables": {
        "incoming": {
          "name": "responseBody",
          "value": "$var.job.KafkaResponse"
        },
        "outgoing": {
          "value": null
        }
      },
      "deprecated": false,
      "matched": [
        {
          "key": "summary",
          "highlightString": "Create a <span class='highlight-string'>Job</span> <span class='highlight-string'>Variable</span>"
        },
        {
          "key": "description",
          "highlightString": "Create a new <span class='highlight-string'>Job</span> <span class='highlight-string'>variable</span> by Job ID and assign it a value."
        },
        {
          "key": "canvasName",
          "highlightString": "new<span class='highlight-string'>Variable</span>"
        }
      ],
      "groups": [],
      "x": 1.6653543307086613,
      "y": 0.5633074935400517
    },
    "44ff": {
      "name": "newVariable",
      "canvasName": "newVariable",
      "summary": "Create a Job Variable",
      "description": "Create a new Job variable by Job ID and assign it a value.",
      "location": "Application",
      "locationType": null,
      "app": "WorkFlowEngine",
      "type": "operation",
      "displayName": "WorkFlowEngine",
      "variables": {
        "incoming": {
          "name": "KafkaStatus",
          "value": "Failure"
        },
        "outgoing": {
          "value": null
        }
      },
      "deprecated": false,
      "matched": [
        {
          "key": "summary",
          "highlightString": "Create a <span class='highlight-string'>Job</span> <span class='highlight-string'>Variable</span>"
        },
        {
          "key": "description",
          "highlightString": "Create a new <span class='highlight-string'>Job</span> <span class='highlight-string'>variable</span> by Job ID and assign it a value."
        },
        {
          "key": "canvasName",
          "highlightString": "new<span class='highlight-string'>Variable</span>"
        }
      ],
      "groups": [],
      "x": 1.5858267716535432,
      "y": 0.9961240310077519
    },
    "a5b1": {
      "name": "newVariable",
      "canvasName": "newVariable",
      "summary": "Create a Job Variable",
      "description": "Create a new Job variable by Job ID and assign it a value.",
      "location": "Application",
      "locationType": null,
      "app": "WorkFlowEngine",
      "type": "operation",
      "displayName": "WorkFlowEngine",
      "variables": {
        "incoming": {
          "name": "messagesArr",
          "value": []
        },
        "outgoing": {
          "value": null
        }
      },
      "deprecated": false,
      "matched": [
        {
          "key": "summary",
          "highlightString": "Create a <span class='highlight-string'>Job</span> <span class='highlight-string'>Variable</span>"
        },
        {
          "key": "description",
          "highlightString": "Create a new <span class='highlight-string'>Job</span> <span class='highlight-string'>variable</span> by Job ID and assign it a value."
        },
        {
          "key": "canvasName",
          "highlightString": "new<span class='highlight-string'>Variable</span>"
        }
      ],
      "groups": [],
      "x": 0.7850393700787401,
      "y": 0.5531034482758621
    },
    "6d5b": {
      "name": "merge",
      "canvasName": "merge",
      "summary": "Kafka payload obj",
      "description": "Kafka payload obj",
      "location": "Application",
      "locationType": null,
      "app": "WorkFlowEngine",
      "type": "operation",
      "displayName": "WorkFlowEngine",
      "variables": {
        "incoming": {
          "data_to_merge": [
            {
              "key": "topic",
              "value": {
                "task": "job",
                "variable": "topic",
                "editable": true
              }
            },
            {
              "key": "messages",
              "value": {
                "task": "job",
                "variable": "messages",
                "editable": true
              }
            }
          ]
        },
        "outgoing": {
          "merged_object": null
        }
      },
      "deprecated": false,
      "matched": [
        {
          "key": "canvasName",
          "highlightString": "<span class='highlight-string'>merge</span>"
        },
        {
          "key": "summary",
          "highlightString": "<span class='highlight-string'>Merge</span> Data"
        },
        {
          "key": "description",
          "highlightString": "<span class='highlight-string'>Merge</span> data into a single object"
        }
      ],
      "groups": [],
      "x": 0.925984251968504,
      "y": 0.5586206896551724
    },
    "376e": {
      "name": "push",
      "canvasName": "push",
      "summary": "Push Item to Array",
      "description": "Push item to a job variable array",
      "location": "Application",
      "locationType": null,
      "app": "WorkFlowEngine",
      "type": "operation",
      "displayName": "WorkFlowEngine",
      "variables": {
        "incoming": {
          "job_variable": "messagesArr",
          "item_to_push": "$var.6d5b.merged_object"
        },
        "outgoing": {
          "job_variable_value": null
        }
      },
      "deprecated": false,
      "matched": [
        {
          "key": "canvasName",
          "highlightString": "<span class='highlight-string'>push</span>"
        },
        {
          "key": "summary",
          "highlightString": "<span class='highlight-string'>Push</span> Item to Array"
        },
        {
          "key": "description",
          "highlightString": "<span class='highlight-string'>Push</span> item to a job variable array"
        }
      ],
      "groups": [],
      "x": 1.0645669291338582,
      "y": 0.5581395348837209
    },
    "210b": {
      "name": "newVariable",
      "canvasName": "newVariable",
      "summary": "Create a Job Variable",
      "description": "Create a new Job variable by Job ID and assign it a value.",
      "location": "Application",
      "locationType": null,
      "app": "WorkFlowEngine",
      "type": "operation",
      "displayName": "WorkFlowEngine",
      "variables": {
        "incoming": {
          "name": "KafkaStatus",
          "value": "Success"
        },
        "outgoing": {
          "value": null
        }
      },
      "deprecated": false,
      "matched": [
        {
          "key": "summary",
          "highlightString": "Create a <span class='highlight-string'>Job</span> <span class='highlight-string'>Variable</span>"
        },
        {
          "key": "description",
          "highlightString": "Create a new <span class='highlight-string'>Job</span> <span class='highlight-string'>variable</span> by Job ID and assign it a value."
        },
        {
          "key": "canvasName",
          "highlightString": "new<span class='highlight-string'>Variable</span>"
        }
      ],
      "groups": [],
      "x": 1.505511811023622,
      "y": 0.5542635658914729
    },
    "d1cf": {
      "name": "evaluation",
      "canvasName": "evaluation",
      "summary": "Zero-Touch?",
      "description": "Zero-Touch?",
      "location": "Application",
      "locationType": null,
      "app": "WorkFlowEngine",
      "type": "operation",
      "displayName": "WorkFlowEngine",
      "variables": {
        "incoming": {
          "all_true_flag": false,
          "evaluation_groups": [
            {
              "all_true_flag": false,
              "evaluations": [
                {
                  "query": "",
                  "operand_1": {
                    "variable": "Zero-Touch",
                    "task": "job",
                    "editable": true
                  },
                  "operator": "==",
                  "operand_2": {
                    "variable": true,
                    "task": "static"
                  }
                }
              ]
            }
          ]
        },
        "outgoing": {
          "return_value": null
        }
      },
      "deprecated": false,
      "matched": [
        {
          "key": "canvasName",
          "highlightString": "<span class='highlight-string'>eval</span>uation"
        },
        {
          "key": "summary",
          "highlightString": "Run <span class='highlight-string'>Eval</span>uation Task"
        },
        {
          "key": "description",
          "highlightString": "Run an <span class='highlight-string'>eval</span>uation"
        }
      ],
      "groups": [],
      "x": 1.7677165354330708,
      "y": 0.5594315245478036
    },
    "d26c": {
      "name": "ViewData",
      "canvasName": "ViewData",
      "summary": "View Data",
      "description": "View data in a pretty format",
      "location": "Application",
      "app": "WorkFlowEngine",
      "displayName": "Tools",
      "type": "manual",
      "variables": {
        "incoming": {
          "header": "Kafka Status",
          "message": "$var.job.KafkaStatus",
          "body": "$var.job.responseBody",
          "btn_success": "Done",
          "btn_failure": ""
        },
        "outgoing": {},
        "error": ""
      },
      "view": "/workflow_engine/task/ViewData",
      "deprecated": false,
      "matched": [
        {
          "key": "canvasName",
          "highlightString": "<span class='highlight-string'>View</span><span class='highlight-string'>Data</span>"
        },
        {
          "key": "summary",
          "highlightString": "<span class='highlight-string'>View</span> <span class='highlight-string'>Data</span>"
        },
        {
          "key": "description",
          "highlightString": "<span class='highlight-string'>View</span> <span class='highlight-string'>data</span> in a pretty format"
        }
      ],
      "groups": [],
      "x": 1.873228346456693,
      "y": 0.43669250645994834,
      "scheduled": false
    }
  },
  "transitions": {
    "3": {},
    "1216": {},
    "4905": {
      "4d85": {
        "type": "standard",
        "state": "success"
      }
    },
    "6725": {},
    "9093": {
      "44ff": {
        "type": "standard",
        "state": "success"
      }
    },
    "workflow_start": {
      "a5b1": {
        "type": "standard",
        "state": "success"
      }
    },
    "workflow_end": {},
    "15ee": {},
    "5fb5": {},
    "157a": {
      "4905": {
        "type": "standard",
        "state": "failure"
      },
      "210b": {
        "type": "standard",
        "state": "success"
      }
    },
    "47a3": {
      "9093": {
        "type": "standard",
        "state": "error"
      },
      "157a": {
        "type": "standard",
        "state": "success"
      }
    },
    "4d85": {
      "d1cf": {
        "type": "standard",
        "state": "success"
      }
    },
    "c0b9": {},
    "f914": {},
    "e98a": {},
    "540c": {},
    "b0d0": {},
    "367e": {},
    "44ff": {
      "d1cf": {
        "type": "standard",
        "state": "success"
      }
    },
    "a5b1": {
      "6d5b": {
        "type": "standard",
        "state": "success"
      }
    },
    "6d5b": {
      "376e": {
        "type": "standard",
        "state": "success"
      }
    },
    "376e": {
      "47a3": {
        "type": "standard",
        "state": "success"
      }
    },
    "210b": {
      "4d85": {
        "type": "standard",
        "state": "success"
      }
    },
    "d1cf": {
      "workflow_end": {
        "type": "standard",
        "state": "success"
      },
      "d26c": {
        "type": "standard",
        "state": "failure"
      }
    },
    "3d64": {},
    "d26c": {
      "workflow_end": {
        "type": "standard",
        "state": "success"
      }
    }
  },
  "font_size": 12,
  "created": "2020-07-29T20:12:12.739Z",
  "created_by": {
    "provenance": "Local AAA",
    "username": "admin@pronghorn",
    "firstname": "admin",
    "inactive": true,
    "email": ""
  },
  "createdVersion": "5.10.4-2020.1.13.0",
  "groups": [],
  "last_updated": "2021-01-29T16:48:13.497Z",
  "last_updated_by": {
    "provenance": "local_aaa",
    "username": "admin@pronghorn",
    "firstname": "admin",
    "inactive": false,
    "email": "rahul.chakraborty@itential.com"
  },
  "lastUpdatedVersion": "5.29.14-2020.2.7.0",
  "type": "automation",
  "description": null,
  "tags": [],
  "inputSchema": {
    "type": "object",
    "properties": {
      "adapter_id": {
        "type": [
          "array",
          "boolean",
          "null",
          "number",
          "object",
          "string"
        ]
      },
      "topic": {
        "type": [
          "array",
          "boolean",
          "null",
          "number",
          "object",
          "string"
        ]
      },
      "messages": {
        "type": [
          "array",
          "boolean",
          "null",
          "number",
          "object",
          "string"
        ]
      },
      "Zero-Touch": {
        "type": [
          "array",
          "boolean",
          "null",
          "number",
          "object",
          "string"
        ]
      }
    },
    "required": [
      "adapter_id",
      "topic",
      "messages",
      "Zero-Touch"
    ]
  },
  "outputSchema": {
    "type": "object",
    "properties": {
      "adapter_id": {
        "type": [
          "array",
          "boolean",
          "null",
          "number",
          "object",
          "string"
        ]
      },
      "topic": {
        "type": [
          "array",
          "boolean",
          "null",
          "number",
          "object",
          "string"
        ]
      },
      "messages": {
        "type": [
          "array",
          "boolean",
          "null",
          "number",
          "object",
          "string"
        ]
      },
      "Zero-Touch": {
        "type": [
          "array",
          "boolean",
          "null",
          "number",
          "object",
          "string"
        ]
      },
      "_id": {
        "type": "string",
        "pattern": "^[0-9a-f]{24}$"
      },
      "initiator": {
        "type": "string"
      },
      "KafkaStatus": {
        "type": "string"
      },
      "responseBody": {
        "type": [
          "array",
          "boolean",
          "null",
          "number",
          "object",
          "string"
        ]
      },
      "KafkaError": {
        "type": [
          "array",
          "boolean",
          "null",
          "number",
          "object",
          "string"
        ]
      },
      "KafkaResponse": {
        "type": "object"
      },
      "messagesArr": {
        "type": [
          "array",
          "boolean",
          "null",
          "number",
          "object",
          "string"
        ]
      }
    }
  }
}
