{
  "_id": "5fa1dfeb1c8903b17bbc1f90",
  "name": "Kafka Consumer",
  "description": "",
  "incoming": [
    {
      "$id": "input",
      "type": "object",
      "properties": {
        "zeroTouch": {
          "type": "boolean",
          "examples": [
            true,
            false
          ]
        },
        "kafkaAdapterId": {
          "type": "string",
          "examples": [
            "Kafka"
          ]
        },
        "topic": {
          "type": "string",
          "examples": [
            "sample1"
          ]
        },
        "partitionNumber": {
          "type": "integer",
          "examples": [
            0
          ]
        },
        "offset": {
          "type": "integer",
          "examples": [
            0
          ]
        },
        "schema": {
          "type": "string",
          "examples": [
            "hello",
            "\"key\": \"value\""
          ]
        }
      },
      "required": []
    }
  ],
  "outgoing": [
    {
      "$id": "zeroTouch",
      "type": "boolean",
      "examples": [
        true,
        false
      ]
    },
    {
      "$id": "adapter_id",
      "type": "string",
      "examples": [
        "Kafka"
      ]
    },
    {
      "$id": "topic",
      "type": "string",
      "examples": [
        "topic_name"
      ]
    },
    {
      "$id": "partition",
      "type": "integer",
      "examples": [
        1
      ]
    },
    {
      "$id": "offset",
      "type": "integer",
      "examples": [
        1
      ]
    },
    {
      "$id": "schema",
      "type": "string",
      "examples": [
        "\"key\": \"value\""
      ]
    }
  ],
  "steps": [
    {
      "id": 1,
      "type": "assign",
      "from": {
        "location": "incoming",
        "name": "input",
        "ptr": "/kafkaAdapterId"
      },
      "to": {
        "location": "outgoing",
        "name": "adapter_id",
        "ptr": ""
      }
    },
    {
      "id": 2,
      "type": "assign",
      "from": {
        "location": "incoming",
        "name": "input",
        "ptr": "/zeroTouch"
      },
      "to": {
        "location": "outgoing",
        "name": "zeroTouch",
        "ptr": ""
      }
    },
    {
      "id": 3,
      "type": "assign",
      "from": {
        "location": "incoming",
        "name": "input",
        "ptr": "/topic"
      },
      "to": {
        "location": "outgoing",
        "name": "topic",
        "ptr": ""
      }
    },
    {
      "id": 4,
      "type": "assign",
      "from": {
        "location": "incoming",
        "name": "input",
        "ptr": "/partitionNumber"
      },
      "to": {
        "location": "outgoing",
        "name": "partition",
        "ptr": ""
      }
    },
    {
      "id": 5,
      "type": "assign",
      "from": {
        "location": "incoming",
        "name": "input",
        "ptr": "/offset"
      },
      "to": {
        "location": "outgoing",
        "name": "offset",
        "ptr": ""
      }
    },
    {
      "id": 6,
      "type": "method",
      "library": "JSON",
      "method": "parse",
      "args": [
        null,
        null
      ],
      "view": {
        "row": 3,
        "col": 1
      }
    },
    {
      "id": 7,
      "type": "assign",
      "from": {
        "location": "incoming",
        "name": "input",
        "ptr": "/schema"
      },
      "to": {
        "location": "method",
        "name": 6,
        "ptr": "/args/0/value"
      }
    },
    {
      "id": 8,
      "type": "assign",
      "from": {
        "location": "method",
        "name": 6,
        "ptr": "/return"
      },
      "to": {
        "location": "outgoing",
        "name": "schema",
        "ptr": ""
      }
    }
  ],
  "functions": [],
  "view": {
    "col": 1,
    "row": 5
  },
  "created": "2020-11-03T22:55:39.795Z",
  "createdBy": {
    "_id": "5fa1a84f86171e3df42645e1",
    "provenance": "Local AAA",
    "username": "admin@pronghorn"
  },
  "lastUpdated": "2020-11-11T15:58:09.981Z",
  "lastUpdatedBy": {
    "_id": "5fa1a84f86171e3df42645e1",
    "provenance": "Local AAA",
    "username": "admin@pronghorn"
  }
}