{
  "_id": "5ffc84069bc9347a490356b5",
  "name": "JiraIssueCreation",
  "description": "",
  "incoming": [
    {
      "$id": "formData",
      "type": "object",
      "properties": {
        "projectKey": {
          "type": "string",
          "examples": [
            "Se"
          ]
        },
        "description": {
          "type": "string",
          "examples": [
            "testing"
          ]
        },
        "summary": {
          "type": "string",
          "examples": [
            "IAP Test"
          ]
        },
        "issueType": {
          "type": "string",
          "examples": [
            "Task"
          ]
        },
        "priority": {
          "type": "string",
          "examples": [
            "Lowest"
          ]
        },
        "label": {
          "type": "string",
          "examples": [
            "POZ"
          ]
        }
      },
      "required": []
    }
  ],
  "outgoing": [
    {
      "$id": "jiraPayload",
      "type": "object",
      "properties": {
        "fields": {
          "type": "object",
          "properties": {
            "project": {
              "type": "object",
              "properties": {
                "key": {
                  "type": "string",
                  "examples": [
                    "SEDEMO"
                  ]
                }
              },
              "required": []
            },
            "summary": {
              "type": "string",
              "examples": [
                "Network Deployment for branch network"
              ]
            },
            "description": {
              "type": "string",
              "examples": [
                "Device Onboarding request from IAP\nhttps://demo-iap.itential.io/workflow_engine/job?job_id=2e3b21275fa04c569bbb2069\nhttps://dev102605.service-now.com/nav_to.do?uri=change_request.do?sysparm_query=number=CHG0030297"
              ]
            },
            "issuetype": {
              "type": "object",
              "properties": {
                "name": {
                  "type": "string",
                  "examples": [
                    "Task"
                  ]
                }
              },
              "required": []
            },
            "labels": {
              "type": "array",
              "items": {
                "type": "string",
                "examples": [
                  "POC"
                ]
              }
            },
            "priority": {
              "type": "object",
              "properties": {
                "name": {
                  "type": "string",
                  "examples": [
                    "Low"
                  ]
                }
              },
              "required": []
            }
          },
          "required": []
        }
      },
      "required": []
    }
  ],
  "steps": [
    {
      "id": 1,
      "type": "assign",
      "from": {
        "location": "incoming",
        "name": "formData",
        "ptr": "/projectKey"
      },
      "to": {
        "location": "outgoing",
        "name": "jiraPayload",
        "ptr": "/fields/project/key"
      }
    },
    {
      "id": 2,
      "type": "assign",
      "from": {
        "location": "incoming",
        "name": "formData",
        "ptr": "/summary"
      },
      "to": {
        "location": "outgoing",
        "name": "jiraPayload",
        "ptr": "/fields/summary"
      }
    },
    {
      "id": 3,
      "type": "assign",
      "from": {
        "location": "incoming",
        "name": "formData",
        "ptr": "/description"
      },
      "to": {
        "location": "outgoing",
        "name": "jiraPayload",
        "ptr": "/fields/description"
      }
    },
    {
      "id": 4,
      "type": "assign",
      "from": {
        "location": "incoming",
        "name": "formData",
        "ptr": "/issueType"
      },
      "to": {
        "location": "outgoing",
        "name": "jiraPayload",
        "ptr": "/fields/issuetype/name"
      }
    },
    {
      "id": 5,
      "type": "assign",
      "from": {
        "location": "incoming",
        "name": "formData",
        "ptr": "/priority"
      },
      "to": {
        "location": "outgoing",
        "name": "jiraPayload",
        "ptr": "/fields/priority/name"
      }
    },
    {
      "id": 6,
      "type": "declaration",
      "library": "Array",
      "method": "new Array",
      "args": [
        null
      ],
      "view": {
        "row": 2,
        "col": 1
      },
      "polymorphIndex": 0
    },
    {
      "id": 7,
      "type": "assign",
      "from": {
        "location": "incoming",
        "name": "formData",
        "ptr": "/label"
      },
      "to": {
        "location": "declaration",
        "name": 6,
        "ptr": "/args/0/value"
      }
    },
    {
      "id": 8,
      "type": "assign",
      "from": {
        "location": "declaration",
        "name": 6,
        "ptr": "/return"
      },
      "to": {
        "location": "outgoing",
        "name": "jiraPayload",
        "ptr": "/fields/labels"
      }
    }
  ],
  "functions": [],
  "view": {
    "col": 3,
    "row": 5
  },
  "created": "2021-01-11T16:59:50.054Z",
  "createdBy": {
    "_id": "5fd0f140d662ab4e4881f056",
    "provenance": "LDAP Server",
    "username": "abhansali"
  },
  "lastUpdated": "2021-03-01T12:56:09.500Z",
  "lastUpdatedBy": {
    "_id": "602d779cef69f1246d5e3396",
    "provenance": "LDAP Server",
    "username": "jdollens"
  }
}