{
  "_id": "61e72684ed948b01ae67b7db",
  "name": "IP Fabric Snapshot Inventory Comparison",
  "description": "This automation compares two inventory snapshots and provides the user a diff/comparison. ",
  "componentName": "IP Fabric Snapshot Inventory Comparison",
  "componentType": "workflows",
  "gbac": {
    "write": [],
    "read": []
  },
  "created": "2022-01-18T20:43:48.225Z",
  "createdBy": "clarisa.colton@itential.com",
  "lastUpdated": "2022-01-18T20:43:48.225Z",
  "lastUpdatedBy": "clarisa.colton@itential.com",
  "triggers": [
    {
      "_id": "61e72684ed948b01ae67b7dc",
      "created": "2022-01-18T20:43:48.576Z",
      "createdBy": "clarisa.colton@itential.com",
      "lastUpdated": "2022-01-18T20:43:48.576Z",
      "lastUpdatedBy": "clarisa.colton@itential.com",
      "name": "Manual Trigger (migrated from IP Fabric Snapshot Inventory Comparison)",
      "type": "manual",
      "enabled": true,
      "actionType": "automations",
      "actionId": "61e72684ed948b01ae67b7db",
      "formId": null,
      "formData": {
        "serviceNow": true
      },
      "migrationVersion": 1
    }
  ]
}