{
  "metadata": {
    "name": "@itentialopensource/ip-fabric-snapshot-inventory-comparison",
    "version": "0.0.12",
    "description": "[Deprecated] IP Fabric Snapshot Inventory Comparison",
    "license": "Apache-2.0",
    "repository": {
      "type": "gitlab",
      "hostname": "gitlab.com",
      "path": "itentialopensource/pre-built-automations"
    },
    "keywords": [
      "Itential",
      "IAP",
      "artifacts"
    ],
    "author": "Itential Artifacts",
    "IAPDependencies": {
      "@itential/app-operations_manager": "",
      "@itential/app-workflow_engine": "",
      "@itentialopensource/adapter-ipfabric": "^0.1.0"
    },
    "gitlabId": 29432873
  },
  "manifest": {
    "bundleName": "IP Fabric Snapshot Inventory Comparison",
    "fingerprint": "61378f5432a47800ce07f5b2",
    "createdEpoch": "1631031124286",
    "artifacts": [
      {
        "id": "IP Fabric Snapshot Inventory Comparison",
        "name": "IP Fabric Snapshot Inventory Comparison",
        "type": "automation",
        "location": "/bundles/automations/IP Fabric Snapshot Inventory Comparison.json",
        "properties": {
          "entryPoint": false
        }
      },
      {
        "id": "IP Fabric Snapshot Inventory Comparison",
        "name": "IP Fabric Snapshot Inventory Comparison",
        "type": "workflow",
        "location": "/bundles/workflows/IP Fabric Snapshot Inventory Comparison.json",
        "properties": {
          "entryPoint": false
        }
      },
      {
        "id": "60d1f5de24b88d0119edef27",
        "name": "CreateInvDiffPayload",
        "type": "transformation",
        "location": "/bundles/transformations/CreateInvDiffPayload.json",
        "properties": {
          "entryPoint": false
        }
      }
    ]
  },
  "bundles": [
    {
      "type": "automation",
      "data": {
        "_id": "61e72684ed948b01ae67b7db",
        "name": "IP Fabric Snapshot Inventory Comparison",
        "description": "This automation compares two inventory snapshots and provides the user a diff/comparison. ",
        "componentName": "IP Fabric Snapshot Inventory Comparison",
        "componentType": "workflows",
        "gbac": {
          "write": [],
          "read": []
        },
        "created": "2022-01-18T20:43:48.225Z",
        "createdBy": "clarisa.colton@itential.com",
        "lastUpdated": "2022-01-18T20:43:48.225Z",
        "lastUpdatedBy": "clarisa.colton@itential.com",
        "triggers": [
          {
            "_id": "61e72684ed948b01ae67b7dc",
            "created": "2022-01-18T20:43:48.576Z",
            "createdBy": "clarisa.colton@itential.com",
            "lastUpdated": "2022-01-18T20:43:48.576Z",
            "lastUpdatedBy": "clarisa.colton@itential.com",
            "name": "Manual Trigger (migrated from IP Fabric Snapshot Inventory Comparison)",
            "type": "manual",
            "enabled": true,
            "actionType": "automations",
            "actionId": "61e72684ed948b01ae67b7db",
            "formId": null,
            "formData": {
              "serviceNow": true
            },
            "migrationVersion": 1
          }
        ]
      }
    },
    {
      "type": "workflow",
      "data": {
        "type": "automation",
        "tasks": {
          "workflow_start": {
            "name": "workflow_start",
            "groups": [],
            "x": 0.0034393809114359416,
            "y": 0.5012254901960784
          },
          "workflow_end": {
            "name": "workflow_end",
            "groups": [],
            "x": 0.6448839208942391,
            "y": 0.5269607843137255
          },
          "f056": {
            "name": "genericAdapterRequest",
            "canvasName": "genericAdapterRequest",
            "summary": "Checks Inventory Difference",
            "description": "",
            "location": "Adapter",
            "locationType": "IpFabric",
            "app": "IpFabric",
            "type": "automatic",
            "displayName": "IpFabric",
            "variables": {
              "incoming": {
                "uriPath": "tables/management/changes/devices",
                "restMethod": "POST",
                "queryData": "",
                "requestBody": "$var.83af.payload",
                "addlHeaders": "",
                "adapter_id": "IPFabric"
              },
              "outgoing": {
                "result": null
              },
              "error": ""
            },
            "deprecated": false,
            "matched": [
              {
                "key": "canvasName",
                "highlightString": "<span class='highlight-string'>generic</span>AdapterRequest"
              },
              {
                "key": "summary",
                "highlightString": "Makes the requested <span class='highlight-string'>generic</span> call"
              },
              {
                "key": "description",
                "highlightString": "Makes the requested <span class='highlight-string'>generic</span> call"
              }
            ],
            "groups": [],
            "actor": "Pronghorn",
            "x": 0.4471195184866724,
            "y": 0.5122549019607843,
            "scheduled": false
          },
          "ec60": {
            "name": "query",
            "canvasName": "query",
            "summary": "Query Removed Devices",
            "description": "Query Removed Devices",
            "location": "Application",
            "locationType": null,
            "app": "WorkFlowEngine",
            "type": "operation",
            "displayName": "WorkFlowEngine",
            "variables": {
              "incoming": {
                "pass_on_null": false,
                "query": "response.data[*status=removed]",
                "obj": "$var.f056.result"
              },
              "outgoing": {
                "return_data": "$var.job.devicesRemoved"
              },
              "error": ""
            },
            "deprecated": false,
            "matched": [
              {
                "key": "canvasName",
                "highlightString": "<span class='highlight-string'>quer</span>y"
              },
              {
                "key": "summary",
                "highlightString": "<span class='highlight-string'>Quer</span>y Data Using 'json-query' Format"
              },
              {
                "key": "description",
                "highlightString": "<span class='highlight-string'>Quer</span>y data using a dot/bracket notation string and a matching key/value pair."
              }
            ],
            "groups": [],
            "x": 0.4479793637145314,
            "y": 0.6409313725490197,
            "scheduled": false
          },
          "79a9": {
            "name": "query",
            "canvasName": "query",
            "summary": "Query Newly Added Devices",
            "description": "Query Newly Added Devices",
            "location": "Application",
            "locationType": null,
            "app": "WorkFlowEngine",
            "type": "operation",
            "displayName": "WorkFlowEngine",
            "variables": {
              "incoming": {
                "pass_on_null": false,
                "query": "response.data[*status=added]",
                "obj": "$var.f056.result"
              },
              "outgoing": {
                "return_data": "$var.job.devicesAdded"
              },
              "error": ""
            },
            "deprecated": false,
            "matched": [
              {
                "key": "canvasName",
                "highlightString": "<span class='highlight-string'>quer</span>y"
              },
              {
                "key": "summary",
                "highlightString": "<span class='highlight-string'>Quer</span>y Data Using 'json-query' Format"
              },
              {
                "key": "description",
                "highlightString": "<span class='highlight-string'>Quer</span>y data using a dot/bracket notation string and a matching key/value pair."
              }
            ],
            "groups": [],
            "x": 0.44282029234737746,
            "y": 0.3872549019607843,
            "scheduled": false
          },
          "a5": {
            "name": "postTablesInventorySites",
            "canvasName": "postTablesInventorySites",
            "summary": "Identifies Previous Inventory Snapshot",
            "description": "This task requests the second more recent inventory snapshot from IP Fabric.",
            "location": "Adapter",
            "locationType": "IpFabric",
            "app": "IpFabric",
            "type": "automatic",
            "displayName": "IpFabric",
            "variables": {
              "incoming": {
                "body": {
                  "columns": [
                    "id"
                  ],
                  "filters": {},
                  "snapshot": "$prev"
                },
                "adapter_id": "IPFabric"
              },
              "outgoing": {
                "result": null
              },
              "error": ""
            },
            "deprecated": false,
            "matched": [
              {
                "key": "canvasName",
                "highlightString": "postTablesInventory<span class='highlight-string'>Sites</span>"
              }
            ],
            "groups": [],
            "actor": "Pronghorn",
            "x": 0.16165090283748926,
            "y": 0.6446078431372549,
            "scheduled": false
          },
          "f24a": {
            "name": "postTablesInventorySites",
            "canvasName": "postTablesInventorySites",
            "summary": "Identifies Last Inventory Snapshot",
            "description": "This task requests the more recent inventory snapshot from IP Fabric.",
            "location": "Adapter",
            "locationType": "IpFabric",
            "app": "IpFabric",
            "type": "automatic",
            "displayName": "IpFabric",
            "variables": {
              "incoming": {
                "body": {
                  "columns": [
                    "id"
                  ],
                  "filters": {},
                  "snapshot": "$last"
                },
                "adapter_id": "IPFabric"
              },
              "outgoing": {
                "result": null
              },
              "error": ""
            },
            "deprecated": false,
            "matched": [
              {
                "key": "canvasName",
                "highlightString": "postTablesInventory<span class='highlight-string'>Sites</span>"
              }
            ],
            "groups": [],
            "actor": "Pronghorn",
            "x": 0.15563198624247634,
            "y": 0.3897058823529412,
            "scheduled": false
          },
          "5df2": {
            "name": "query",
            "canvasName": "query",
            "summary": "Query Second Last Snapshot ID",
            "description": "Query Second Last Snapshot ID",
            "location": "Application",
            "locationType": null,
            "app": "WorkFlowEngine",
            "type": "operation",
            "displayName": "WorkFlowEngine",
            "variables": {
              "incoming": {
                "pass_on_null": false,
                "query": "response._meta.snapshot",
                "obj": "$var.a5.result"
              },
              "outgoing": {
                "return_data": null
              },
              "error": ""
            },
            "deprecated": false,
            "matched": [
              {
                "key": "canvasName",
                "highlightString": "<span class='highlight-string'>quer</span>y"
              },
              {
                "key": "summary",
                "highlightString": "<span class='highlight-string'>Quer</span>y Data Using 'json-query' Format"
              },
              {
                "key": "description",
                "highlightString": "<span class='highlight-string'>Quer</span>y data using a dot/bracket notation string and a matching key/value pair."
              }
            ],
            "groups": [],
            "x": 0.31137254901960787,
            "y": 0.6461001164144354,
            "scheduled": false
          },
          "4cfa": {
            "name": "query",
            "canvasName": "query",
            "summary": "Query Last Snapshot ID",
            "description": "Query Last Snapshot ID",
            "location": "Application",
            "locationType": null,
            "app": "WorkFlowEngine",
            "type": "operation",
            "displayName": "WorkFlowEngine",
            "variables": {
              "incoming": {
                "pass_on_null": false,
                "query": "response._meta.snapshot",
                "obj": "$var.f24a.result"
              },
              "outgoing": {
                "return_data": null
              },
              "error": ""
            },
            "deprecated": false,
            "matched": [
              {
                "key": "canvasName",
                "highlightString": "<span class='highlight-string'>quer</span>y"
              },
              {
                "key": "summary",
                "highlightString": "<span class='highlight-string'>Quer</span>y Data Using 'json-query' Format"
              },
              {
                "key": "description",
                "highlightString": "<span class='highlight-string'>Quer</span>y data using a dot/bracket notation string and a matching key/value pair."
              }
            ],
            "groups": [],
            "x": 0.3058823529411765,
            "y": 0.3818393480791618,
            "scheduled": false
          },
          "83af": {
            "name": "transformation",
            "canvasName": "transformation",
            "summary": "JSON Transformation",
            "description": "Perform a JSON Transformation using the JST library.",
            "location": "Application",
            "locationType": null,
            "app": "WorkFlowEngine",
            "type": "operation",
            "displayName": "WorkFlowEngine",
            "variables": {
              "incoming": {
                "tr_id": "60d1f5de24b88d0119edef27",
                "variableMap": {
                  "snapshotidlast": "$var.4cfa.return_data",
                  "snapshotidprev": "$var.5df2.return_data"
                },
                "options": {
                  "validateIncoming": true,
                  "revertToDefaultValue": true
                }
              },
              "outgoing": {
                "payload": null,
                "snapshotidlast": null
              }
            },
            "deprecated": false,
            "matched": [
              {
                "key": "description",
                "highlightString": "Perform a JSON Transformation using the <span class='highlight-string'>JST</span> library."
              }
            ],
            "groups": [],
            "x": 0.30954428202923473,
            "y": 0.5110294117647058,
            "task_name": "CreateInvDiffPayload"
          }
        },
        "transitions": {
          "workflow_start": {
            "f24a": {
              "type": "standard",
              "state": "success"
            },
            "a5": {
              "type": "standard",
              "state": "success"
            }
          },
          "workflow_end": {},
          "d0f2": {},
          "f64f": {},
          "f056": {
            "79a9": {
              "type": "standard",
              "state": "success"
            },
            "ec60": {
              "type": "standard",
              "state": "success"
            }
          },
          "ec60": {
            "workflow_end": {
              "type": "standard",
              "state": "success"
            }
          },
          "79a9": {
            "workflow_end": {
              "type": "standard",
              "state": "success"
            }
          },
          "a5": {
            "5df2": {
              "type": "standard",
              "state": "success"
            }
          },
          "f24a": {
            "4cfa": {
              "type": "standard",
              "state": "success"
            }
          },
          "5df2": {
            "83af": {
              "type": "standard",
              "state": "success"
            }
          },
          "4cfa": {
            "83af": {
              "type": "standard",
              "state": "success"
            }
          },
          "83af": {
            "f056": {
              "type": "standard",
              "state": "success"
            }
          }
        },
        "font_size": 12,
        "name": "IP Fabric Snapshot Inventory Comparison",
        "description": "",
        "last_updated": "2021-07-01T20:22:28.083Z",
        "last_updated_by": {
          "provenance": "Local AAA",
          "username": "holly.holcomb@itential.com",
          "firstname": null,
          "inactive": false
        },
        "lastUpdatedVersion": "5.29.14-2020.2.47.0",
        "inputSchema": {
          "type": "object"
        },
        "outputSchema": {
          "type": "object",
          "properties": {
            "_id": {
              "type": "string",
              "pattern": "^[0-9a-f]{24}$"
            },
            "initiator": {
              "type": "string"
            },
            "devicesRemoved": {
              "type": [
                "string",
                "number",
                "object",
                "integer",
                "array",
                "boolean",
                "null"
              ],
              "examples": [
                "value"
              ]
            },
            "devicesAdded": {
              "type": [
                "string",
                "number",
                "object",
                "integer",
                "array",
                "boolean",
                "null"
              ],
              "examples": [
                "value"
              ]
            }
          }
        },
        "created": "2021-07-01T13:47:12.707Z",
        "created_by": {
          "provenance": "Local AAA",
          "username": "holly.holcomb@itential.com",
          "firstname": null,
          "inactive": false
        },
        "createdVersion": "5.29.14-2020.2.47",
        "preAutomationTime": 0,
        "sla": 0,
        "tags": [],
        "groups": []
      }
    },
    {
      "type": "transformation",
      "data": {
        "_id": "60d1f5de24b88d0119edef27",
        "name": "CreateInvDiffPayload",
        "description": "",
        "incoming": [
          {
            "$id": "snapshotidlast",
            "type": "string",
            "examples": [
              "snap1"
            ]
          },
          {
            "$id": "snapshotidprev",
            "type": "string",
            "examples": [
              "snap2"
            ]
          }
        ],
        "outgoing": [
          {
            "$id": "payload",
            "type": "object",
            "properties": {},
            "required": []
          },
          {
            "$id": "snapshotidlast",
            "type": "string",
            "examples": [
              "snap1"
            ]
          }
        ],
        "steps": [
          {
            "id": 1,
            "type": "template",
            "library": "String",
            "method": "templateLiteral",
            "template": "{\n    \"columns\": [\n        \"hostname\",\n        \"loginIp\",\n        \"version\",\n        \"uptime\",\n        \"status\"\n    ],\n    \"filters\": {\n        \"after\": [\n            \"eq\",\n            \"${lastSnap}\"\n        ],\n        \"before\": [\n            \"eq\",\n            \"${prevSnap}\"\n        ]\n    }\n}",
            "args": [
              null,
              null
            ],
            "view": {
              "row": 1,
              "col": 2
            }
          },
          {
            "id": 2,
            "type": "assign",
            "from": {
              "location": "incoming",
              "name": "snapshotidlast",
              "ptr": ""
            },
            "to": {
              "location": "template",
              "name": 1,
              "ptr": "/args/0/value"
            }
          },
          {
            "id": 3,
            "type": "assign",
            "from": {
              "location": "incoming",
              "name": "snapshotidprev",
              "ptr": ""
            },
            "to": {
              "location": "template",
              "name": 1,
              "ptr": "/args/1/value"
            }
          },
          {
            "id": 4,
            "type": "method",
            "library": "JSON",
            "method": "parse",
            "args": [
              null,
              null
            ],
            "view": {
              "row": 1,
              "col": 3
            }
          },
          {
            "id": 5,
            "type": "assign",
            "from": {
              "location": "template",
              "name": 1,
              "ptr": "/return"
            },
            "to": {
              "location": "method",
              "name": 4,
              "ptr": "/args/0/value"
            }
          },
          {
            "id": 6,
            "type": "assign",
            "from": {
              "location": "method",
              "name": 4,
              "ptr": "/return"
            },
            "to": {
              "location": "outgoing",
              "name": "payload",
              "ptr": ""
            }
          },
          {
            "id": 7,
            "type": "assign",
            "from": {
              "location": "incoming",
              "name": "snapshotidlast",
              "ptr": ""
            },
            "to": {
              "location": "outgoing",
              "name": "snapshotidlast",
              "ptr": ""
            }
          }
        ],
        "functions": [],
        "comments": [],
        "view": {
          "col": 3,
          "row": 5
        },
        "created": "2021-06-22T14:38:22.563Z",
        "createdBy": {
          "_id": "6008620771c01043f6309b24",
          "provenance": "Local AAA",
          "username": "admin@pronghorn"
        },
        "lastUpdated": "2021-06-22T14:40:24.148Z",
        "lastUpdatedBy": {
          "_id": "6008620771c01043f6309b24",
          "provenance": "Local AAA",
          "username": "admin@pronghorn"
        },
        "version": "3.13.0-2020.2.11"
      }
    }
  ],
  "readme": "## _Deprecation Notice_\nThis Pre-Built has been deprecated as of 09-01-2024 and will be end of life on 09-01-2025. The capabilities of this Pre-Built have been replaced by the [IP Fabric - REST](https://gitlab.com/itentialopensource/pre-built-automations/ip-fabric-rest)\n\n<!-- This is a comment in md (Markdown) format, it will not be visible to the end user -->\n\n<!-- Update the below line with your Pre-Built name -->\n# IP Fabric Snapshot Inventory Comparison\n\n<!-- Leave TOC intact unless you've added or removed headers -->\n## Table of Contents\n\n* [Overview](#overview)\n* [Requirements](#requirements)\n* [How to Install](#how-to-install)\n* [How to Run](#how-to-run)\n* [Additional Information](#additional-information)\n\n## Overview\n\nThe IP Fabric Snapshot Inventory Comparison Pre-Built allows you to compare two network snapshots leveraging the [IP Fabric Automated Network Assurance Platform](https://ipfabric.io/product/). The Pre-Built has two stubbed tasks that enable the user to define if they would like to take the results of the comparison. \n\nFor example, if there are new devices in the most recent snapshot, the user may decide to build a childJob that adds the device(s) to their inventory system such as SolarWinds, BlueCat, PRTG, Zabbix, Netbox, etc. If there are fewer devices in the most recent snapshot, the user may decide to build a childJob that removes the device(s) from their inventory system. \n\n_Estimated Run Time_: 1min\n\n## Installation Prerequisites\n\nUsers must satisfy the following pre-requisites:\n\n<!-- Include any other required apps or adapters in this list -->\n<!-- Ex.: EC2 Adapter -->\n* Itential Automation Platform\n  * `^2021.1`\n  * [IP Fabric Adapter](https://gitlab.com/itentialopensource/adapters/telemetry-analytics/adapter-ipfabric)\n\n## Requirements\n\nThis Pre-Built requires the following:\n\n* [IP Fabric Adapter](https://gitlab.com/itentialopensource/adapters/telemetry-analytics/adapter-ipfabric) configured with credentials and IP Address of your IP Fabric Instance.\n\n## How to Install\n\nTo install the Pre-Built:\n\n* Verify you are running a supported version of the Itential Automation Platform (IAP) as listed above in the [Requirements](#requirements) section in order to install the Pre-Built. \n* The Pre-Built can be installed from within App-Admin_Essential. Simply search for the name of your desired Pre-Built and click the install button (as shown below).\n\n<!-- OPTIONAL - Explain if external components are required outside of IAP -->\n<!-- Ex.: The Ansible roles required for this Pre-Built can be found in the repository located at https://gitlab.com/itentialopensource/pre-built-automations/hello-world -->\n\n## How to Run\n\nUse the following to run the Pre-Built:\n\n* Run the Operations Manager item `IP Fabric Snapshot Inventory Comparison` or call [IP Fabric Snapshot Inventory Comparison](https://gitlab.com/itentialopensource/pre-built-automations/ip-fabric-snapshot-inventory-comparison/-/raw/master/bundles/workflows/IP Fabric Snapshot Inventory Comparison) from your workflow as a child job.\n"
}