{
  "_id": "60c0eaf4edfc06011cf3ca92",
  "name": "Service Path Analysis End to End",
  "description": "",
  "incoming": [
    {
      "$id": "snapshotId",
      "type": "string",
      "examples": [
        "snapshotId"
      ]
    },
    {
      "$id": "servicePathForm",
      "type": "object",
      "properties": {
        "Source": {
          "type": "string",
          "examples": [
            "4%2E4%2E4%2E4"
          ],
          "format": "ipv4"
        },
        "Destination": {
          "type": "string",
          "examples": [
            "4%2E4%2E4%2E4"
          ],
          "format": "ipv4"
        },
        "Source Port": {
          "type": "string",
          "examples": [
            "3333"
          ]
        },
        "Destination Port": {
          "type": "string",
          "examples": [
            "4444"
          ]
        },
        "Protocol": {
          "type": "string",
          "examples": [
            "tcp"
          ]
        }
      },
      "required": []
    }
  ],
  "outgoing": [
    {
      "$id": "url",
      "type": "string",
      "examples": [
        "url"
      ]
    },
    {
      "$id": "snapshotId",
      "type": "string",
      "examples": [
        "snapshotId"
      ]
    },
    {
      "$id": "Source",
      "type": "string",
      "examples": [
        "4%2E4%2E4%2E4"
      ],
      "format": "ipv4"
    },
    {
      "$id": "Destination",
      "type": "string",
      "examples": [
        "4%2E4%2E4%2E4"
      ],
      "format": "ipv4"
    },
    {
      "$id": "SourcePort",
      "type": "string",
      "examples": [
        "3333"
      ]
    },
    {
      "$id": "DestinationPort",
      "type": "string",
      "examples": [
        "4444"
      ]
    },
    {
      "$id": "Protocol",
      "type": "string",
      "examples": [
        "tcp"
      ]
    }
  ],
  "steps": [
    {
      "id": 1,
      "type": "template",
      "library": "String",
      "method": "templateLiteral",
      "template": "https://demo6.ipfabric.io/api/v1/graph/end-to-end-path?source=${sourceIP}&sourcePort=${sourcePort}&destinationPort=${destinationPort}&asymmetric=false&rpf=false&protocol=${protocol}&snapshot=${snapshot}&destination=${destinationIP}",
      "args": [
        null,
        null,
        null,
        null,
        null,
        null
      ],
      "view": {
        "row": 1,
        "col": 2
      }
    },
    {
      "id": 2,
      "type": "assign",
      "from": {
        "location": "incoming",
        "name": "servicePathForm",
        "ptr": "/Source"
      },
      "to": {
        "location": "template",
        "name": 1,
        "ptr": "/args/0/value"
      }
    },
    {
      "id": 3,
      "type": "assign",
      "from": {
        "location": "template",
        "name": 1,
        "ptr": "/return"
      },
      "to": {
        "location": "outgoing",
        "name": "url",
        "ptr": ""
      }
    },
    {
      "id": 4,
      "type": "assign",
      "from": {
        "location": "incoming",
        "name": "servicePathForm",
        "ptr": "/Destination"
      },
      "to": {
        "location": "template",
        "name": 1,
        "ptr": "/args/5/value"
      }
    },
    {
      "id": 5,
      "type": "assign",
      "from": {
        "location": "incoming",
        "name": "servicePathForm",
        "ptr": "/Source Port"
      },
      "to": {
        "location": "template",
        "name": 1,
        "ptr": "/args/1/value"
      }
    },
    {
      "id": 6,
      "type": "assign",
      "from": {
        "location": "incoming",
        "name": "servicePathForm",
        "ptr": "/Destination Port"
      },
      "to": {
        "location": "template",
        "name": 1,
        "ptr": "/args/2/value"
      }
    },
    {
      "id": 7,
      "type": "assign",
      "from": {
        "location": "incoming",
        "name": "servicePathForm",
        "ptr": "/Protocol"
      },
      "to": {
        "location": "template",
        "name": 1,
        "ptr": "/args/3/value"
      }
    },
    {
      "id": 8,
      "type": "assign",
      "from": {
        "location": "incoming",
        "name": "snapshotId",
        "ptr": ""
      },
      "to": {
        "location": "template",
        "name": 1,
        "ptr": "/args/4/value"
      }
    },
    {
      "id": 9,
      "type": "assign",
      "from": {
        "location": "incoming",
        "name": "snapshotId",
        "ptr": ""
      },
      "to": {
        "location": "outgoing",
        "name": "snapshotId",
        "ptr": ""
      }
    },
    {
      "id": 10,
      "type": "assign",
      "from": {
        "location": "incoming",
        "name": "servicePathForm",
        "ptr": "/Source"
      },
      "to": {
        "location": "outgoing",
        "name": "Source",
        "ptr": ""
      }
    },
    {
      "id": 11,
      "type": "assign",
      "from": {
        "location": "incoming",
        "name": "servicePathForm",
        "ptr": "/Destination"
      },
      "to": {
        "location": "outgoing",
        "name": "Destination",
        "ptr": ""
      }
    },
    {
      "id": 12,
      "type": "assign",
      "from": {
        "location": "incoming",
        "name": "servicePathForm",
        "ptr": "/Source Port"
      },
      "to": {
        "location": "outgoing",
        "name": "SourcePort",
        "ptr": ""
      }
    },
    {
      "id": 13,
      "type": "assign",
      "from": {
        "location": "incoming",
        "name": "servicePathForm",
        "ptr": "/Destination Port"
      },
      "to": {
        "location": "outgoing",
        "name": "DestinationPort",
        "ptr": ""
      }
    },
    {
      "id": 14,
      "type": "assign",
      "from": {
        "location": "incoming",
        "name": "servicePathForm",
        "ptr": "/Protocol"
      },
      "to": {
        "location": "outgoing",
        "name": "Protocol",
        "ptr": ""
      }
    }
  ],
  "functions": [],
  "comments": [],
  "view": {
    "col": 3,
    "row": 5
  },
  "created": "2021-06-09T16:23:16.140Z",
  "createdBy": {
    "_id": "6008620771c01043f6309b24",
    "provenance": "Local AAA",
    "username": "admin@pronghorn"
  },
  "lastUpdated": "2021-06-22T13:36:38.246Z",
  "lastUpdatedBy": {
    "_id": "6008620771c01043f6309b24",
    "provenance": "Local AAA",
    "username": "admin@pronghorn"
  },
  "version": "3.13.0-2020.2.11"
}