{
  "type": "automation",
  "tasks": {
    "workflow_start": {
      "name": "workflow_start",
      "groups": [],
      "x": -0.09568627450980392,
      "y": 0.4375
    },
    "workflow_end": {
      "name": "workflow_end",
      "groups": [],
      "x": 0.8721568627450981,
      "y": 0.6900921658986175
    },
    "c914": {
      "name": "query",
      "canvasName": "query",
      "summary": "Query Snapshot ID",
      "description": "Query Snapshot ID",
      "location": "Application",
      "locationType": null,
      "app": "WorkFlowEngine",
      "type": "operation",
      "displayName": "WorkFlowEngine",
      "variables": {
        "incoming": {
          "pass_on_null": false,
          "query": "response._meta.snapshot",
          "obj": "$var.5bab.result"
        },
        "outgoing": {
          "return_data": null
        },
        "error": ""
      },
      "deprecated": false,
      "matched": [
        {
          "key": "canvasName",
          "highlightString": "<span class='highlight-string'>query</span>"
        },
        {
          "key": "summary",
          "highlightString": "<span class='highlight-string'>Query</span> Data Using 'json-query' Format"
        },
        {
          "key": "description",
          "highlightString": "<span class='highlight-string'>Query</span> data using a dot/bracket notation string and a matching key/value pair."
        }
      ],
      "groups": [],
      "x": 0.14588235294117646,
      "y": 0.4375,
      "scheduled": false
    },
    "41c1": {
      "name": "transformation",
      "canvasName": "transformation",
      "summary": "JSON Transformation",
      "description": "Perform a JSON Transformation using the JST library.",
      "location": "Application",
      "locationType": null,
      "app": "WorkFlowEngine",
      "type": "operation",
      "displayName": "WorkFlowEngine",
      "variables": {
        "incoming": {
          "tr_id": "60c0eaf4edfc06011cf3ca92",
          "variableMap": {
            "snapshotId": "$var.c914.return_data",
            "servicePathForm": "$var.job.formData"
          },
          "options": {
            "validateIncoming": false,
            "revertToDefaultValue": true
          }
        },
        "outgoing": {
          "url": null,
          "snapshotId": null,
          "Source": null,
          "Destination": null,
          "SourcePort": null,
          "DestinationPort": null,
          "Protocol": null
        }
      },
      "deprecated": false,
      "matched": [
        {
          "key": "description",
          "highlightString": "Perform a JSON Transformation using the <span class='highlight-string'>JST</span> library."
        }
      ],
      "groups": [],
      "x": 0.21411764705882352,
      "y": 0.4398148148148148,
      "task_name": "Service Path Analysis End to End"
    },
    "cd76": {
      "name": "evaluation",
      "canvasName": "evaluation",
      "summary": "Run Evaluation Task",
      "description": "Run an evaluation",
      "location": "Application",
      "locationType": null,
      "app": "WorkFlowEngine",
      "type": "operation",
      "displayName": "WorkFlowEngine",
      "variables": {
        "incoming": {
          "all_true_flag": false,
          "evaluation_groups": [
            {
              "all_true_flag": false,
              "evaluations": [
                {
                  "query": "response.graph.lookup.state",
                  "operand_1": {
                    "variable": "result",
                    "task": "d3bf"
                  },
                  "operator": "==",
                  "operand_2": {
                    "variable": "ok",
                    "task": "static"
                  }
                }
              ]
            }
          ]
        },
        "outgoing": {
          "return_value": null
        }
      },
      "deprecated": false,
      "matched": [
        {
          "key": "canvasName",
          "highlightString": "<span class='highlight-string'>eval</span>uation"
        },
        {
          "key": "summary",
          "highlightString": "Run <span class='highlight-string'>Eval</span>uation Task"
        },
        {
          "key": "description",
          "highlightString": "Run an <span class='highlight-string'>eval</span>uation"
        }
      ],
      "groups": [],
      "x": 0.6901960784313725,
      "y": 0.43894009216589863
    },
    "a94f": {
      "name": "newVariable",
      "canvasName": "newVariable",
      "summary": "Create a Job Variable",
      "description": "Create a new Job variable by Job ID and assign it a value.",
      "location": "Application",
      "locationType": null,
      "app": "WorkFlowEngine",
      "type": "operation",
      "displayName": "WorkFlowEngine",
      "variables": {
        "incoming": {
          "name": "pathVerification",
          "value": "failure"
        },
        "outgoing": {
          "value": null
        }
      },
      "deprecated": false,
      "matched": [
        {
          "key": "canvasName",
          "highlightString": "<span class='highlight-string'>newVar</span>iable"
        }
      ],
      "groups": [],
      "x": 0.6729411764705883,
      "y": 0.7868663594470046
    },
    "f473": {
      "name": "newVariable",
      "canvasName": "newVariable",
      "summary": "Create a Job Variable",
      "description": "Create a new Job variable by Job ID and assign it a value.",
      "location": "Application",
      "locationType": null,
      "app": "WorkFlowEngine",
      "type": "operation",
      "displayName": "WorkFlowEngine",
      "variables": {
        "incoming": {
          "name": "pathVerification",
          "value": "success"
        },
        "outgoing": {
          "value": null
        }
      },
      "deprecated": false,
      "matched": [
        {
          "key": "canvasName",
          "highlightString": "<span class='highlight-string'>newVar</span>iable"
        }
      ],
      "groups": [],
      "x": 0.7913725490196079,
      "y": 0.4447004608294931
    },
    "5bab": {
      "name": "postTablesInventorySites",
      "canvasName": "postTablesInventorySites",
      "summary": "",
      "description": "",
      "location": "Adapter",
      "locationType": "IpFabric",
      "app": "IpFabric",
      "type": "automatic",
      "displayName": "IpFabric",
      "variables": {
        "incoming": {
          "body": {
            "columns": [
              "id"
            ],
            "filters": {},
            "snapshot": "$last"
          },
          "adapter_id": "IPFabric"
        },
        "outgoing": {
          "result": null
        },
        "error": ""
      },
      "deprecated": false,
      "matched": [
        {
          "key": "canvasName",
          "highlightString": "postTablesInventory<span class='highlight-string'>Sites</span>"
        }
      ],
      "groups": [],
      "actor": "Pronghorn",
      "x": 0.03607843137254902,
      "y": 0.4447031431897555,
      "scheduled": false
    },
    "d3bf": {
      "name": "simulatePath",
      "canvasName": "simulatePath",
      "summary": "End to End application path simulation",
      "description": "End to End application path simulation",
      "location": "Adapter",
      "locationType": "IpFabric",
      "app": "IpFabric",
      "type": "automatic",
      "displayName": "IpFabric",
      "variables": {
        "incoming": {
          "source": "$var.41c1.Source",
          "destination": "$var.41c1.Destination",
          "sourcePort": "$var.41c1.SourcePort",
          "destinationPort": "$var.41c1.DestinationPort",
          "asymmetric": "",
          "rpf": "",
          "protocol": "$var.41c1.Protocol",
          "snapshot": "$var.41c1.snapshotId",
          "adapter_id": "IPFabric"
        },
        "outgoing": {
          "result": null
        },
        "error": ""
      },
      "deprecated": false,
      "matched": [
        {
          "key": "canvasName",
          "highlightString": "<span class='highlight-string'>simula</span>tePath"
        },
        {
          "key": "summary",
          "highlightString": "End to End application path <span class='highlight-string'>simula</span>tion"
        },
        {
          "key": "description",
          "highlightString": "End to End application path <span class='highlight-string'>simula</span>tion"
        }
      ],
      "groups": [],
      "actor": "Pronghorn",
      "x": 0.36,
      "y": 0.4444444444444444,
      "scheduled": false
    },
    "99ae": {
      "name": "query",
      "canvasName": "query",
      "summary": "Query for Firewall Rules",
      "description": "Checking for firewall rules violation on specific service request.",
      "location": "Application",
      "locationType": null,
      "app": "WorkFlowEngine",
      "type": "operation",
      "displayName": "WorkFlowEngine",
      "variables": {
        "incoming": {
          "pass_on_null": false,
          "query": "response.graph.edges[zone][*action=deny]",
          "obj": "$var.d3bf.result"
        },
        "outgoing": {
          "return_data": null
        },
        "error": ""
      },
      "deprecated": false,
      "matched": [
        {
          "key": "canvasName",
          "highlightString": "<span class='highlight-string'>quer</span>y"
        },
        {
          "key": "summary",
          "highlightString": "<span class='highlight-string'>Quer</span>y Data Using 'json-query' Format"
        },
        {
          "key": "description",
          "highlightString": "<span class='highlight-string'>Quer</span>y data using a dot/bracket notation string and a matching key/value pair."
        }
      ],
      "groups": [],
      "x": 0.7364705882352941,
      "y": 0.5587557603686636,
      "scheduled": false
    },
    "3b6a": {
      "name": "query",
      "canvasName": "query",
      "summary": "Query for Router Failures",
      "description": "Checking for impacted routers on specific service request.",
      "location": "Application",
      "locationType": null,
      "app": "WorkFlowEngine",
      "type": "operation",
      "displayName": "WorkFlowEngine",
      "variables": {
        "incoming": {
          "pass_on_null": false,
          "query": "response.graph.nodes.forwarding[*result=fail]",
          "obj": "$var.d3bf.result"
        },
        "outgoing": {
          "return_data": null
        },
        "error": ""
      },
      "deprecated": false,
      "matched": [
        {
          "key": "canvasName",
          "highlightString": "<span class='highlight-string'>quer</span>y"
        },
        {
          "key": "summary",
          "highlightString": "<span class='highlight-string'>Quer</span>y Data Using 'json-query' Format"
        },
        {
          "key": "description",
          "highlightString": "<span class='highlight-string'>Quer</span>y data using a dot/bracket notation string and a matching key/value pair."
        }
      ],
      "groups": [],
      "x": 0.7623529411764706,
      "y": 0.5576036866359447,
      "scheduled": false
    },
    "e1a0": {
      "name": "query",
      "canvasName": "query",
      "summary": "Query for Switch Failures",
      "description": "Checking for impacted switches on specific service request.",
      "location": "Application",
      "locationType": null,
      "app": "WorkFlowEngine",
      "type": "operation",
      "displayName": "WorkFlowEngine",
      "variables": {
        "incoming": {
          "pass_on_null": false,
          "query": "response.graph.nodes.forwarding[*result=flood]",
          "obj": "$var.d3bf.result"
        },
        "outgoing": {
          "return_data": null
        },
        "error": ""
      },
      "deprecated": false,
      "matched": [
        {
          "key": "canvasName",
          "highlightString": "<span class='highlight-string'>quer</span>y"
        },
        {
          "key": "summary",
          "highlightString": "<span class='highlight-string'>Quer</span>y Data Using 'json-query' Format"
        },
        {
          "key": "description",
          "highlightString": "<span class='highlight-string'>Quer</span>y data using a dot/bracket notation string and a matching key/value pair."
        }
      ],
      "groups": [],
      "x": 0.779607843137255,
      "y": 0.554147465437788,
      "scheduled": false
    },
    "5bf7": {
      "name": "postTablesInventoryDevices",
      "canvasName": "postTablesInventoryDevices",
      "summary": "",
      "description": "",
      "location": "Adapter",
      "locationType": "IpFabric",
      "app": "IpFabric",
      "type": "automatic",
      "displayName": "IpFabric",
      "variables": {
        "incoming": {
          "body": {
            "columns": [
              "hostname",
              "sn",
              "loginIp"
            ],
            "snapshot": "$last",
            "filters": {
              "hostname": [
                "eq",
                "L66JFW9"
              ]
            }
          },
          "adapter_id": "IPFabric"
        },
        "outgoing": {
          "result": null
        },
        "error": ""
      },
      "deprecated": false,
      "matched": [
        {
          "key": "canvasName",
          "highlightString": "postTables<span class='highlight-string'>Inventor</span>yDevices"
        }
      ],
      "groups": [],
      "actor": "Pronghorn",
      "x": 0.5694117647058824,
      "y": 0.4447004608294931,
      "scheduled": false
    }
  },
  "transitions": {
    "workflow_start": {
      "5bab": {
        "type": "standard",
        "state": "success"
      }
    },
    "workflow_end": {},
    "705a": {},
    "c914": {
      "41c1": {
        "type": "standard",
        "state": "success"
      }
    },
    "41c1": {
      "d3bf": {
        "type": "standard",
        "state": "success"
      }
    },
    "cd76": {
      "f473": {
        "type": "standard",
        "state": "success"
      },
      "99ae": {
        "type": "standard",
        "state": "failure"
      },
      "3b6a": {
        "type": "standard",
        "state": "failure"
      },
      "e1a0": {
        "type": "standard",
        "state": "failure"
      }
    },
    "a94f": {
      "workflow_end": {
        "type": "standard",
        "state": "success"
      }
    },
    "f473": {
      "workflow_end": {
        "type": "standard",
        "state": "success"
      }
    },
    "dab3": {},
    "5bab": {
      "c914": {
        "type": "standard",
        "state": "success"
      }
    },
    "d3bf": {
      "5bf7": {
        "type": "standard",
        "state": "success"
      }
    },
    "99ae": {
      "a94f": {
        "type": "standard",
        "state": "success"
      }
    },
    "3b6a": {
      "a94f": {
        "type": "standard",
        "state": "success"
      }
    },
    "e1a0": {
      "a94f": {
        "type": "standard",
        "state": "success"
      }
    },
    "5bf7": {
      "cd76": {
        "type": "standard",
        "state": "success"
      }
    }
  },
  "font_size": 12,
  "name": "IP Fabric Service Path Analysis",
  "description": "",
  "last_updated": "2021-08-27T14:05:02.463Z",
  "last_updated_by": {
    "provenance": "Local AAA",
    "username": "admin@pronghorn",
    "firstname": "admin",
    "inactive": false,
    "email": ""
  },
  "lastUpdatedVersion": "5.29.14-2020.2.47.0",
  "inputSchema": {
    "type": "object",
    "properties": {
      "formData": {
        "$id": "servicePathForm",
        "type": "object",
        "properties": {
          "Source": {
            "type": "string",
            "examples": [
              "4%2E4%2E4%2E4"
            ],
            "format": "ipv4"
          },
          "Destination": {
            "type": "string",
            "examples": [
              "4%2E4%2E4%2E4"
            ],
            "format": "ipv4"
          },
          "Source Port": {
            "type": "string",
            "examples": [
              "3333"
            ]
          },
          "Destination Port": {
            "type": "string",
            "examples": [
              "4444"
            ]
          },
          "Protocol": {
            "type": "string",
            "examples": [
              "tcp"
            ]
          }
        },
        "required": []
      }
    },
    "required": [
      "formData"
    ]
  },
  "outputSchema": {
    "type": "object",
    "properties": {
      "formData": {
        "$id": "servicePathForm",
        "type": "object",
        "properties": {
          "Source": {
            "type": "string",
            "examples": [
              "4%2E4%2E4%2E4"
            ],
            "format": "ipv4"
          },
          "Destination": {
            "type": "string",
            "examples": [
              "4%2E4%2E4%2E4"
            ],
            "format": "ipv4"
          },
          "Source Port": {
            "type": "string",
            "examples": [
              "3333"
            ]
          },
          "Destination Port": {
            "type": "string",
            "examples": [
              "4444"
            ]
          },
          "Protocol": {
            "type": "string",
            "examples": [
              "tcp"
            ]
          }
        },
        "required": []
      },
      "_id": {
        "type": "string",
        "pattern": "^[0-9a-f]{24}$"
      },
      "initiator": {
        "type": "string"
      },
      "pathVerification": {
        "type": "string"
      }
    }
  },
  "created": "2021-06-09T15:27:12.255Z",
  "created_by": {
    "provenance": "Local AAA",
    "username": "admin@pronghorn",
    "firstname": "admin",
    "inactive": false,
    "email": ""
  },
  "createdVersion": "5.29.14-2020.2.18.0",
  "preAutomationTime": 0,
  "sla": 0,
  "canvasVersion": 1,
  "tags": [],
  "groups": []
}