{
  "_id": "61b0f0e3eedde101aef440e2",
  "name": "IP Fabric Create Network Snapshot",
  "description": "",
  "componentName": "IP Fabric Create Network Snapshot",
  "componentType": "workflows",
  "gbac": {
    "write": [],
    "read": []
  },
  "created": "2021-12-08T17:52:35.720Z",
  "createdBy": "kay.wolfe@itential.com",
  "lastUpdated": "2021-12-08T17:52:35.720Z",
  "lastUpdatedBy": "kay.wolfe@itential.com",
  "triggers": [
    {
      "_id": "61b0f0e4eedde101aef440e3",
      "created": "2021-12-08T17:52:36.076Z",
      "createdBy": "kay.wolfe@itential.com",
      "lastUpdated": "2021-12-08T18:53:42.074Z",
      "lastUpdatedBy": "kay.wolfe@itential.com",
      "name": "Manual Trigger (migrated from IP Fabric Create Network Snapshot)",
      "type": "manual",
      "enabled": true,
      "actionType": "automations",
      "actionId": "61b0f0e3eedde101aef440e2",
      "formId": null,
      "formData": {},
      "migrationVersion": 1
    }
  ]
}
