{
  "type": "automation",
  "tasks": {
    "workflow_start": {
      "name": "workflow_start",
      "groups": [],
      "x": -0.02196078431372549,
      "y": 0.5145518044237486
    },
    "workflow_end": {
      "name": "workflow_end",
      "groups": [],
      "x": 0.5545098039215687,
      "y": 0.5285215366705471
    },
    "f89": {
      "name": "createSnapshot",
      "canvasName": "createSnapshot",
      "summary": "Create new snapshot with global or new settings",
      "description": "Create new snapshot with global or new settings",
      "location": "Adapter",
      "locationType": "IpFabric",
      "app": "IpFabric",
      "type": "automatic",
      "displayName": "IpFabric",
      "variables": {
        "incoming": {
          "body": "$var.job.body",
          "adapter_id": "IPFabric"
        },
        "outgoing": {
          "result": "$var.job.snapshotDetails"
        },
        "error": ""
      },
      "deprecated": false,
      "matched": [],
      "groups": [],
      "actor": "Pronghorn",
      "x": 0.22823529411764706,
      "y": 0.5157159487776485,
      "scheduled": false
    },
    "2a49": {
      "name": "delay",
      "canvasName": "delay",
      "summary": "Delay a Job",
      "description": "Delay a Job for a duration by Job ID and number of seconds.",
      "location": "Application",
      "locationType": null,
      "app": "WorkFlowEngine",
      "type": "operation",
      "displayName": "WorkFlowEngine",
      "variables": {
        "incoming": {
          "time": 40
        },
        "outgoing": {
          "time_in_milliseconds": null
        },
        "error": ""
      },
      "deprecated": false,
      "matched": [
        {
          "key": "canvasName",
          "highlightString": "<span class='highlight-string'>delay</span>"
        },
        {
          "key": "summary",
          "highlightString": "<span class='highlight-string'>Delay</span> a Job"
        },
        {
          "key": "description",
          "highlightString": "<span class='highlight-string'>Delay</span> a Job for a duration by Job ID and number of seconds."
        }
      ],
      "groups": [],
      "x": 0.4250980392156863,
      "y": 0.511520737327189,
      "scheduled": false
    }
  },
  "transitions": {
    "workflow_start": {
      "f89": {
        "type": "standard",
        "state": "success"
      }
    },
    "workflow_end": {},
    "d0f2": {},
    "f64f": {},
    "f89": {
      "2a49": {
        "type": "standard",
        "state": "success"
      }
    },
    "2a49": {
      "workflow_end": {
        "type": "standard",
        "state": "success"
      }
    }
  },
  "font_size": 12,
  "name": "IP Fabric Create Network Snapshot",
  "description": "",
  "last_updated": "2021-09-07T16:02:35.585Z",
  "last_updated_by": {
    "provenance": "Local AAA",
    "username": "admin@pronghorn",
    "firstname": "admin",
    "inactive": false,
    "email": ""
  },
  "lastUpdatedVersion": "5.29.14-2020.2.47.0",
  "inputSchema": {
    "type": "object",
    "properties": {
      "body": {
        "type": "object",
        "description": "Individual snapshot settings response.",
        "properties": {
          "allowTelnet": {
            "default": true,
            "type": "boolean",
            "description": "Enable/Disable telnet for discovery",
            "example": true
          },
          "backup": {
            "title": "The backup schema",
            "type": "object",
            "description": "Backup configuration for IP Fabric.",
            "example": {
              "cron": "0 23 * * *",
              "enabled": false,
              "server": "backup.server.io",
              "type": "ftp",
              "username": "username",
              "password": "password"
            },
            "properties": {
              "cron": {
                "type": "string"
              },
              "directory": {
                "type": "string"
              },
              "enabled": {
                "type": "boolean"
              },
              "server": {
                "type": "string"
              },
              "type": {
                "type": "string",
                "enum": [
                  "ftp",
                  "sftp",
                  "local"
                ]
              },
              "username": {
                "type": "string"
              },
              "password": {
                "type": "string"
              }
            }
          },
          "checkSavedConfig": {
            "title": "The checkSavedConfig schema",
            "type": "boolean",
            "example": true,
            "default": false
          },
          "cliRetryLimit": {
            "title": "The cliRetryLimit schema",
            "type": "object",
            "example": {
              "authFail": 2,
              "default": 3,
              "tacacs": {
                "delay": 1000,
                "retry": 1
              }
            },
            "properties": {
              "authFail": {
                "type": "integer"
              },
              "default": {
                "type": "integer"
              },
              "tacacs": {
                "type": "object",
                "properties": {
                  "delay": {
                    "default": 1000,
                    "type": "integer"
                  },
                  "retry": {
                    "default": 0,
                    "type": "integer"
                  }
                }
              }
            }
          },
          "cliSessionsLimit": {
            "title": "The cliSessionsLimit schema",
            "type": "object",
            "example": {
              "enabled": false,
              "limit": 5
            },
            "properties": {
              "enabled": {
                "default": false,
                "type": "boolean"
              },
              "limit": {
                "default": 0,
                "type": "integer"
              }
            }
          },
          "credentials": {
            "title": "The credentials schema",
            "type": "array",
            "example": [
              {
                "excludeNetworks": [
                  "1.1.1.1/32",
                  "8.8.8.8/32"
                ],
                "network": [
                  "192.168.0.0/16",
                  "10.0.0.0/8"
                ],
                "expirationDate": {
                  "enabled": true,
                  "value": {}
                },
                "id": "9a5340e5-ef75-4962-a694-fb7a683f8e2a",
                "priority": 1,
                "password": "password",
                "syslog": true
              },
              {
                "excludeNetworks": [],
                "network": [],
                "expirationDate": {
                  "enabled": false
                },
                "id": "sdf340e5-ef75-4962-a694-fb7a6asd8e2a",
                "priority": 2,
                "syslog": true
              }
            ],
            "items": {
              "type": "object",
              "properties": {
                "excludeNetworks": {
                  "type": "array",
                  "items": {
                    "type": "string",
                    "format": "ipv4"
                  }
                },
                "networks": {
                  "type": "array",
                  "items": {
                    "type": "string",
                    "format": "ipv4"
                  }
                },
                "expirationDate": {
                  "type": "object",
                  "properties": {
                    "enabled": {
                      "type": "boolean",
                      "default": false
                    },
                    "value": {
                      "type": "string",
                      "format": "date-time"
                    }
                  }
                },
                "id": {
                  "type": "string",
                  "format": "uuid"
                },
                "priority": {
                  "type": "integer"
                },
                "password": {
                  "type": "string"
                },
                "syslog": {
                  "type": "boolean",
                  "default": false
                }
              }
            }
          },
          "privileges": {
            "type": "array",
            "title": "The privileges schema",
            "default": [],
            "example": [
              {
                "excludeNetworks": [],
                "expirationDate": {
                  "enabled": false
                },
                "id": "3233fd2a-3036-4dd5-9845-e984e9238c00",
                "includeNetworks": [
                  "0.0.0.0/0"
                ],
                "notes": "Main Enable password",
                "password": "829ec229e38314",
                "priority": 1,
                "username": ""
              }
            ],
            "items": {
              "type": "object",
              "properties": {
                "excludeNetworks": {
                  "type": "array",
                  "items": {
                    "type": "string",
                    "format": "ipv4"
                  }
                },
                "networks": {
                  "type": "array",
                  "items": {
                    "type": "string",
                    "format": "ipv4"
                  }
                },
                "expirationDate": {
                  "type": "object",
                  "properties": {
                    "enabled": {
                      "type": "boolean",
                      "default": false
                    },
                    "value": {
                      "type": "string",
                      "format": "date-time"
                    }
                  }
                },
                "id": {
                  "type": "string",
                  "format": "uuid"
                },
                "priority": {
                  "type": "integer"
                },
                "password": {
                  "type": "string"
                }
              }
            }
          },
          "customerName": {
            "type": "string",
            "title": "The customerName schema",
            "example": "Test Customer"
          },
          "fullBgpLimit": {
            "type": "object",
            "title": "The fullBgpLimit schema",
            "example": {
              "enabled": true,
              "threshold": 10000
            },
            "properties": {
              "enabled": {
                "type": "boolean"
              },
              "threshold": {
                "type": "integer"
              }
            }
          },
          "limitDiscoveryTasks": {
            "type": "object",
            "title": "The limitDiscoveryTasks schema",
            "example": {
              "alreadyDiscovered": false,
              "sourceOfTasks": [
                "xdp",
                "arp",
                "routes",
                "trace"
              ]
            },
            "properties": {
              "alreadyDiscovered": {
                "type": "boolean"
              },
              "sourceOfTasks": {
                "type": "array",
                "items": {
                  "type": "string"
                }
              }
            }
          },
          "maintenance": {
            "title": "The maintenance schema",
            "type": "object",
            "example": {
              "cron": "0 0 * * *",
              "enabled": true
            },
            "properties": {
              "cron": {
                "type": "string"
              },
              "enabled": {
                "type": "boolean"
              }
            }
          },
          "networks": {
            "title": "The networks schema",
            "type": "object",
            "example": {
              "exclude": [
                "8.8.8.8/32"
              ],
              "include": [
                "0.0.0.0/0"
              ],
              "properties": {
                "exclude": {
                  "type": "array",
                  "items": {
                    "type": "string",
                    "format": "ipv4"
                  }
                },
                "include": {
                  "type": "array",
                  "items": {
                    "type": "string",
                    "format": "ipv4"
                  }
                }
              }
            }
          },
          "resolveNames": {
            "type": "object",
            "title": "The resolveNames schema",
            "example": {
              "discoveryDevices": true
            },
            "properties": {
              "discoveryDevices": {
                "type": "boolean"
              }
            }
          },
          "scanner": {
            "type": "object",
            "title": "The scanner schema",
            "example": {
              "enabled": false,
              "shortestMask": 20
            },
            "properties": {
              "enabled": {
                "type": "boolean"
              },
              "shortestMask": {
                "type": "integer"
              }
            }
          },
          "seedList": {
            "type": "array",
            "title": "The seedList schema",
            "default": [],
            "example": [
              "192.168.110.3",
              "10.47.255.101"
            ],
            "items": {
              "type": "string",
              "format": "ipv4"
            }
          },
          "siteSeparation": {
            "type": "array",
            "title": "The siteSeparation schema",
            "example": [
              {
                "id": "90b7dd11-1ab2-42c9-8665-0b137afe50a0",
                "note": "L1DC",
                "regex": "L1(?:R1[4-8]|R7|FW56|SW[3-4])",
                "siteName": "L1DC",
                "transformation": "uppercase",
                "type": "regex"
              },
              {
                "id": "8680156c-bfc6-4a76-92f9-d0f8f5a7c0e5",
                "note": "MAIN REGEX Rule",
                "regex": "^(\\w\\d{1,3}|HWLAB|HUA)",
                "transformation": "uppercase",
                "type": "regex"
              }
            ],
            "items": {
              "type": "object",
              "properties": {
                "id": {
                  "type": "string",
                  "format": "uuid"
                },
                "note": {
                  "type": "string"
                },
                "regex": {
                  "type": "string"
                },
                "siteName": {
                  "type": "string"
                },
                "transformation": {
                  "type": "string"
                },
                "type": {
                  "type": "string"
                }
              }
            }
          },
          "siteTypeCalc": {
            "type": "string",
            "title": "The siteTypeCalc schema",
            "example": "rules"
          },
          "snapshots": {
            "type": "object",
            "title": "The snapshots schema",
            "example": {
              "cron": "0 * * * *",
              "enabled": false,
              "maxLoaded": 3,
              "maxLocked": 1
            },
            "properties": {
              "cron": {
                "type": "string"
              },
              "enabled": {
                "type": "boolean"
              },
              "maxLoaded": {
                "type": "integer"
              },
              "maxLocked": {
                "type": "integer"
              }
            }
          },
          "snmp": {
            "type": "object",
            "title": "The snmp schema",
            "example": {
              "communityString": "community04",
              "enabled": false,
              "hostIp": "192.168.10.10",
              "locality": "Prague, DC",
              "systemContact": "Mr. Johnson",
              "username": "snmpUser",
              "version": "v2c"
            },
            "properties": {
              "communityString": {
                "type": "string"
              },
              "enabled": {
                "type": "boolean"
              },
              "hostIp": {
                "type": "string",
                "format": "ipv4"
              },
              "locality": {
                "type": "string"
              },
              "systemContact": {
                "type": "string"
              },
              "username": {
                "type": "string"
              },
              "version": {
                "type": "string"
              }
            }
          },
          "syslog": {
            "type": "object",
            "title": "The syslog schema",
            "example": {
              "cron": "0 0 * * *",
              "time": 60,
              "trigger": "syslogtrigger"
            },
            "properties": {
              "cron": {
                "type": "string"
              },
              "time": {
                "type": "integer"
              },
              "trigger": {
                "type": "string"
              }
            }
          },
          "timeouts": {
            "type": "object",
            "title": "The timeouts schema",
            "example": {
              "login": 60,
              "session": 60
            },
            "properties": {
              "login": {
                "type": "integer"
              },
              "session": {
                "type": "integer"
              }
            }
          },
          "traceroute": {
            "type": "object",
            "title": "The traceroute schema",
            "example": {
              "protocol": "icmp",
              "scope": [
                "10.0.0.0/8",
                "100.64.0.0/10",
                "169.254.0.0/16",
                "172.16.0.0/12",
                "192.168.0.0/16"
              ]
            },
            "properties": {
              "port": {
                "type": "string"
              },
              "protocol": {
                "type": "string"
              },
              "scope": {
                "type": "array",
                "items": {
                  "type": "string",
                  "format": "ipv4"
                }
              }
            }
          }
        }
      }
    },
    "required": [
      "body"
    ]
  },
  "outputSchema": {
    "type": "object",
    "properties": {
      "body": {
        "type": "object",
        "description": "Individual snapshot settings response.",
        "properties": {
          "allowTelnet": {
            "default": true,
            "type": "boolean",
            "description": "Enable/Disable telnet for discovery",
            "example": true
          },
          "backup": {
            "title": "The backup schema",
            "type": "object",
            "description": "Backup configuration for IP Fabric.",
            "example": {
              "cron": "0 23 * * *",
              "enabled": false,
              "server": "backup.server.io",
              "type": "ftp",
              "username": "username",
              "password": "password"
            },
            "properties": {
              "cron": {
                "type": "string"
              },
              "directory": {
                "type": "string"
              },
              "enabled": {
                "type": "boolean"
              },
              "server": {
                "type": "string"
              },
              "type": {
                "type": "string",
                "enum": [
                  "ftp",
                  "sftp",
                  "local"
                ]
              },
              "username": {
                "type": "string"
              },
              "password": {
                "type": "string"
              }
            }
          },
          "checkSavedConfig": {
            "title": "The checkSavedConfig schema",
            "type": "boolean",
            "example": true,
            "default": false
          },
          "cliRetryLimit": {
            "title": "The cliRetryLimit schema",
            "type": "object",
            "example": {
              "authFail": 2,
              "default": 3,
              "tacacs": {
                "delay": 1000,
                "retry": 1
              }
            },
            "properties": {
              "authFail": {
                "type": "integer"
              },
              "default": {
                "type": "integer"
              },
              "tacacs": {
                "type": "object",
                "properties": {
                  "delay": {
                    "default": 1000,
                    "type": "integer"
                  },
                  "retry": {
                    "default": 0,
                    "type": "integer"
                  }
                }
              }
            }
          },
          "cliSessionsLimit": {
            "title": "The cliSessionsLimit schema",
            "type": "object",
            "example": {
              "enabled": false,
              "limit": 5
            },
            "properties": {
              "enabled": {
                "default": false,
                "type": "boolean"
              },
              "limit": {
                "default": 0,
                "type": "integer"
              }
            }
          },
          "credentials": {
            "title": "The credentials schema",
            "type": "array",
            "example": [
              {
                "excludeNetworks": [
                  "1.1.1.1/32",
                  "8.8.8.8/32"
                ],
                "network": [
                  "192.168.0.0/16",
                  "10.0.0.0/8"
                ],
                "expirationDate": {
                  "enabled": true,
                  "value": {}
                },
                "id": "9a5340e5-ef75-4962-a694-fb7a683f8e2a",
                "priority": 1,
                "password": "password",
                "syslog": true
              },
              {
                "excludeNetworks": [],
                "network": [],
                "expirationDate": {
                  "enabled": false
                },
                "id": "sdf340e5-ef75-4962-a694-fb7a6asd8e2a",
                "priority": 2,
                "syslog": true
              }
            ],
            "items": {
              "type": "object",
              "properties": {
                "excludeNetworks": {
                  "type": "array",
                  "items": {
                    "type": "string",
                    "format": "ipv4"
                  }
                },
                "networks": {
                  "type": "array",
                  "items": {
                    "type": "string",
                    "format": "ipv4"
                  }
                },
                "expirationDate": {
                  "type": "object",
                  "properties": {
                    "enabled": {
                      "type": "boolean",
                      "default": false
                    },
                    "value": {
                      "type": "string",
                      "format": "date-time"
                    }
                  }
                },
                "id": {
                  "type": "string",
                  "format": "uuid"
                },
                "priority": {
                  "type": "integer"
                },
                "password": {
                  "type": "string"
                },
                "syslog": {
                  "type": "boolean",
                  "default": false
                }
              }
            }
          },
          "privileges": {
            "type": "array",
            "title": "The privileges schema",
            "default": [],
            "example": [
              {
                "excludeNetworks": [],
                "expirationDate": {
                  "enabled": false
                },
                "id": "3233fd2a-3036-4dd5-9845-e984e9238c00",
                "includeNetworks": [
                  "0.0.0.0/0"
                ],
                "notes": "Main Enable password",
                "password": "829ec229e38314",
                "priority": 1,
                "username": ""
              }
            ],
            "items": {
              "type": "object",
              "properties": {
                "excludeNetworks": {
                  "type": "array",
                  "items": {
                    "type": "string",
                    "format": "ipv4"
                  }
                },
                "networks": {
                  "type": "array",
                  "items": {
                    "type": "string",
                    "format": "ipv4"
                  }
                },
                "expirationDate": {
                  "type": "object",
                  "properties": {
                    "enabled": {
                      "type": "boolean",
                      "default": false
                    },
                    "value": {
                      "type": "string",
                      "format": "date-time"
                    }
                  }
                },
                "id": {
                  "type": "string",
                  "format": "uuid"
                },
                "priority": {
                  "type": "integer"
                },
                "password": {
                  "type": "string"
                }
              }
            }
          },
          "customerName": {
            "type": "string",
            "title": "The customerName schema",
            "example": "Test Customer"
          },
          "fullBgpLimit": {
            "type": "object",
            "title": "The fullBgpLimit schema",
            "example": {
              "enabled": true,
              "threshold": 10000
            },
            "properties": {
              "enabled": {
                "type": "boolean"
              },
              "threshold": {
                "type": "integer"
              }
            }
          },
          "limitDiscoveryTasks": {
            "type": "object",
            "title": "The limitDiscoveryTasks schema",
            "example": {
              "alreadyDiscovered": false,
              "sourceOfTasks": [
                "xdp",
                "arp",
                "routes",
                "trace"
              ]
            },
            "properties": {
              "alreadyDiscovered": {
                "type": "boolean"
              },
              "sourceOfTasks": {
                "type": "array",
                "items": {
                  "type": "string"
                }
              }
            }
          },
          "maintenance": {
            "title": "The maintenance schema",
            "type": "object",
            "example": {
              "cron": "0 0 * * *",
              "enabled": true
            },
            "properties": {
              "cron": {
                "type": "string"
              },
              "enabled": {
                "type": "boolean"
              }
            }
          },
          "networks": {
            "title": "The networks schema",
            "type": "object",
            "example": {
              "exclude": [
                "8.8.8.8/32"
              ],
              "include": [
                "0.0.0.0/0"
              ],
              "properties": {
                "exclude": {
                  "type": "array",
                  "items": {
                    "type": "string",
                    "format": "ipv4"
                  }
                },
                "include": {
                  "type": "array",
                  "items": {
                    "type": "string",
                    "format": "ipv4"
                  }
                }
              }
            }
          },
          "resolveNames": {
            "type": "object",
            "title": "The resolveNames schema",
            "example": {
              "discoveryDevices": true
            },
            "properties": {
              "discoveryDevices": {
                "type": "boolean"
              }
            }
          },
          "scanner": {
            "type": "object",
            "title": "The scanner schema",
            "example": {
              "enabled": false,
              "shortestMask": 20
            },
            "properties": {
              "enabled": {
                "type": "boolean"
              },
              "shortestMask": {
                "type": "integer"
              }
            }
          },
          "seedList": {
            "type": "array",
            "title": "The seedList schema",
            "default": [],
            "example": [
              "192.168.110.3",
              "10.47.255.101"
            ],
            "items": {
              "type": "string",
              "format": "ipv4"
            }
          },
          "siteSeparation": {
            "type": "array",
            "title": "The siteSeparation schema",
            "example": [
              {
                "id": "90b7dd11-1ab2-42c9-8665-0b137afe50a0",
                "note": "L1DC",
                "regex": "L1(?:R1[4-8]|R7|FW56|SW[3-4])",
                "siteName": "L1DC",
                "transformation": "uppercase",
                "type": "regex"
              },
              {
                "id": "8680156c-bfc6-4a76-92f9-d0f8f5a7c0e5",
                "note": "MAIN REGEX Rule",
                "regex": "^(\\w\\d{1,3}|HWLAB|HUA)",
                "transformation": "uppercase",
                "type": "regex"
              }
            ],
            "items": {
              "type": "object",
              "properties": {
                "id": {
                  "type": "string",
                  "format": "uuid"
                },
                "note": {
                  "type": "string"
                },
                "regex": {
                  "type": "string"
                },
                "siteName": {
                  "type": "string"
                },
                "transformation": {
                  "type": "string"
                },
                "type": {
                  "type": "string"
                }
              }
            }
          },
          "siteTypeCalc": {
            "type": "string",
            "title": "The siteTypeCalc schema",
            "example": "rules"
          },
          "snapshots": {
            "type": "object",
            "title": "The snapshots schema",
            "example": {
              "cron": "0 * * * *",
              "enabled": false,
              "maxLoaded": 3,
              "maxLocked": 1
            },
            "properties": {
              "cron": {
                "type": "string"
              },
              "enabled": {
                "type": "boolean"
              },
              "maxLoaded": {
                "type": "integer"
              },
              "maxLocked": {
                "type": "integer"
              }
            }
          },
          "snmp": {
            "type": "object",
            "title": "The snmp schema",
            "example": {
              "communityString": "community04",
              "enabled": false,
              "hostIp": "192.168.10.10",
              "locality": "Prague, DC",
              "systemContact": "Mr. Johnson",
              "username": "snmpUser",
              "version": "v2c"
            },
            "properties": {
              "communityString": {
                "type": "string"
              },
              "enabled": {
                "type": "boolean"
              },
              "hostIp": {
                "type": "string",
                "format": "ipv4"
              },
              "locality": {
                "type": "string"
              },
              "systemContact": {
                "type": "string"
              },
              "username": {
                "type": "string"
              },
              "version": {
                "type": "string"
              }
            }
          },
          "syslog": {
            "type": "object",
            "title": "The syslog schema",
            "example": {
              "cron": "0 0 * * *",
              "time": 60,
              "trigger": "syslogtrigger"
            },
            "properties": {
              "cron": {
                "type": "string"
              },
              "time": {
                "type": "integer"
              },
              "trigger": {
                "type": "string"
              }
            }
          },
          "timeouts": {
            "type": "object",
            "title": "The timeouts schema",
            "example": {
              "login": 60,
              "session": 60
            },
            "properties": {
              "login": {
                "type": "integer"
              },
              "session": {
                "type": "integer"
              }
            }
          },
          "traceroute": {
            "type": "object",
            "title": "The traceroute schema",
            "example": {
              "protocol": "icmp",
              "scope": [
                "10.0.0.0/8",
                "100.64.0.0/10",
                "169.254.0.0/16",
                "172.16.0.0/12",
                "192.168.0.0/16"
              ]
            },
            "properties": {
              "port": {
                "type": "string"
              },
              "protocol": {
                "type": "string"
              },
              "scope": {
                "type": "array",
                "items": {
                  "type": "string",
                  "format": "ipv4"
                }
              }
            }
          }
        }
      },
      "_id": {
        "type": "string",
        "pattern": "^[0-9a-f]{24}$"
      },
      "initiator": {
        "type": "string"
      },
      "snapshotDetails": {
        "type": "object",
        "properties": {
          "success": {
            "type": "boolean",
            "example": true
          }
        }
      }
    }
  },
  "created": "2021-09-07T16:02:35.673Z",
  "created_by": {
    "provenance": "Local AAA",
    "username": "admin@pronghorn",
    "firstname": "admin",
    "inactive": false,
    "email": ""
  },
  "createdVersion": "5.29.14-2020.2.47.0",
  "tags": [],
  "groups": []
}
