{
  "name": "IP Fabric Compare Network Routes from Snapshots",
  "webName": "IP Fabric Compare Network Routes from Snapshots",
  "vendor": "Itential",
  "product": "Itential Automation Platform",
  "osVersions": [],
  "apiVersions": [],
  "iapVersions": [
    "2022.1.x",
    "2023.1.x"
  ],
  "method": "",
  "type": "Workflow Project",
  "domains": [],
  "tags": [],
  "useCases": [],
  "deprecated": {
    "isDeprecated": true,
    "deprecatedOn": "2024-09-01",
    "endOfLife": "2025-09-01",
    "replacedBy": {
      "name": "IP Fabric - REST",
      "webName": "IP Fabric - Modular Workflows",
      "isProductFeature": false,
      "overview": "This contains modular workflows that operate when integrated with the IP Fabric solution. Once installed teams will be able to quickly automate common manual tasks such as network service path analysis, saving a significant amount of time and effort. This library can be used as modular components with other libraries and automations to build comprehensive end-to-end orchestrated workflows with Itential's low-code platform.",
      "repoLink": "https://gitlab.com/itentialopensource/pre-built-automations/ip-fabric-rest",
      "docLink": "",
      "webLink": ""
    }
  },
  "brokerSince": "",
  "documentation": {
    "storeLink": "",
    "npmLink": "",
    "repoLink": "",
    "docLink": "",
    "demoLinks": [],
    "trainingLinks": [],
    "faqLink": "",
    "contributeLink": "",
    "issueLink": "",
    "webLink": "",
    "vendorLink": "",
    "productLink": "",
    "apiLinks": []
  },
  "assets": [],
  "relatedItems": {
    "adapters": [],
    "integrations": [],
    "ecosystemApplications": [],
    "workflowProjects": [],
    "transformationProjects": [],
    "exampleProjects": []
  }
}