{
  "_id": "61d705121d80cd01af41ddce",
  "name": "DNS Management Infoblox",
  "description": "Automation of DNS management in Infoblox",
  "componentName": "DNS Management Infoblox",
  "componentType": "workflows",
  "gbac": {
    "write": [],
    "read": []
  },
  "created": "2022-01-06T15:04:50.216Z",
  "createdBy": "kay.wolfe@itential.com",
  "lastUpdated": "2022-01-06T15:04:50.216Z",
  "lastUpdatedBy": "kay.wolfe@itential.com",
  "triggers": [
    {
      "_id": "61d705121d80cd01af41ddcf",
      "created": "2022-01-06T15:04:50.594Z",
      "createdBy": "kay.wolfe@itential.com",
      "lastUpdated": "2022-01-06T15:04:50.594Z",
      "lastUpdatedBy": "kay.wolfe@itential.com",
      "name": "Manual Trigger (migrated from DNS Management Infoblox)",
      "type": "manual",
      "enabled": true,
      "actionType": "automations",
      "actionId": "61d705121d80cd01af41ddce",
      "formId": "DNS Management Infoblox",
      "formData": null,
      "migrationVersion": 1
    }
  ]
}