{
  "name": "DNS Management Infoblox A Records",
  "tasks": {
    "6386": {
      "name": "makeData",
      "summary": "Delete A Record Success",
      "description": "Make Data",
      "location": "Application",
      "locationType": null,
      "app": "WorkFlowEngine",
      "displayName": "Tools",
      "type": "automatic",
      "variables": {
        "incoming": {
          "input": "A Record, <b><!name!></b>, deleted <b><font color=\"green\">successfully</font></b> from Infoblox!",
          "outputType": "string",
          "variables": "$var.36e8.merged_object"
        },
        "outgoing": {
          "output": null
        },
        "error": ""
      },
      "deprecated": false,
      "matched": [
        {
          "key": "name",
          "highlightString": "<span class='highlight-string'>make</span>Data"
        },
        {
          "key": "summary",
          "highlightString": "<span class='highlight-string'>Make</span> Data"
        },
        {
          "key": "description",
          "highlightString": "<span class='highlight-string'>Make</span> Data"
        }
      ],
      "groups": [],
      "actor": "Pronghorn",
      "x": 0.6115942028985507,
      "y": -1.8479041916167664,
      "scheduled": false
    },
    "9200": {
      "name": "query",
      "summary": "Query View",
      "description": "Query data using a dot/bracket notation string and a matching key/value pair.",
      "location": "Application",
      "locationType": null,
      "app": "WorkFlowEngine",
      "displayName": "WorkFlowEngine",
      "type": "operation",
      "variables": {
        "incoming": {
          "pass_on_null": false,
          "query": "dnsView",
          "obj": "$var.78b5.current_item"
        },
        "outgoing": {
          "return_data": null
        },
        "error": ""
      },
      "deprecated": false,
      "matched": [
        {
          "key": "name",
          "highlightString": "<span class='highlight-string'>query</span>"
        },
        {
          "key": "summary",
          "highlightString": "<span class='highlight-string'>Query</span> Data Using 'json-query' Format"
        },
        {
          "key": "description",
          "highlightString": "<span class='highlight-string'>Query</span> data using a dot/bracket notation string and a matching key/value pair."
        }
      ],
      "groups": [],
      "x": -0.24130434782608695,
      "y": -1.8610778443113773,
      "scheduled": false
    },
    "workflow_start": {
      "name": "workflow_start",
      "groups": [],
      "x": -0.691304347826087,
      "y": -2.2047904191616765
    },
    "workflow_end": {
      "name": "workflow_end",
      "groups": [],
      "x": 0.9355072463768116,
      "y": -2.1952095808383234
    },
    "78b5": {
      "name": "forEach",
      "summary": "A Record Loop",
      "description": "Iterate over each item in an array",
      "location": "Application",
      "locationType": null,
      "app": "WorkFlowEngine",
      "displayName": "WorkFlowEngine",
      "type": "operation",
      "variables": {
        "incoming": {
          "data_array": "$var.job.data_array"
        },
        "outgoing": {
          "current_item": null
        },
        "error": "$var.job.lastError"
      },
      "deprecated": false,
      "matched": [],
      "groups": [],
      "x": -0.3228395061728395,
      "y": -2.2020304568527918,
      "scheduled": false
    },
    "4ff8": {
      "name": "query",
      "summary": "Get Action Name",
      "description": "Get the action name",
      "location": "Application",
      "locationType": null,
      "app": "WorkFlowEngine",
      "displayName": "WorkFlowEngine",
      "type": "operation",
      "variables": {
        "incoming": {
          "pass_on_null": false,
          "query": "action",
          "obj": "$var.78b5.current_item"
        },
        "outgoing": {
          "return_data": null
        },
        "error": ""
      },
      "deprecated": false,
      "matched": [],
      "groups": [],
      "x": -0.1644927536231884,
      "y": -1.7221556886227545,
      "scheduled": false
    },
    "821c": {
      "name": "evaluation",
      "summary": "Run Evaluation",
      "description": "Run an evaluation",
      "location": "Application",
      "locationType": null,
      "app": "WorkFlowEngine",
      "displayName": "WorkFlowEngine",
      "type": "operation",
      "variables": {
        "incoming": {
          "all_true_flag": false,
          "evaluation_groups": [
            {
              "all_true_flag": false,
              "evaluations": [
                {
                  "query": "",
                  "operand_1": {
                    "variable": "return_data",
                    "task": "4ff8"
                  },
                  "operator": "==",
                  "operand_2": {
                    "variable": "Create",
                    "task": "static"
                  }
                }
              ]
            }
          ]
        },
        "outgoing": {
          "return_value": null
        }
      },
      "deprecated": false,
      "matched": [],
      "groups": [],
      "x": -0.02463768115942029,
      "y": -1.5844311377245508
    },
    "a69f": {
      "name": "query",
      "summary": "Query IPv4 Address",
      "description": "Query data using a dot/bracket notation string and a matching key/value pair.",
      "location": "Application",
      "locationType": null,
      "app": "WorkFlowEngine",
      "displayName": "WorkFlowEngine",
      "type": "operation",
      "variables": {
        "incoming": {
          "pass_on_null": false,
          "query": "iPv4Address",
          "obj": "$var.78b5.current_item"
        },
        "outgoing": {
          "return_data": null
        },
        "error": ""
      },
      "deprecated": false,
      "matched": [
        {
          "key": "name",
          "highlightString": "<span class='highlight-string'>query</span>"
        },
        {
          "key": "summary",
          "highlightString": "<span class='highlight-string'>Query</span> Data Using 'json-query' Format"
        },
        {
          "key": "description",
          "highlightString": "<span class='highlight-string'>Query</span> data using a dot/bracket notation string and a matching key/value pair."
        }
      ],
      "groups": [],
      "x": -0.4036231884057971,
      "y": -1.8706586826347305,
      "scheduled": false
    },
    "3e61": {
      "name": "query",
      "summary": "Query hostName",
      "description": "Query data using a dot/bracket notation string and a matching key/value pair.",
      "location": "Application",
      "locationType": null,
      "app": "WorkFlowEngine",
      "displayName": "WorkFlowEngine",
      "type": "operation",
      "variables": {
        "incoming": {
          "pass_on_null": false,
          "query": "hostName",
          "obj": "$var.78b5.current_item"
        },
        "outgoing": {
          "return_data": null
        },
        "error": ""
      },
      "deprecated": false,
      "matched": [
        {
          "key": "name",
          "highlightString": "<span class='highlight-string'>query</span>"
        },
        {
          "key": "summary",
          "highlightString": "<span class='highlight-string'>Query</span> Data Using 'json-query' Format"
        },
        {
          "key": "description",
          "highlightString": "<span class='highlight-string'>Query</span> data using a dot/bracket notation string and a matching key/value pair."
        }
      ],
      "groups": [],
      "x": -0.322463768115942,
      "y": -1.9976047904191616,
      "scheduled": false
    },
    "36e8": {
      "name": "merge",
      "summary": "Merge A Data for Infoblox",
      "description": "Merge data into a single object",
      "location": "Application",
      "locationType": null,
      "app": "WorkFlowEngine",
      "displayName": "WorkFlowEngine",
      "type": "operation",
      "variables": {
        "incoming": {
          "data_to_merge": [
            {
              "key": "name",
              "value": {
                "task": "3e61",
                "variable": "return_data"
              }
            },
            {
              "key": "ipv4addr",
              "value": {
                "task": "a69f",
                "variable": "return_data"
              }
            },
            {
              "key": "view",
              "value": {
                "task": "9200",
                "variable": "return_data"
              }
            }
          ]
        },
        "outgoing": {
          "merged_object": null
        }
      },
      "deprecated": false,
      "matched": [
        {
          "key": "name",
          "highlightString": "<span class='highlight-string'>merge</span>"
        },
        {
          "key": "summary",
          "highlightString": "<span class='highlight-string'>Merge</span> Data"
        },
        {
          "key": "description",
          "highlightString": "<span class='highlight-string'>Merge</span> data into a single object"
        }
      ],
      "groups": [],
      "x": -0.322463768115942,
      "y": -1.7233532934131737
    },
    "3f1c": {
      "name": "push",
      "summary": "Push Item to Array",
      "description": "Push item to a job variable array",
      "location": "Application",
      "locationType": null,
      "app": "WorkFlowEngine",
      "displayName": "WorkFlowEngine",
      "type": "operation",
      "variables": {
        "incoming": {
          "job_variable": "aRecordResults",
          "item_to_push": "$var.4c76.output"
        },
        "outgoing": {
          "job_variable_value": null
        }
      },
      "deprecated": false,
      "matched": [
        {
          "key": "name",
          "highlightString": "<span class='highlight-string'>push</span>"
        },
        {
          "key": "summary",
          "highlightString": "<span class='highlight-string'>Push</span> Item to Array"
        },
        {
          "key": "description",
          "highlightString": "<span class='highlight-string'>Push</span> item to a job variable array"
        }
      ],
      "groups": [],
      "x": 0.6021739130434782,
      "y": -1.5952095808383233
    },
    "b4ad": {
      "name": "createARecord",
      "summary": "Create (POST) A Record",
      "description": "Create A Record",
      "location": "Adapter",
      "locationType": "Infoblox",
      "app": "Infoblox",
      "displayName": "Infoblox",
      "type": "automatic",
      "variables": {
        "incoming": {
          "body": "$var.36e8.merged_object",
          "adapter_id": "infoblox"
        },
        "outgoing": {
          "result": null
        },
        "error": "$var.job.error",
        "decorators": []
      },
      "deprecated": false,
      "matched": [
        {
          "key": "app",
          "highlightString": "<span class='highlight-string'>Infoblox</span>"
        }
      ],
      "groups": [],
      "actor": "Pronghorn",
      "x": 0.15869565217391304,
      "y": -1.591616766467066,
      "scheduled": false
    },
    "4c76": {
      "name": "makeData",
      "summary": "Create A Record Success",
      "description": "Make Data",
      "location": "Application",
      "locationType": null,
      "app": "WorkFlowEngine",
      "displayName": "Tools",
      "type": "automatic",
      "variables": {
        "incoming": {
          "input": "A Record, <b><!name!></b>, created <b><font color=\"green\">successfully</font></b> in Infoblox!",
          "outputType": "string",
          "variables": "$var.36e8.merged_object"
        },
        "outgoing": {
          "output": null
        },
        "error": ""
      },
      "deprecated": false,
      "matched": [
        {
          "key": "name",
          "highlightString": "<span class='highlight-string'>make</span>Data"
        },
        {
          "key": "summary",
          "highlightString": "<span class='highlight-string'>Make</span> Data"
        },
        {
          "key": "description",
          "highlightString": "<span class='highlight-string'>Make</span> Data"
        }
      ],
      "groups": [],
      "actor": "Pronghorn",
      "x": 0.3927536231884058,
      "y": -1.592814371257485,
      "scheduled": false
    },
    "426c": {
      "name": "evaluation",
      "summary": "Run Evaluation",
      "description": "Run an evaluation",
      "location": "Application",
      "locationType": null,
      "app": "WorkFlowEngine",
      "displayName": "WorkFlowEngine",
      "type": "operation",
      "variables": {
        "incoming": {
          "all_true_flag": false,
          "evaluation_groups": [
            {
              "all_true_flag": false,
              "evaluations": [
                {
                  "query": "",
                  "operand_1": {
                    "variable": "return_data",
                    "task": "4ff8"
                  },
                  "operator": "==",
                  "operand_2": {
                    "variable": "Delete",
                    "task": "static"
                  }
                }
              ]
            }
          ]
        },
        "outgoing": {
          "return_value": null
        }
      },
      "deprecated": false,
      "matched": [],
      "groups": [],
      "x": -0.02318840579710145,
      "y": -1.8407185628742515
    },
    "c287": {
      "name": "getObject",
      "summary": "getObject",
      "description": "Gets any object using its type",
      "location": "Adapter",
      "locationType": "Infoblox",
      "app": "Infoblox",
      "displayName": "Infoblox",
      "type": "automatic",
      "variables": {
        "incoming": {
          "objectType": "record:a",
          "queryObject": "$var.36e8.merged_object",
          "returnFields": "name,ipv4addr",
          "adapter_id": "infoblox"
        },
        "outgoing": {
          "result": null
        },
        "error": "$var.job.error",
        "decorators": []
      },
      "deprecated": false,
      "matched": [
        {
          "key": "app",
          "highlightString": "<span class='highlight-string'>Infoblox</span>"
        }
      ],
      "groups": [],
      "actor": "Pronghorn",
      "x": 0.15507246376811595,
      "y": -1.844311377245509,
      "scheduled": false
    },
    "5a0f": {
      "name": "query",
      "summary": "Query A Record _ref",
      "description": "Query data using a dot/bracket notation string and a matching key/value pair.",
      "location": "Application",
      "locationType": null,
      "app": "WorkFlowEngine",
      "displayName": "WorkFlowEngine",
      "type": "operation",
      "variables": {
        "incoming": {
          "pass_on_null": false,
          "query": "response.result._ref[0]",
          "obj": "$var.c287.result"
        },
        "outgoing": {
          "return_data": null
        },
        "error": ""
      },
      "deprecated": false,
      "matched": [
        {
          "key": "name",
          "highlightString": "<span class='highlight-string'>query</span>"
        },
        {
          "key": "summary",
          "highlightString": "<span class='highlight-string'>Query</span> Data Using 'json-query' Format"
        },
        {
          "key": "description",
          "highlightString": "<span class='highlight-string'>Query</span> data using a dot/bracket notation string and a matching key/value pair."
        }
      ],
      "groups": [],
      "x": 0.28405797101449276,
      "y": -1.844311377245509,
      "scheduled": false
    },
    "39a4": {
      "name": "push",
      "summary": "Push Item to Array",
      "description": "Push item to a job variable array",
      "location": "Application",
      "locationType": null,
      "app": "WorkFlowEngine",
      "displayName": "WorkFlowEngine",
      "type": "operation",
      "variables": {
        "incoming": {
          "job_variable": "aRecordResults",
          "item_to_push": "$var.6386.output"
        },
        "outgoing": {
          "job_variable_value": null
        }
      },
      "deprecated": false,
      "matched": [
        {
          "key": "name",
          "highlightString": "<span class='highlight-string'>push</span>"
        },
        {
          "key": "summary",
          "highlightString": "<span class='highlight-string'>Push</span> Item to Array"
        },
        {
          "key": "description",
          "highlightString": "<span class='highlight-string'>Push</span> item to a job variable array"
        }
      ],
      "groups": [],
      "x": 0.8130434782608695,
      "y": -1.845508982035928
    },
    "4f72": {
      "name": "deleteObject",
      "summary": "deleteObject",
      "description": "Deletes any object using its object reference",
      "location": "Adapter",
      "locationType": "Infoblox",
      "app": "Infoblox",
      "displayName": "Infoblox",
      "type": "automatic",
      "variables": {
        "incoming": {
          "objectReference": "$var.5a0f.return_data",
          "adapter_id": "infoblox"
        },
        "outgoing": {
          "result": null
        },
        "error": "$var.job.error",
        "decorators": []
      },
      "deprecated": false,
      "matched": [
        {
          "key": "name",
          "highlightString": "<span class='highlight-string'>delete</span>Object"
        },
        {
          "key": "summary",
          "highlightString": "<span class='highlight-string'>delete</span>Object"
        },
        {
          "key": "description",
          "highlightString": "<span class='highlight-string'>Delete</span>s any object using its object reference"
        }
      ],
      "groups": [],
      "actor": "Pronghorn",
      "x": 0.4152173913043478,
      "y": -1.8467065868263473,
      "scheduled": false
    },
    "a897": {
      "name": "newVariable",
      "summary": "Create a Job Variable",
      "description": "Create a new Job variable by Job ID and assign it a value.",
      "location": "Application",
      "locationType": null,
      "app": "WorkFlowEngine",
      "displayName": "WorkFlowEngine",
      "type": "operation",
      "variables": {
        "incoming": {
          "name": "aRecordResults",
          "value": []
        },
        "outgoing": {
          "value": null
        }
      },
      "deprecated": false,
      "matched": [
        {
          "key": "name",
          "highlightString": "new<span class='highlight-string'>Variable</span>"
        },
        {
          "key": "summary",
          "highlightString": "Create a Job <span class='highlight-string'>Variable</span>"
        },
        {
          "key": "description",
          "highlightString": "Create a new Job <span class='highlight-string'>variable</span> by Job ID and assign it a value."
        }
      ],
      "groups": [],
      "x": -0.5101449275362319,
      "y": -2.2047904191616765
    },
    "a8a0": {
      "name": "ViewData",
      "canvasName": "ViewData",
      "summary": "adapter error",
      "description": "Displays a message and runtime data to an operator. This can be used to request a decision, or used for acknowledgement only.",
      "location": "Application",
      "app": "WorkFlowEngine",
      "displayName": "WorkFlowEngine",
      "type": "manual",
      "variables": {
        "incoming": {
          "header": "adapter error",
          "message": "Please find adapter error.",
          "body": "$var.job.error",
          "variables": "",
          "btn_success": "Retry",
          "btn_failure": "End"
        },
        "outgoing": {},
        "error": "",
        "decorators": []
      },
      "view": "/workflow_engine/task/ViewData",
      "deprecated": false,
      "matched": [
        {
          "key": "canvasName",
          "highlightString": "<span class='highlight-string'>ViewData</span>"
        }
      ],
      "groups": [],
      "x": 0.15407262021589793,
      "y": -2.3992583436341164,
      "scheduled": false
    },
    "2cca": {
      "name": "ViewData",
      "canvasName": "ViewData",
      "summary": "adapter error",
      "description": "Displays a message and runtime data to an operator. This can be used to request a decision, or used for acknowledgement only.",
      "location": "Application",
      "app": "WorkFlowEngine",
      "displayName": "WorkFlowEngine",
      "type": "manual",
      "variables": {
        "incoming": {
          "header": "adapter error",
          "message": "Please find adapter error.",
          "body": "$var.job.error",
          "variables": "",
          "btn_success": "Retry",
          "btn_failure": "End"
        },
        "outgoing": {},
        "error": "",
        "decorators": []
      },
      "view": "/workflow_engine/task/ViewData",
      "deprecated": false,
      "matched": [
        {
          "key": "canvasName",
          "highlightString": "<span class='highlight-string'>ViewData</span>"
        }
      ],
      "groups": [],
      "x": 0.15309126594700687,
      "y": -1.161928306551298,
      "scheduled": false
    },
    "75bc": {
      "name": "ViewData",
      "canvasName": "ViewData",
      "summary": "adapter error",
      "description": "Displays a message and runtime data to an operator. This can be used to request a decision, or used for acknowledgement only.",
      "location": "Application",
      "app": "WorkFlowEngine",
      "displayName": "WorkFlowEngine",
      "type": "manual",
      "variables": {
        "incoming": {
          "header": "adapter error",
          "message": "Please find adapter error.",
          "body": "$var.job.error",
          "variables": "",
          "btn_success": "Retry",
          "btn_failure": "End"
        },
        "outgoing": {},
        "error": "",
        "decorators": []
      },
      "view": "/workflow_engine/task/ViewData",
      "deprecated": false,
      "matched": [
        {
          "key": "canvasName",
          "highlightString": "<span class='highlight-string'>ViewData</span>"
        }
      ],
      "groups": [],
      "x": 0.42198233562315995,
      "y": -2.3992583436341164,
      "scheduled": false
    }
  },
  "transitions": {
    "220": {},
    "1599": {},
    "3973": {},
    "6386": {
      "39a4": {
        "type": "standard",
        "state": "success"
      }
    },
    "7588": {},
    "7780": {},
    "9200": {
      "36e8": {
        "type": "standard",
        "state": "success"
      }
    },
    "workflow_start": {
      "a897": {
        "type": "standard",
        "state": "success"
      }
    },
    "workflow_end": {},
    "4cd0": {},
    "f695": {},
    "b11a": {},
    "78b5": {
      "3e61": {
        "type": "standard",
        "state": "loop"
      },
      "workflow_end": {
        "type": "standard",
        "state": "success"
      }
    },
    "4ff8": {
      "821c": {
        "type": "standard",
        "state": "success"
      },
      "426c": {
        "type": "standard",
        "state": "success"
      }
    },
    "ea5a": {},
    "bca": {},
    "61c7": {},
    "a5b6": {},
    "e9e0": {},
    "c233": {},
    "24a4": {},
    "9d3e": {},
    "ecf": {},
    "1a0c": {},
    "b6a2": {},
    "d470": {},
    "6ba6": {},
    "168c": {},
    "32da": {},
    "b133": {},
    "86f4": {},
    "7cd2": {},
    "4a91": {},
    "50a1": {},
    "e847": {},
    "4cb": {},
    "c5bd": {},
    "f50e": {},
    "98e0": {},
    "adc5": {},
    "d54a": {},
    "462d": {},
    "333c": {},
    "b03e": {},
    "e50": {},
    "821c": {
      "b4ad": {
        "type": "standard",
        "state": "success"
      }
    },
    "5c83": {},
    "a11c": {},
    "a69f": {
      "36e8": {
        "type": "standard",
        "state": "success"
      }
    },
    "3e61": {
      "9200": {
        "type": "standard",
        "state": "success"
      },
      "a69f": {
        "type": "standard",
        "state": "success"
      }
    },
    "36e8": {
      "4ff8": {
        "type": "standard",
        "state": "success"
      }
    },
    "3f1c": {},
    "be54": {},
    "b4ad": {
      "4c76": {
        "type": "standard",
        "state": "success"
      },
      "2cca": {
        "type": "standard",
        "state": "error"
      }
    },
    "4c76": {
      "3f1c": {
        "type": "standard",
        "state": "success"
      }
    },
    "73f4": {},
    "57a1": {},
    "762c": {},
    "a005": {},
    "426c": {
      "c287": {
        "type": "standard",
        "state": "success"
      }
    },
    "cde7": {},
    "c287": {
      "5a0f": {
        "type": "standard",
        "state": "success"
      },
      "a8a0": {
        "type": "standard",
        "state": "error"
      }
    },
    "5a0f": {
      "4f72": {
        "type": "standard",
        "state": "success"
      }
    },
    "39a4": {},
    "4f72": {
      "6386": {
        "type": "standard",
        "state": "success"
      },
      "75bc": {
        "type": "standard",
        "state": "error"
      }
    },
    "36b9": {},
    "a1d5": {},
    "a897": {
      "78b5": {
        "type": "standard",
        "state": "success"
      }
    },
    "a8a0": {
      "workflow_end": {
        "type": "standard",
        "state": "failure"
      },
      "c287": {
        "type": "revert",
        "state": "success"
      }
    },
    "2cca": {
      "workflow_end": {
        "type": "standard",
        "state": "failure"
      },
      "b4ad": {
        "type": "revert",
        "state": "success"
      }
    },
    "75bc": {
      "workflow_end": {
        "type": "standard",
        "state": "failure"
      },
      "4f72": {
        "type": "revert",
        "state": "success"
      }
    }
  },
  "font_size": 22,
  "created": "2020-02-05T14:18:04.657Z",
  "created_by": {
    "provenance": "Local AAA",
    "username": "admin@pronghorn",
    "firstname": "admin",
    "inactive": true
  },
  "createdVersion": "4.5.3-2019.2.7.0",
  "last_updated": "2022-06-17T17:18:07.793Z",
  "last_updated_by": {
    "provenance": "local_aaa",
    "username": "admin@pronghorn",
    "firstname": "admin",
    "inactive": false
  },
  "lastUpdatedVersion": "5.44.8-2021.2.31.0",
  "type": "automation",
  "description": null,
  "canvasVersion": 1,
  "inputSchema": {
    "type": "object",
    "properties": {
      "data_array": {
        "title": "data_array",
        "type": "array",
        "items": [
          {
            "type": [
              "string",
              "number",
              "integer",
              "object",
              "array",
              "boolean",
              "null"
            ]
          }
        ]
      }
    },
    "required": [
      "data_array"
    ]
  },
  "outputSchema": {
    "type": "object",
    "properties": {
      "data_array": {
        "title": "data_array",
        "type": "array",
        "items": [
          {
            "type": [
              "string",
              "number",
              "integer",
              "object",
              "array",
              "boolean",
              "null"
            ]
          }
        ]
      },
      "_id": {
        "type": "string",
        "pattern": "^[0-9a-f]{24}$"
      },
      "initiator": {
        "type": "string"
      },
      "lastError": {
        "type": [
          "array",
          "boolean",
          "null",
          "number",
          "object",
          "string"
        ]
      },
      "aRecordResults": {
        "type": [
          "array",
          "boolean",
          "null",
          "number",
          "object",
          "string"
        ]
      },
      "error": {
        "type": [
          "array",
          "boolean",
          "null",
          "number",
          "object",
          "string"
        ]
      }
    }
  },
  "tags": [],
  "groups": [],
  "migrationVersion": 1
}
