{
  "canvasVersion": 1,
  "created": "2022-12-06T20:12:06.625Z",
  "createdVersion": "5.44.8-2021.2.31.0",
  "created_by": {
    "provenance": "local_aaa",
    "username": "admin@pronghorn",
    "firstname": "admin",
    "inactive": false
  },
  "decorators": [
    {
      "type": "encryption",
      "pointer": "/variables/errorResponse"
    },
    {
      "type": "encryption",
      "pointer": "/variables/errors"
    },
    {
      "type": "encryption",
      "pointer": "/variables/device"
    }
  ],
  "font_size": 12,
  "inputSchema": {
    "type": "object",
    "properties": {
      "device": {
        "$id": "device",
        "type": "object",
        "properties": {
          "device_name": {
            "type": "string",
            "examples": [
              "test_device"
            ]
          },
          "iag_adapter_instance": {
            "type": "string",
            "examples": [
              "DSUP IAG-2021%2E2"
            ]
          },
          "inventory_type": {
            "type": "string",
            "examples": [
              "ansible"
            ]
          }
        },
        "required": []
      },
      "verbose": {
        "$id": "verbose",
        "type": "boolean",
        "examples": [
          true,
          false
        ]
      }
    },
    "required": [
      "device",
      "verbose"
    ]
  },
  "lastUpdatedVersion": "5.44.8-2021.2.60.0",
  "last_updated": "2023-01-19T21:51:32.955Z",
  "last_updated_by": {
    "provenance": "local_aaa",
    "username": "admin@pronghorn",
    "firstname": "admin",
    "inactive": false
  },
  "name": "IAGGDD: Get Device Details",
  "outputSchema": {
    "type": "object",
    "properties": {
      "device": {
        "$id": "device",
        "type": "object",
        "properties": {
          "device_name": {
            "type": "string",
            "examples": [
              "test_device"
            ]
          },
          "iag_adapter_instance": {
            "type": "string",
            "examples": [
              "DSUP IAG-2021%2E2"
            ]
          },
          "inventory_type": {
            "type": "string",
            "examples": [
              "ansible"
            ]
          }
        },
        "required": []
      },
      "verbose": {
        "$id": "verbose",
        "type": "boolean",
        "examples": [
          true,
          false
        ]
      },
      "_id": {
        "type": "string",
        "pattern": "^[0-9a-f]{24}$"
      },
      "initiator": {
        "type": "string"
      },
      "ReturnStatus": {
        "type": [
          "array",
          "boolean",
          "null",
          "number",
          "object",
          "string"
        ]
      },
      "errorResponse": {
        "type": [
          "array",
          "boolean",
          "null",
          "number",
          "object",
          "string"
        ]
      },
      "status": {
        "type": "string"
      },
      "errors": {
        "type": "array"
      }
    }
  },
  "preAutomationTime": 0,
  "sla": 0,
  "tasks": {
    "2139": {
      "name": "newVariable",
      "canvasName": "newVariable",
      "summary": "Create a Job Variable",
      "description": "Create a new Job variable by Job ID and assign it a value.",
      "location": "Application",
      "locationType": null,
      "app": "WorkFlowEngine",
      "type": "operation",
      "displayName": "WorkFlowEngine",
      "variables": {
        "incoming": {
          "name": "ReturnStatus",
          "value": "$var.3822.ReturnStatus"
        },
        "outgoing": {
          "value": null
        }
      },
      "deprecated": false,
      "matched": [
        {
          "key": "canvasName",
          "highlightString": "<span class='highlight-string'>new</span><span class='highlight-string'>Variable</span>"
        },
        {
          "key": "description",
          "highlightString": "Create a <span class='highlight-string'>new</span> <span class='highlight-string'>Job</span> <span class='highlight-string'>variable</span> by Job ID and assign it a value."
        },
        {
          "key": "summary",
          "highlightString": "Create a <span class='highlight-string'>Job</span> <span class='highlight-string'>Variable</span>"
        }
      ],
      "groups": [],
      "x": 0.9539473684210527,
      "y": 0.5284552845528455
    },
    "2500": {
      "name": "ViewData",
      "canvasName": "ViewData",
      "summary": "View Get Device Details Return Status Data",
      "description": "View Get Device Details Return Status Data",
      "location": "Application",
      "app": "WorkFlowEngine",
      "displayName": "WorkFlowEngine",
      "type": "manual",
      "variables": {
        "incoming": {
          "header": "Get Device Details Return Status",
          "message": "View return status data below",
          "body": "$var.job.ReturnStatus",
          "variables": "",
          "btn_success": "Proceed",
          "btn_failure": ""
        },
        "outgoing": {},
        "error": "",
        "decorators": []
      },
      "view": "/workflow_engine/task/ViewData",
      "deprecated": false,
      "matched": [
        {
          "key": "canvasName",
          "highlightString": "<span class='highlight-string'>ViewData</span>"
        }
      ],
      "groups": [],
      "x": 1.5338345864661653,
      "y": 0.7252032520325203,
      "scheduled": false
    },
    "3786": {
      "name": "getInventoryDevice",
      "canvasName": "getInventoryDevice",
      "summary": "Get a particular device HTTP Request device from Automation Gateway",
      "description": "Get a particular device HTTP Request device from Automation Gateway",
      "location": "Adapter",
      "locationType": "AutomationGateway",
      "app": "AutomationGateway",
      "type": "automatic",
      "displayName": "AutomationGateway",
      "variables": {
        "incoming": {
          "integrationType": "$var.8576.inventoryType",
          "deviceName": "$var.8576.deviceName",
          "output": "",
          "adapter_id": "$var.8576.iagAdapterInstance"
        },
        "outgoing": {
          "result": null
        },
        "error": "$var.job.errorResponse",
        "decorators": [
          {
            "pointer": "/outgoing/result",
            "type": "encryption"
          }
        ]
      },
      "deprecated": false,
      "matched": [],
      "groups": [],
      "actor": "Pronghorn",
      "x": 0.22556390977443608,
      "y": 1.2975609756097561,
      "scheduled": false
    },
    "3822": {
      "name": "transformation",
      "canvasName": "transformation",
      "summary": "Construct Get Device Details Response for Ansible",
      "description": "Constructs response for Get Device Details workflow",
      "location": "Application",
      "locationType": null,
      "app": "WorkFlowEngine",
      "type": "operation",
      "displayName": "WorkFlowEngine",
      "variables": {
        "incoming": {
          "tr_id": "639cbf70e1b8a80103bc5c02",
          "variableMap": {
            "deviceDetails": "$var.9261.result",
            "errorResponse": "$var.job.errorResponse",
            "status": "$var.job.status",
            "deviceName": "$var.8576.deviceName",
            "inventoryType": "$var.8576.inventoryType",
            "errors": "$var.job.errors"
          },
          "options": {
            "extractOutput": true,
            "validateIncoming": true,
            "revertToDefaultValue": false
          }
        },
        "outgoing": {
          "ReturnStatus": null
        },
        "decorators": [
          {
            "pointer": "/incoming/variableMap/deviceDetails",
            "type": "encryption"
          },
          {
            "pointer": "/incoming/variableMap/errorResponse",
            "type": "encryption"
          },
          {
            "pointer": "/incoming/variableMap/status",
            "type": "encryption"
          },
          {
            "pointer": "/incoming/variableMap/deviceName",
            "type": "encryption"
          },
          {
            "pointer": "/incoming/variableMap/inventoryType",
            "type": "encryption"
          },
          {
            "pointer": "/incoming/variableMap/errors",
            "type": "encryption"
          }
        ]
      },
      "deprecated": false,
      "matched": [
        {
          "key": "description",
          "highlightString": "Perform a JSON Transformation using the <span class='highlight-string'>JST</span> library."
        }
      ],
      "groups": [],
      "x": 0.7133458646616542,
      "y": 0.5170731707317073,
      "task_name": "IAGUD: Construct Get Device Details Response",
      "retrySettings": null
    },
    "4472": {
      "name": "evaluation",
      "canvasName": "evaluation",
      "summary": "Run Evaluation to see whether device is Ansible",
      "description": "Run Evaluation to see whether device is Ansible",
      "location": "Application",
      "locationType": null,
      "app": "WorkFlowEngine",
      "type": "operation",
      "displayName": "WorkFlowEngine",
      "variables": {
        "incoming": {
          "all_true_flag": false,
          "evaluation_groups": [
            {
              "all_true_flag": false,
              "evaluations": [
                {
                  "query": "",
                  "operand_1": {
                    "variable": "inventoryType",
                    "task": "8576"
                  },
                  "operator": "==",
                  "operand_2": {
                    "variable": "ansible",
                    "task": "static"
                  },
                  "rightQuery": ""
                }
              ]
            }
          ]
        },
        "outgoing": {
          "return_value": null
        }
      },
      "deprecated": false,
      "matched": [
        {
          "key": "canvasName",
          "highlightString": "<span class='highlight-string'>eval</span>uation"
        },
        {
          "key": "summary",
          "highlightString": "Run <span class='highlight-string'>Eval</span>uation Task"
        },
        {
          "key": "description",
          "highlightString": "Run an <span class='highlight-string'>eval</span>uation"
        }
      ],
      "groups": [],
      "x": -0.1099624060150376,
      "y": 0.48292682926829267
    },
    "5179": {
      "name": "transformation",
      "canvasName": "transformation",
      "summary": "Construct Get Device Details Response for HTTP Request",
      "description": "Constructs response for Get Device Details workflow",
      "location": "Application",
      "locationType": null,
      "app": "WorkFlowEngine",
      "type": "operation",
      "displayName": "WorkFlowEngine",
      "variables": {
        "incoming": {
          "tr_id": "63a2250537f0350103037967",
          "variableMap": {
            "deviceDetails": "$var.3786.result",
            "errorResponse": "$var.job.errorResponse",
            "status": "$var.job.status",
            "deviceName": "$var.8576.deviceName",
            "inventoryType": "$var.8576.inventoryType",
            "errors": "$var.job.errors"
          },
          "options": {
            "extractOutput": true,
            "validateIncoming": true,
            "revertToDefaultValue": false
          }
        },
        "outgoing": {
          "ReturnStatus": null
        },
        "decorators": [
          {
            "pointer": "/incoming/variableMap/deviceDetails",
            "type": "encryption"
          },
          {
            "pointer": "/incoming/variableMap/errorResponse",
            "type": "encryption"
          },
          {
            "pointer": "/incoming/variableMap/status",
            "type": "encryption"
          },
          {
            "pointer": "/incoming/variableMap/deviceName",
            "type": "encryption"
          },
          {
            "pointer": "/incoming/variableMap/inventoryType",
            "type": "encryption"
          },
          {
            "pointer": "/incoming/variableMap/errors",
            "type": "encryption"
          }
        ]
      },
      "deprecated": false,
      "matched": [
        {
          "key": "description",
          "highlightString": "Perform a JSON Transformation using the <span class='highlight-string'>JST</span> library."
        }
      ],
      "groups": [],
      "x": 0.7161654135338346,
      "y": 1.3008130081300813,
      "task_name": "IAGGDD: Create Response Output HTTP Request",
      "retrySettings": null
    },
    "7158": {
      "name": "newVariable",
      "canvasName": "newVariable",
      "summary": "Create a Job Variable",
      "description": "Create a new Job variable by Job ID and assign it a value.",
      "location": "Application",
      "locationType": null,
      "app": "WorkFlowEngine",
      "type": "operation",
      "displayName": "WorkFlowEngine",
      "variables": {
        "incoming": {
          "name": "ReturnStatus",
          "value": "$var.b393.ReturnStatus"
        },
        "outgoing": {
          "value": null
        }
      },
      "deprecated": false,
      "matched": [
        {
          "key": "canvasName",
          "highlightString": "<span class='highlight-string'>new</span><span class='highlight-string'>Variable</span>"
        },
        {
          "key": "description",
          "highlightString": "Create a <span class='highlight-string'>new</span> <span class='highlight-string'>Job</span> <span class='highlight-string'>variable</span> by Job ID and assign it a value."
        },
        {
          "key": "summary",
          "highlightString": "Create a <span class='highlight-string'>Job</span> <span class='highlight-string'>Variable</span>"
        }
      ],
      "groups": [],
      "x": 1.3345864661654134,
      "y": 2.5170731707317073
    },
    "8576": {
      "name": "transformation",
      "canvasName": "transformation",
      "summary": "Extract Device Details",
      "description": "Extracts device name, inventory type, and adapter instance",
      "location": "Application",
      "locationType": null,
      "app": "WorkFlowEngine",
      "type": "operation",
      "displayName": "WorkFlowEngine",
      "variables": {
        "incoming": {
          "tr_id": "639cbc57e1b8a80103bc5c01",
          "variableMap": {
            "device": "$var.job.device",
            "verbose": "$var.job.verbose"
          },
          "options": {
            "extractOutput": false,
            "validateIncoming": true,
            "revertToDefaultValue": false
          }
        },
        "outgoing": {
          "deviceName": null,
          "inventoryType": null,
          "iagAdapterInstance": null,
          "verbose": null
        },
        "decorators": []
      },
      "deprecated": false,
      "matched": [
        {
          "key": "description",
          "highlightString": "Perform a JSON Transformation using the <span class='highlight-string'>JST</span> library."
        }
      ],
      "groups": [],
      "x": -0.2462406015037594,
      "y": 0.4991869918699187,
      "task_name": "IAGUD: Extract Device Details",
      "retrySettings": null
    },
    "9261": {
      "name": "getDevice",
      "canvasName": "getDevice",
      "summary": "Get a particular device from Automation Gateway",
      "description": "This method will get a particular device from Automation Gateway",
      "location": "Adapter",
      "locationType": "AutomationGateway",
      "app": "AutomationGateway",
      "type": "automatic",
      "displayName": "AutomationGateway",
      "variables": {
        "incoming": {
          "deviceName": "$var.8576.deviceName",
          "adapter_id": "$var.8576.iagAdapterInstance"
        },
        "outgoing": {
          "result": null
        },
        "error": "$var.job.errorResponse",
        "decorators": [
          {
            "pointer": "/outgoing/result",
            "type": "encryption"
          }
        ]
      },
      "deprecated": false,
      "matched": [],
      "groups": [],
      "actor": "Pronghorn",
      "x": 0.18890977443609022,
      "y": 0.5186991869918699,
      "scheduled": false
    },
    "workflow_start": {
      "name": "workflow_start",
      "groups": [],
      "x": -0.8778195488721805,
      "y": 0.4845528455284553
    },
    "workflow_end": {
      "name": "workflow_end",
      "groups": [],
      "x": 1.7584586466165413,
      "y": 0.526829268292683
    },
    "e144": {
      "name": "evaluation",
      "canvasName": "evaluation",
      "summary": "Run Evaluation to see whether device is HTTP Request",
      "description": "Run Evaluation to see whether device is HTTP Request",
      "location": "Application",
      "locationType": null,
      "app": "WorkFlowEngine",
      "type": "operation",
      "displayName": "WorkFlowEngine",
      "variables": {
        "incoming": {
          "all_true_flag": false,
          "evaluation_groups": [
            {
              "all_true_flag": false,
              "evaluations": [
                {
                  "query": "",
                  "operand_1": {
                    "variable": "inventoryType",
                    "task": "8576"
                  },
                  "operator": "==",
                  "operand_2": {
                    "variable": "http_requests",
                    "task": "static"
                  },
                  "rightQuery": ""
                }
              ]
            }
          ]
        },
        "outgoing": {
          "return_value": null
        }
      },
      "deprecated": false,
      "matched": [
        {
          "key": "canvasName",
          "highlightString": "<span class='highlight-string'>eval</span>uation"
        },
        {
          "key": "summary",
          "highlightString": "Run <span class='highlight-string'>Eval</span>uation Task"
        },
        {
          "key": "description",
          "highlightString": "Run an <span class='highlight-string'>eval</span>uation"
        }
      ],
      "groups": [],
      "x": -0.1231203007518797,
      "y": 1.302439024390244
    },
    "73ee": {
      "name": "newVariable",
      "canvasName": "newVariable",
      "summary": "Create a Job Variable",
      "description": "Create a new Job variable by Job ID and assign it a value.",
      "location": "Application",
      "locationType": null,
      "app": "WorkFlowEngine",
      "type": "operation",
      "displayName": "WorkFlowEngine",
      "variables": {
        "incoming": {
          "name": "status",
          "value": "SUCCESS"
        },
        "outgoing": {
          "value": null
        }
      },
      "deprecated": false,
      "matched": [
        {
          "key": "canvasName",
          "highlightString": "<span class='highlight-string'>new</span><span class='highlight-string'>Var</span>iable"
        },
        {
          "key": "description",
          "highlightString": "Create a <span class='highlight-string'>new</span> Job <span class='highlight-string'>var</span>iable by Job ID and assign it a value."
        },
        {
          "key": "summary",
          "highlightString": "Create a Job <span class='highlight-string'>Var</span>iable"
        }
      ],
      "groups": [],
      "x": -0.7396616541353384,
      "y": 0.49105691056910566
    },
    "f75b": {
      "name": "newVariable",
      "canvasName": "newVariable",
      "summary": "Create a Job Variable",
      "description": "Create a new Job variable by Job ID and assign it a value.",
      "location": "Application",
      "locationType": null,
      "app": "WorkFlowEngine",
      "type": "operation",
      "displayName": "WorkFlowEngine",
      "variables": {
        "incoming": {
          "name": "status",
          "value": "FAILED"
        },
        "outgoing": {
          "value": null
        }
      },
      "deprecated": false,
      "matched": [
        {
          "key": "canvasName",
          "highlightString": "<span class='highlight-string'>new</span><span class='highlight-string'>Var</span>iable"
        },
        {
          "key": "description",
          "highlightString": "Create a <span class='highlight-string'>new</span> Job <span class='highlight-string'>var</span>iable by Job ID and assign it a value."
        },
        {
          "key": "summary",
          "highlightString": "Create a Job <span class='highlight-string'>Var</span>iable"
        }
      ],
      "groups": [],
      "x": 0.7218045112781954,
      "y": 1.824390243902439
    },
    "31bb": {
      "name": "newVariable",
      "canvasName": "newVariable",
      "summary": "Create a Job Variable",
      "description": "Create a new Job variable by Job ID and assign it a value.",
      "location": "Application",
      "locationType": null,
      "app": "WorkFlowEngine",
      "type": "operation",
      "displayName": "WorkFlowEngine",
      "variables": {
        "incoming": {
          "name": "status",
          "value": "FAILED"
        },
        "outgoing": {
          "value": null
        }
      },
      "deprecated": false,
      "matched": [
        {
          "key": "canvasName",
          "highlightString": "<span class='highlight-string'>new</span><span class='highlight-string'>Var</span>iable"
        },
        {
          "key": "description",
          "highlightString": "Create a <span class='highlight-string'>new</span> Job <span class='highlight-string'>var</span>iable by Job ID and assign it a value."
        },
        {
          "key": "summary",
          "highlightString": "Create a Job <span class='highlight-string'>Var</span>iable"
        }
      ],
      "groups": [],
      "x": 0.724624060150376,
      "y": 0.9544715447154472
    },
    "b393": {
      "name": "transformation",
      "canvasName": "transformation",
      "summary": "Construct Get Device Details Response",
      "description": "Constructs response for Get Device Details workflow",
      "location": "Application",
      "locationType": null,
      "app": "WorkFlowEngine",
      "type": "operation",
      "displayName": "WorkFlowEngine",
      "variables": {
        "incoming": {
          "tr_id": "639cbf70e1b8a80103bc5c02",
          "variableMap": {
            "deviceDetails": "Invalid inventory type",
            "errorResponse": "$var.job.errorResponse",
            "status": "FAILED",
            "deviceName": "$var.8576.deviceName",
            "inventoryType": "$var.8576.inventoryType",
            "errors": "$var.job.errors"
          },
          "options": {
            "extractOutput": true,
            "validateIncoming": true,
            "revertToDefaultValue": false
          }
        },
        "outgoing": {
          "ReturnStatus": null
        },
        "decorators": [
          {
            "pointer": "/incoming/variableMap/deviceDetails",
            "type": "encryption"
          },
          {
            "pointer": "/incoming/variableMap/errorResponse",
            "type": "encryption"
          },
          {
            "pointer": "/incoming/variableMap/status",
            "type": "encryption"
          },
          {
            "pointer": "/incoming/variableMap/deviceName",
            "type": "encryption"
          },
          {
            "pointer": "/incoming/variableMap/inventoryType",
            "type": "encryption"
          },
          {
            "pointer": "/incoming/variableMap/errors",
            "type": "encryption"
          }
        ]
      },
      "deprecated": false,
      "matched": [
        {
          "key": "description",
          "highlightString": "Perform a JSON Transformation using the <span class='highlight-string'>JST</span> library."
        }
      ],
      "groups": [],
      "x": 0.2650375939849624,
      "y": 2.5658536585365854,
      "task_name": "IAGUD: Construct Get Device Details Response",
      "retrySettings": null
    },
    "3a43": {
      "name": "newVariable",
      "canvasName": "newVariable",
      "summary": "Create a Job Variable",
      "description": "Create a new Job variable by Job ID and assign it a value.",
      "location": "Application",
      "locationType": null,
      "app": "WorkFlowEngine",
      "type": "operation",
      "displayName": "WorkFlowEngine",
      "variables": {
        "incoming": {
          "name": "errorResponse",
          "value": ""
        },
        "outgoing": {
          "value": null
        }
      },
      "deprecated": false,
      "matched": [
        {
          "key": "canvasName",
          "highlightString": "<span class='highlight-string'>new</span><span class='highlight-string'>Variable</span>"
        },
        {
          "key": "description",
          "highlightString": "Create a <span class='highlight-string'>new</span> Job <span class='highlight-string'>variable</span> by Job ID and assign it a value."
        },
        {
          "key": "summary",
          "highlightString": "Create a Job <span class='highlight-string'>Variable</span>"
        }
      ],
      "groups": [],
      "x": -0.5968045112781954,
      "y": 0.4861788617886179
    },
    "2cbe": {
      "name": "newVariable",
      "canvasName": "newVariable",
      "summary": "Create a Job Variable",
      "description": "Create a new Job variable by Job ID and assign it a value.",
      "location": "Application",
      "locationType": null,
      "app": "WorkFlowEngine",
      "type": "operation",
      "displayName": "WorkFlowEngine",
      "variables": {
        "incoming": {
          "name": "ReturnStatus",
          "value": "$var.5179.ReturnStatus"
        },
        "outgoing": {
          "value": null
        }
      },
      "deprecated": false,
      "matched": [
        {
          "key": "canvasName",
          "highlightString": "<span class='highlight-string'>new</span><span class='highlight-string'>Variable</span>"
        },
        {
          "key": "description",
          "highlightString": "Create a <span class='highlight-string'>new</span> <span class='highlight-string'>Job</span> <span class='highlight-string'>variable</span> by Job ID and assign it a value."
        },
        {
          "key": "summary",
          "highlightString": "Create a <span class='highlight-string'>Job</span> <span class='highlight-string'>Variable</span>"
        }
      ],
      "groups": [],
      "x": 0.9671052631578947,
      "y": 1.2715447154471544
    },
    "e06d": {
      "name": "newVariable",
      "canvasName": "newVariable",
      "summary": "Create a Job Variable",
      "description": "Create a new Job variable by Job ID and assign it a value.",
      "location": "Application",
      "locationType": null,
      "app": "WorkFlowEngine",
      "type": "operation",
      "displayName": "WorkFlowEngine",
      "variables": {
        "incoming": {
          "name": "errors",
          "value": []
        },
        "outgoing": {
          "value": null
        }
      },
      "deprecated": false,
      "matched": [
        {
          "key": "canvasName",
          "highlightString": "<span class='highlight-string'>new</span><span class='highlight-string'>Variable</span>"
        },
        {
          "key": "description",
          "highlightString": "Create a <span class='highlight-string'>new</span> Job <span class='highlight-string'>variable</span> by Job ID and assign it a value."
        },
        {
          "key": "summary",
          "highlightString": "Create a Job <span class='highlight-string'>Variable</span>"
        }
      ],
      "groups": [],
      "x": -0.43045112781954886,
      "y": 0.4959349593495935
    },
    "9bec": {
      "name": "evaluation",
      "canvasName": "evaluation",
      "summary": "Check if verbose false",
      "description": "Check if verbose false",
      "location": "Application",
      "locationType": null,
      "app": "WorkFlowEngine",
      "type": "operation",
      "displayName": "WorkFlowEngine",
      "variables": {
        "incoming": {
          "all_true_flag": false,
          "evaluation_groups": [
            {
              "all_true_flag": false,
              "evaluations": [
                {
                  "query": "",
                  "operand_1": {
                    "variable": "verbose",
                    "task": "8576"
                  },
                  "operator": "contains",
                  "operand_2": {
                    "variable": false,
                    "task": "static"
                  },
                  "rightQuery": ""
                }
              ]
            }
          ]
        },
        "outgoing": {
          "return_value": null
        }
      },
      "deprecated": false,
      "matched": [
        {
          "key": "canvasName",
          "highlightString": "<span class='highlight-string'>evalu</span>ation"
        },
        {
          "key": "summary",
          "highlightString": "Run <span class='highlight-string'>Evalu</span>ation Task"
        },
        {
          "key": "description",
          "highlightString": "Run an <span class='highlight-string'>evalu</span>ation"
        }
      ],
      "groups": [],
      "x": 0.22086466165413535,
      "y": 1.5658536585365854
    },
    "45d3": {
      "name": "ViewData",
      "canvasName": "ViewData",
      "summary": "View Unable to get device details data",
      "description": "View Unable to get device details data",
      "location": "Application",
      "app": "WorkFlowEngine",
      "displayName": "WorkFlowEngine",
      "type": "manual",
      "variables": {
        "incoming": {
          "header": "Get Device Details Return Status - Unable to get device details",
          "message": "Unable to get device details",
          "body": "$var.3786.error",
          "variables": "",
          "btn_success": "Proceed",
          "btn_failure": "Retry"
        },
        "outgoing": {},
        "error": "",
        "decorators": []
      },
      "view": "/workflow_engine/task/ViewData",
      "deprecated": false,
      "matched": [
        {
          "key": "canvasName",
          "highlightString": "<span class='highlight-string'>ViewData</span>"
        }
      ],
      "groups": [],
      "x": 0.22086466165413535,
      "y": 1.8260162601626015,
      "scheduled": false
    },
    "ed7": {
      "name": "evaluation",
      "canvasName": "evaluation",
      "summary": "Check if verbose false",
      "description": "Check if verbose false",
      "location": "Application",
      "locationType": null,
      "app": "WorkFlowEngine",
      "type": "operation",
      "displayName": "WorkFlowEngine",
      "variables": {
        "incoming": {
          "all_true_flag": false,
          "evaluation_groups": [
            {
              "all_true_flag": false,
              "evaluations": [
                {
                  "query": "",
                  "operand_1": {
                    "variable": "verbose",
                    "task": "8576"
                  },
                  "operator": "contains",
                  "operand_2": {
                    "variable": false,
                    "task": "static"
                  },
                  "rightQuery": ""
                }
              ]
            }
          ]
        },
        "outgoing": {
          "return_value": null
        }
      },
      "deprecated": false,
      "matched": [
        {
          "key": "canvasName",
          "highlightString": "<span class='highlight-string'>evalu</span>ation"
        },
        {
          "key": "summary",
          "highlightString": "Run <span class='highlight-string'>Evalu</span>ation Task"
        },
        {
          "key": "description",
          "highlightString": "Run an <span class='highlight-string'>evalu</span>ation"
        }
      ],
      "groups": [],
      "x": 0.19360902255639098,
      "y": 0.7691056910569106
    },
    "e43f": {
      "name": "ViewData",
      "canvasName": "ViewData",
      "summary": "View Unable to get device details data",
      "description": "View Unable to get device details data",
      "location": "Application",
      "app": "WorkFlowEngine",
      "displayName": "WorkFlowEngine",
      "type": "manual",
      "variables": {
        "incoming": {
          "header": "Get Device Details Return Status - Unable to get device details",
          "message": "Unable to get device details",
          "body": "$var.9261.error",
          "variables": "",
          "btn_success": "Proceed",
          "btn_failure": "Retry"
        },
        "outgoing": {},
        "error": "",
        "decorators": []
      },
      "view": "/workflow_engine/task/ViewData",
      "deprecated": false,
      "matched": [
        {
          "key": "canvasName",
          "highlightString": "<span class='highlight-string'>ViewData</span>"
        }
      ],
      "groups": [],
      "x": 0.20488721804511278,
      "y": 0.959349593495935,
      "scheduled": false
    },
    "8aea": {
      "name": "evaluation",
      "canvasName": "evaluation",
      "summary": "Check if verbose false",
      "description": "Check if verbose false",
      "location": "Application",
      "locationType": null,
      "app": "WorkFlowEngine",
      "type": "operation",
      "displayName": "WorkFlowEngine",
      "variables": {
        "incoming": {
          "all_true_flag": false,
          "evaluation_groups": [
            {
              "all_true_flag": false,
              "evaluations": [
                {
                  "query": "",
                  "operand_1": {
                    "variable": "verbose",
                    "task": "8576"
                  },
                  "operator": "==",
                  "operand_2": {
                    "variable": false,
                    "task": "static"
                  },
                  "rightQuery": ""
                }
              ]
            }
          ]
        },
        "outgoing": {
          "return_value": null
        }
      },
      "deprecated": false,
      "matched": [
        {
          "key": "canvasName",
          "highlightString": "<span class='highlight-string'>evalu</span>ation"
        },
        {
          "key": "summary",
          "highlightString": "Run <span class='highlight-string'>Evalu</span>ation Task"
        },
        {
          "key": "description",
          "highlightString": "Run an <span class='highlight-string'>evalu</span>ation"
        }
      ],
      "groups": [],
      "x": 1.3355263157894737,
      "y": 0.5300813008130081
    },
    "245a": {
      "name": "evaluation",
      "canvasName": "evaluation",
      "summary": "Check if verbose false",
      "description": "Check if verbose false",
      "location": "Application",
      "locationType": null,
      "app": "WorkFlowEngine",
      "type": "operation",
      "displayName": "WorkFlowEngine",
      "variables": {
        "incoming": {
          "all_true_flag": false,
          "evaluation_groups": [
            {
              "all_true_flag": false,
              "evaluations": [
                {
                  "query": "",
                  "operand_1": {
                    "variable": "verbose",
                    "task": "8576"
                  },
                  "operator": "contains",
                  "operand_2": {
                    "variable": false,
                    "task": "static"
                  },
                  "rightQuery": ""
                }
              ]
            }
          ]
        },
        "outgoing": {
          "return_value": null
        }
      },
      "deprecated": false,
      "matched": [
        {
          "key": "canvasName",
          "highlightString": "<span class='highlight-string'>evalu</span>ation"
        },
        {
          "key": "summary",
          "highlightString": "Run <span class='highlight-string'>Evalu</span>ation Task"
        },
        {
          "key": "description",
          "highlightString": "Run an <span class='highlight-string'>evalu</span>ation"
        }
      ],
      "groups": [],
      "x": -0.1174812030075188,
      "y": 2.0552845528455284
    },
    "b7d4": {
      "name": "ViewData",
      "canvasName": "ViewData",
      "summary": "View Invalid Inventory Type Data",
      "description": "View Invalid Inventory Type Data",
      "location": "Application",
      "app": "WorkFlowEngine",
      "displayName": "WorkFlowEngine",
      "type": "manual",
      "variables": {
        "incoming": {
          "header": "Get Device Details Return Status - Invalid Inventory Type",
          "message": "Invalid inventory type shown below, please use a valid inventory type (i.e., ansible, http_requests)",
          "body": "$var.8576.inventoryType",
          "variables": "",
          "btn_success": "Proceed",
          "btn_failure": ""
        },
        "outgoing": {},
        "error": "",
        "decorators": []
      },
      "view": "/workflow_engine/task/ViewData",
      "deprecated": false,
      "matched": [
        {
          "key": "canvasName",
          "highlightString": "<span class='highlight-string'>ViewData</span>"
        }
      ],
      "groups": [],
      "x": -0.106203007518797,
      "y": 2.539837398373984,
      "scheduled": false
    }
  },
  "transitions": {
    "2139": {
      "8aea": {
        "type": "standard",
        "state": "success"
      }
    },
    "2500": {
      "workflow_end": {
        "type": "standard",
        "state": "success"
      }
    },
    "3786": {
      "5179": {
        "type": "standard",
        "state": "success"
      },
      "9bec": {
        "type": "standard",
        "state": "error"
      }
    },
    "3822": {
      "2139": {
        "type": "standard",
        "state": "success"
      }
    },
    "4472": {
      "9261": {
        "type": "standard",
        "state": "success"
      },
      "e144": {
        "type": "standard",
        "state": "failure"
      }
    },
    "5179": {
      "2cbe": {
        "type": "standard",
        "state": "success"
      }
    },
    "7158": {
      "8aea": {
        "type": "standard",
        "state": "success"
      }
    },
    "8576": {
      "4472": {
        "type": "standard",
        "state": "success"
      }
    },
    "9261": {
      "3822": {
        "type": "standard",
        "state": "success"
      },
      "ed7": {
        "type": "standard",
        "state": "error"
      }
    },
    "workflow_start": {
      "73ee": {
        "type": "standard",
        "state": "success"
      }
    },
    "workflow_end": {},
    "b1d8": {},
    "e144": {
      "3786": {
        "type": "standard",
        "state": "success"
      },
      "245a": {
        "type": "standard",
        "state": "failure"
      }
    },
    "234c": {},
    "38f8": {},
    "73ee": {
      "3a43": {
        "type": "standard",
        "state": "success"
      }
    },
    "f75b": {
      "5179": {
        "type": "standard",
        "state": "success"
      }
    },
    "31bb": {
      "3822": {
        "type": "standard",
        "state": "success"
      }
    },
    "b393": {
      "7158": {
        "type": "standard",
        "state": "success"
      }
    },
    "581b": {},
    "3a43": {
      "e06d": {
        "type": "standard",
        "state": "success"
      }
    },
    "2cbe": {
      "8aea": {
        "type": "standard",
        "state": "success"
      }
    },
    "e06d": {
      "8576": {
        "type": "standard",
        "state": "success"
      }
    },
    "9bec": {
      "45d3": {
        "type": "standard",
        "state": "failure"
      },
      "f75b": {
        "type": "standard",
        "state": "success"
      }
    },
    "45d3": {
      "3786": {
        "type": "revert",
        "state": "failure"
      },
      "f75b": {
        "type": "standard",
        "state": "success"
      }
    },
    "ed7": {
      "e43f": {
        "type": "standard",
        "state": "failure"
      },
      "31bb": {
        "type": "standard",
        "state": "success"
      }
    },
    "e43f": {
      "9261": {
        "type": "revert",
        "state": "failure"
      },
      "31bb": {
        "type": "standard",
        "state": "success"
      }
    },
    "8aea": {
      "2500": {
        "type": "standard",
        "state": "failure"
      },
      "workflow_end": {
        "type": "standard",
        "state": "success"
      }
    },
    "245a": {
      "b393": {
        "type": "standard",
        "state": "success"
      },
      "b7d4": {
        "type": "standard",
        "state": "failure"
      }
    },
    "b7d4": {
      "b393": {
        "type": "standard",
        "state": "success"
      }
    }
  },
  "type": "automation",
  "tags": [],
  "groups": [],
  "migrationVersion": 1
}