{
  "name": "IAGDO: Onboard Device",
  "type": "automation",
  "tasks": {
    "1809": {
      "name": "childJob",
      "canvasName": "childJob",
      "summary": "IAGDO: IAG Ansible Device Onboarding",
      "description": "IAGDO: IAG Ansible Device Onboarding",
      "location": "Application",
      "locationType": null,
      "app": "WorkFlowEngine",
      "type": "operation",
      "displayName": "WorkFlowEngine",
      "variables": {
        "incoming": {
          "task": "",
          "workflow": "IAGDO: Ansible Device Onboarding",
          "variables": {
            "device": {
              "editable": false,
              "task": "job",
              "value": "device"
            },
            "verbose": {
              "editable": false,
              "task": "job",
              "value": "verbose"
            }
          },
          "data_array": "",
          "transformation": "",
          "loopType": ""
        },
        "outgoing": {
          "job_details": null
        }
      },
      "deprecated": false,
      "matched": [
        {
          "key": "canvasName",
          "highlightString": "<span class='highlight-string'>childJob</span>"
        }
      ],
      "groups": [],
      "actor": "job",
      "x": 0.5870786516853933,
      "y": 0.5592485549132948
    },
    "8407": {
      "name": "transformation",
      "canvasName": "transformation",
      "summary": "IAGDO: Create get_device Error Response",
      "description": "IAGDO: Create get_device Error Response",
      "location": "Application",
      "locationType": null,
      "app": "WorkFlowEngine",
      "type": "operation",
      "displayName": "WorkFlowEngine",
      "variables": {
        "incoming": {
          "tr_id": "63a4b6ec283de90111a042e6",
          "variableMap": {
            "results": "$var.2dd6.job_details",
            "device": "$var.job.device"
          },
          "options": {
            "extractOutput": true,
            "validateIncoming": true,
            "revertToDefaultValue": false
          }
        },
        "outgoing": {
          "ReturnStatus": null
        },
        "decorators": [
          {
            "pointer": "/incoming/variableMap/results",
            "type": "encryption"
          },
          {
            "pointer": "/incoming/variableMap/device",
            "type": "encryption"
          }
        ]
      },
      "deprecated": false,
      "matched": [
        {
          "key": "description",
          "highlightString": "Perform a JSON Transformation using the <span class='highlight-string'>JST</span> library."
        }
      ],
      "groups": [],
      "x": 0.2455573505654281,
      "y": 0.887905604719764,
      "task_name": "IAGDO: Create getDevice Error Response",
      "retrySettings": null
    },
    "workflow_start": {
      "name": "workflow_start",
      "groups": [],
      "x": -0.26252019386106623,
      "y": 0.5530973451327433
    },
    "workflow_end": {
      "name": "workflow_end",
      "groups": [],
      "x": 2.0549273021001615,
      "y": 0.5339233038348082
    },
    "16c8": {
      "name": "transformation",
      "canvasName": "transformation",
      "summary": "IAGDO: Create get_device and add_device Success Response",
      "description": "IAGDO: Create get_device and add_device Success Response",
      "location": "Application",
      "locationType": null,
      "app": "WorkFlowEngine",
      "type": "operation",
      "displayName": "WorkFlowEngine",
      "variables": {
        "incoming": {
          "tr_id": "63a5cac4283de90111a042e7",
          "variableMap": {
            "get_device_result": "$var.2dd6.job_details",
            "add_device_results": "$var.job.add_device_results",
            "device": "$var.job.device"
          },
          "options": {
            "extractOutput": true,
            "validateIncoming": false,
            "revertToDefaultValue": false
          }
        },
        "outgoing": {
          "ReturnStatus": null
        },
        "decorators": [
          {
            "pointer": "/incoming/variableMap/get_device_result",
            "type": "encryption"
          },
          {
            "pointer": "/incoming/variableMap/add_device_results",
            "type": "encryption"
          },
          {
            "pointer": "/incoming/variableMap/device",
            "type": "encryption"
          }
        ]
      },
      "deprecated": false,
      "matched": [
        {
          "key": "description",
          "highlightString": "Perform a JSON Transformation using the <span class='highlight-string'>JST</span> library."
        }
      ],
      "groups": [],
      "x": 1.2603806228373702,
      "y": 0.5537313432835821,
      "task_name": "IAGDO: Create get_device and add_device Success Response",
      "retrySettings": null
    },
    "e4af": {
      "name": "evaluation",
      "canvasName": "evaluation",
      "summary": "Verify inventoryType - Ansible",
      "description": "Verify inventoryType - Ansible",
      "location": "Application",
      "locationType": null,
      "app": "WorkFlowEngine",
      "type": "operation",
      "displayName": "WorkFlowEngine",
      "variables": {
        "incoming": {
          "all_true_flag": false,
          "evaluation_groups": [
            {
              "all_true_flag": false,
              "evaluations": [
                {
                  "query": "inventory_type",
                  "operand_1": {
                    "variable": "device",
                    "task": "job",
                    "editable": true
                  },
                  "operator": "==",
                  "operand_2": {
                    "variable": "ansible",
                    "task": "static"
                  },
                  "rightQuery": ""
                }
              ]
            }
          ]
        },
        "outgoing": {
          "return_value": null
        }
      },
      "deprecated": false,
      "matched": [
        {
          "key": "canvasName",
          "highlightString": "<span class='highlight-string'>eval</span>uation"
        },
        {
          "key": "summary",
          "highlightString": "Run <span class='highlight-string'>Eval</span>uation Task"
        },
        {
          "key": "description",
          "highlightString": "Run an <span class='highlight-string'>eval</span>uation"
        }
      ],
      "groups": [],
      "x": 0.36418685121107264,
      "y": 0.5567164179104478
    },
    "928a": {
      "name": "evaluation",
      "canvasName": "evaluation",
      "summary": "Verify inventoryType - Ansible",
      "description": "Verify inventoryType - Ansible",
      "location": "Application",
      "locationType": null,
      "app": "WorkFlowEngine",
      "type": "operation",
      "displayName": "WorkFlowEngine",
      "variables": {
        "incoming": {
          "all_true_flag": false,
          "evaluation_groups": [
            {
              "all_true_flag": false,
              "evaluations": [
                {
                  "query": "inventory_type",
                  "operand_1": {
                    "variable": "device",
                    "task": "job",
                    "editable": true
                  },
                  "operator": "==",
                  "operand_2": {
                    "variable": "http_requests",
                    "task": "static"
                  },
                  "rightQuery": ""
                }
              ]
            }
          ]
        },
        "outgoing": {
          "return_value": null
        }
      },
      "deprecated": false,
      "matched": [
        {
          "key": "canvasName",
          "highlightString": "<span class='highlight-string'>eval</span>uation"
        },
        {
          "key": "summary",
          "highlightString": "Run <span class='highlight-string'>Eval</span>uation Task"
        },
        {
          "key": "description",
          "highlightString": "Run an <span class='highlight-string'>eval</span>uation"
        }
      ],
      "groups": [],
      "x": 0.36764705882352944,
      "y": 0.7597014925373134
    },
    "f563": {
      "name": "childJob",
      "canvasName": "childJob",
      "summary": "IAGDO: Inventory Device Onboarding",
      "description": "IAGDO: Inventory Device Onboarding",
      "location": "Application",
      "locationType": null,
      "app": "WorkFlowEngine",
      "type": "operation",
      "displayName": "WorkFlowEngine",
      "variables": {
        "incoming": {
          "task": "",
          "workflow": "IAGDO: Inventory Device Onboarding",
          "variables": {
            "device": {
              "editable": false,
              "task": "job",
              "value": "device"
            },
            "verbose": {
              "editable": false,
              "task": "job",
              "value": "verbose"
            }
          },
          "data_array": "",
          "transformation": "",
          "loopType": ""
        },
        "outgoing": {
          "job_details": null
        }
      },
      "deprecated": false,
      "matched": [
        {
          "key": "canvasName",
          "highlightString": "<span class='highlight-string'>childJob</span>"
        }
      ],
      "groups": [],
      "actor": "job",
      "x": 0.5889513108614233,
      "y": 0.7687861271676301
    },
    "2dd6": {
      "name": "childJob",
      "canvasName": "childJob",
      "summary": "IAGGDD: Get Device Details",
      "description": "IAGGDD: Get Device Details",
      "location": "Application",
      "locationType": null,
      "app": "WorkFlowEngine",
      "type": "operation",
      "displayName": "WorkFlowEngine",
      "variables": {
        "incoming": {
          "task": "",
          "workflow": "IAGGDD: Get Device Details",
          "variables": {
            "device": {
              "editable": false,
              "task": "job",
              "value": "device"
            },
            "verbose": {
              "editable": false,
              "task": "job",
              "value": "verbose"
            }
          },
          "data_array": "",
          "transformation": "",
          "loopType": ""
        },
        "outgoing": {
          "job_details": null
        }
      },
      "deprecated": false,
      "matched": [
        {
          "key": "canvasName",
          "highlightString": "<span class='highlight-string'>chil</span>dJob"
        },
        {
          "key": "summary",
          "highlightString": "Run <span class='highlight-string'>Chil</span>d Job"
        },
        {
          "key": "description",
          "highlightString": "Runs a <span class='highlight-string'>chil</span>d job inside a workflow."
        }
      ],
      "groups": [],
      "actor": "job",
      "x": -0.0935374149659864,
      "y": 0.5572755417956656
    },
    "5cd4": {
      "name": "evaluation",
      "canvasName": "evaluation",
      "summary": "Check if Device was Found",
      "description": "Check if Device was Found",
      "location": "Application",
      "locationType": null,
      "app": "WorkFlowEngine",
      "type": "operation",
      "displayName": "WorkFlowEngine",
      "variables": {
        "incoming": {
          "all_true_flag": false,
          "evaluation_groups": [
            {
              "all_true_flag": false,
              "evaluations": [
                {
                  "query": "ReturnStatus.status",
                  "operand_1": {
                    "variable": "job_details",
                    "task": "2dd6"
                  },
                  "operator": "==",
                  "operand_2": {
                    "variable": "FAILED",
                    "task": "static"
                  },
                  "rightQuery": ""
                }
              ]
            }
          ]
        },
        "outgoing": {
          "return_value": null
        }
      },
      "deprecated": false,
      "matched": [
        {
          "key": "canvasName",
          "highlightString": "<span class='highlight-string'>eval</span>uation"
        },
        {
          "key": "summary",
          "highlightString": "Run <span class='highlight-string'>Eval</span>uation Task"
        },
        {
          "key": "description",
          "highlightString": "Run an <span class='highlight-string'>eval</span>uation"
        }
      ],
      "groups": [],
      "x": 0.07738095238095238,
      "y": 0.5529595015576324
    },
    "e274": {
      "name": "stub",
      "canvasName": "stub",
      "summary": "Stub",
      "description": "Create a stub for an automated task",
      "location": "Application",
      "locationType": null,
      "app": "WorkFlowEngine",
      "type": "automatic",
      "displayName": "Tools",
      "variables": {
        "incoming": {
          "type": "success",
          "delay": "",
          "response": ""
        },
        "outgoing": {
          "response": null
        },
        "error": "",
        "decorators": []
      },
      "deprecated": false,
      "matched": [
        {
          "key": "canvasName",
          "highlightString": "<span class='highlight-string'>stub</span>"
        },
        {
          "key": "summary",
          "highlightString": "<span class='highlight-string'>Stub</span>"
        },
        {
          "key": "description",
          "highlightString": "Create a <span class='highlight-string'>stub</span> for an automated task"
        }
      ],
      "groups": [],
      "actor": "Pronghorn",
      "x": 1.7318255250403878,
      "y": 1.8274336283185841,
      "scheduled": false
    },
    "faef": {
      "name": "transformation",
      "canvasName": "transformation",
      "summary": "IAGDO: Create Device Exists Response",
      "description": "IAGDO: Create Device Exists Response",
      "location": "Application",
      "locationType": null,
      "app": "WorkFlowEngine",
      "type": "operation",
      "displayName": "WorkFlowEngine",
      "variables": {
        "incoming": {
          "tr_id": "63a47374283de90111a042e5",
          "variableMap": {
            "results": "$var.2dd6.job_details",
            "device": "$var.job.device"
          },
          "options": {
            "extractOutput": true,
            "validateIncoming": true,
            "revertToDefaultValue": false
          }
        },
        "outgoing": {
          "ReturnStatus": null
        },
        "decorators": [
          {
            "pointer": "/incoming/variableMap/results",
            "type": "encryption"
          },
          {
            "pointer": "/incoming/variableMap/device",
            "type": "encryption"
          }
        ]
      },
      "deprecated": false,
      "matched": [
        {
          "key": "description",
          "highlightString": "Perform a JSON Transformation using the <span class='highlight-string'>JST</span> library."
        }
      ],
      "groups": [],
      "x": 0.06865912762520193,
      "y": 1.4424778761061947,
      "task_name": "IAGDO: Create Existence or Invalid Inventory Type Response",
      "retrySettings": null
    },
    "ad9e": {
      "name": "evaluation",
      "canvasName": "evaluation",
      "summary": "Was the Get Device Error code 404 (Device not found)? Not 500 Corral Adapter Error",
      "description": "Was the Get Device Error code 404 (Device not found)? Not 500 Corral Adapter Error",
      "location": "Application",
      "locationType": null,
      "app": "WorkFlowEngine",
      "type": "operation",
      "displayName": "WorkFlowEngine",
      "variables": {
        "incoming": {
          "all_true_flag": false,
          "evaluation_groups": [
            {
              "all_true_flag": false,
              "evaluations": [
                {
                  "query": "ReturnStatus.response.device_details.metrics.code",
                  "operand_1": {
                    "variable": "job_details",
                    "task": "2dd6"
                  },
                  "operator": "==",
                  "operand_2": {
                    "variable": 404,
                    "task": "static"
                  },
                  "rightQuery": ""
                }
              ]
            }
          ]
        },
        "outgoing": {
          "return_value": null
        }
      },
      "deprecated": false,
      "matched": [
        {
          "key": "canvasName",
          "highlightString": "<span class='highlight-string'>eval</span>uation"
        },
        {
          "key": "summary",
          "highlightString": "Run <span class='highlight-string'>Eval</span>uation Task"
        },
        {
          "key": "description",
          "highlightString": "Run an <span class='highlight-string'>eval</span>uation"
        }
      ],
      "groups": [],
      "x": 0.24134948096885814,
      "y": 0.5507462686567164
    },
    "50a4": {
      "name": "stub",
      "canvasName": "stub",
      "summary": "Stub",
      "description": "Create a stub for an automated task",
      "location": "Application",
      "locationType": null,
      "app": "WorkFlowEngine",
      "type": "automatic",
      "displayName": "Tools",
      "variables": {
        "incoming": {
          "type": "success",
          "delay": "",
          "response": ""
        },
        "outgoing": {
          "response": null
        },
        "error": "",
        "decorators": []
      },
      "deprecated": false,
      "matched": [
        {
          "key": "canvasName",
          "highlightString": "<span class='highlight-string'>stub</span>"
        },
        {
          "key": "summary",
          "highlightString": "<span class='highlight-string'>Stub</span>"
        },
        {
          "key": "description",
          "highlightString": "Create a <span class='highlight-string'>stub</span> for an automated task"
        }
      ],
      "groups": [],
      "actor": "Pronghorn",
      "x": 1.7350565428109854,
      "y": 1.2861356932153392,
      "scheduled": false
    },
    "ad96": {
      "name": "query",
      "canvasName": "query",
      "summary": "Promote Results to addDeviceResults job variables",
      "description": "Promote Results to addDeviceResults job variables",
      "location": "Application",
      "locationType": null,
      "app": "WorkFlowEngine",
      "type": "operation",
      "displayName": "WorkFlowEngine",
      "variables": {
        "incoming": {
          "pass_on_null": false,
          "query": "",
          "obj": "$var.fbe3.addDeviceResults"
        },
        "outgoing": {
          "return_data": "$var.job.add_device_results"
        },
        "error": "",
        "decorators": []
      },
      "deprecated": false,
      "matched": [
        {
          "key": "canvasName",
          "highlightString": "<span class='highlight-string'>query</span>"
        },
        {
          "key": "summary",
          "highlightString": "<span class='highlight-string'>Query</span> Data Using 'json-query' Format"
        },
        {
          "key": "description",
          "highlightString": "<span class='highlight-string'>Query</span> data using a dot/bracket notation string and a matching key/value pair."
        }
      ],
      "groups": [],
      "x": 1.027681660899654,
      "y": 0.7671641791044777,
      "scheduled": false
    },
    "e59c": {
      "name": "query",
      "canvasName": "query",
      "summary": "Promote Results to addDeviceResults job variables",
      "description": "Promote Results to addDeviceResults job variables",
      "location": "Application",
      "locationType": null,
      "app": "WorkFlowEngine",
      "type": "operation",
      "displayName": "WorkFlowEngine",
      "variables": {
        "incoming": {
          "pass_on_null": false,
          "query": "",
          "obj": "$var.44d4.addDeviceResults"
        },
        "outgoing": {
          "return_data": "$var.job.add_device_results"
        },
        "error": "",
        "decorators": []
      },
      "deprecated": false,
      "matched": [
        {
          "key": "canvasName",
          "highlightString": "<span class='highlight-string'>query</span>"
        },
        {
          "key": "summary",
          "highlightString": "<span class='highlight-string'>Query</span> Data Using 'json-query' Format"
        },
        {
          "key": "description",
          "highlightString": "<span class='highlight-string'>Query</span> data using a dot/bracket notation string and a matching key/value pair."
        }
      ],
      "groups": [],
      "x": 1.0259515570934257,
      "y": 0.5716417910447761,
      "scheduled": false
    },
    "44d4": {
      "name": "transformation",
      "canvasName": "transformation",
      "summary": "IAGDO: Results Ansible Query and Pass Through",
      "description": "IAGDO: Results Ansible Query and Pass Through",
      "location": "Application",
      "locationType": null,
      "app": "WorkFlowEngine",
      "type": "operation",
      "displayName": "WorkFlowEngine",
      "variables": {
        "incoming": {
          "tr_id": "63a5d3e0283de90111a042e8",
          "variableMap": {
            "result": "$var.1809.job_details"
          },
          "options": {
            "extractOutput": true,
            "validateIncoming": true,
            "revertToDefaultValue": false
          }
        },
        "outgoing": {
          "addDeviceResults": null
        },
        "decorators": [
          {
            "pointer": "/incoming/variableMap/result",
            "type": "encryption"
          }
        ]
      },
      "deprecated": false,
      "matched": [
        {
          "key": "description",
          "highlightString": "Perform a JSON Transformation using the <span class='highlight-string'>JST</span> library."
        }
      ],
      "groups": [],
      "x": 0.8581314878892734,
      "y": 0.5656716417910448,
      "task_name": "IAGDO: Results Ansible Query and Pass Through",
      "retrySettings": null
    },
    "fbe3": {
      "name": "transformation",
      "canvasName": "transformation",
      "summary": "IAGDO: Results Inventory Query and Pass Through",
      "description": "IAGDO: Results Inventory Query and Pass Through",
      "location": "Application",
      "locationType": null,
      "app": "WorkFlowEngine",
      "type": "operation",
      "displayName": "WorkFlowEngine",
      "variables": {
        "incoming": {
          "tr_id": "63a5d6b8283de90111a042ea",
          "variableMap": {
            "result": "$var.f563.job_details"
          },
          "options": {
            "extractOutput": true,
            "validateIncoming": true,
            "revertToDefaultValue": false
          }
        },
        "outgoing": {
          "addDeviceResults": null
        },
        "decorators": [
          {
            "pointer": "/incoming/variableMap/result",
            "type": "encryption"
          }
        ]
      },
      "deprecated": false,
      "matched": [
        {
          "key": "description",
          "highlightString": "Perform a JSON Transformation using the <span class='highlight-string'>JST</span> library."
        }
      ],
      "groups": [],
      "x": 0.8788927335640139,
      "y": 0.7626865671641792,
      "task_name": "IAGDO: Results HTTP Query and Pass Through",
      "retrySettings": null
    },
    "e3ae": {
      "name": "query",
      "canvasName": "query",
      "summary": "Promote detail to job variable",
      "description": "Promote detail to job variable",
      "location": "Application",
      "locationType": null,
      "app": "WorkFlowEngine",
      "type": "operation",
      "displayName": "WorkFlowEngine",
      "variables": {
        "incoming": {
          "pass_on_null": false,
          "query": "",
          "obj": "$var.16c8.ReturnStatus"
        },
        "outgoing": {
          "return_data": "$var.job.ReturnStatus"
        },
        "error": "",
        "decorators": []
      },
      "deprecated": false,
      "matched": [
        {
          "key": "canvasName",
          "highlightString": "<span class='highlight-string'>query</span>"
        },
        {
          "key": "summary",
          "highlightString": "<span class='highlight-string'>Query</span> Data Using 'json-query' Format"
        },
        {
          "key": "description",
          "highlightString": "<span class='highlight-string'>Query</span> data using a dot/bracket notation string and a matching key/value pair."
        }
      ],
      "groups": [],
      "x": 1.5160599571734474,
      "y": 0.5451807228915663,
      "scheduled": false
    },
    "b386": {
      "name": "query",
      "canvasName": "query",
      "summary": "Promote detail to job variable",
      "description": "Promote detail to job variable",
      "location": "Application",
      "locationType": null,
      "app": "WorkFlowEngine",
      "type": "operation",
      "displayName": "WorkFlowEngine",
      "variables": {
        "incoming": {
          "pass_on_null": false,
          "query": "",
          "obj": "$var.8407.ReturnStatus"
        },
        "outgoing": {
          "return_data": "$var.job.ReturnStatus"
        },
        "error": "",
        "decorators": []
      },
      "deprecated": false,
      "matched": [
        {
          "key": "canvasName",
          "highlightString": "<span class='highlight-string'>query</span>"
        },
        {
          "key": "summary",
          "highlightString": "<span class='highlight-string'>Query</span> Data Using 'json-query' Format"
        },
        {
          "key": "description",
          "highlightString": "<span class='highlight-string'>Query</span> data using a dot/bracket notation string and a matching key/value pair."
        }
      ],
      "groups": [],
      "x": 0.24151857835218093,
      "y": 1.0235988200589972,
      "scheduled": false
    },
    "5de3": {
      "name": "query",
      "canvasName": "query",
      "summary": "Promote detail to job variable",
      "description": "Promote detail to job variable",
      "location": "Application",
      "locationType": null,
      "app": "WorkFlowEngine",
      "type": "operation",
      "displayName": "WorkFlowEngine",
      "variables": {
        "incoming": {
          "pass_on_null": false,
          "query": "",
          "obj": "$var.faef.ReturnStatus"
        },
        "outgoing": {
          "return_data": "$var.job.ReturnStatus"
        },
        "error": "",
        "decorators": []
      },
      "deprecated": false,
      "matched": [
        {
          "key": "canvasName",
          "highlightString": "<span class='highlight-string'>query</span>"
        },
        {
          "key": "summary",
          "highlightString": "<span class='highlight-string'>Query</span> Data Using 'json-query' Format"
        },
        {
          "key": "description",
          "highlightString": "<span class='highlight-string'>Query</span> data using a dot/bracket notation string and a matching key/value pair."
        }
      ],
      "groups": [],
      "x": 0.062197092084006464,
      "y": 1.5486725663716814,
      "scheduled": false
    },
    "42d9": {
      "name": "evaluation",
      "canvasName": "evaluation",
      "summary": "Check if verbose false",
      "description": "Check if verbose false",
      "location": "Application",
      "locationType": null,
      "app": "WorkFlowEngine",
      "type": "operation",
      "displayName": "WorkFlowEngine",
      "variables": {
        "incoming": {
          "all_true_flag": false,
          "evaluation_groups": [
            {
              "all_true_flag": false,
              "evaluations": [
                {
                  "query": "",
                  "operand_1": {
                    "variable": "verbose",
                    "task": "job",
                    "editable": true
                  },
                  "operator": "==",
                  "operand_2": {
                    "variable": false,
                    "task": "static"
                  },
                  "rightQuery": ""
                }
              ]
            }
          ]
        },
        "outgoing": {
          "return_value": null
        }
      },
      "deprecated": false,
      "matched": [
        {
          "key": "canvasName",
          "highlightString": "<span class='highlight-string'>eval</span>uation"
        },
        {
          "key": "summary",
          "highlightString": "Run <span class='highlight-string'>Eval</span>uation Task"
        },
        {
          "key": "description",
          "highlightString": "Run an <span class='highlight-string'>eval</span>uation"
        }
      ],
      "groups": [],
      "x": 1.7221324717285944,
      "y": 0.5427728613569321
    },
    "d9b5": {
      "name": "ViewData",
      "canvasName": "ViewData",
      "summary": "View Onboard Device Return Status Data",
      "description": "View Onboard Device Return Status Data",
      "location": "Application",
      "app": "WorkFlowEngine",
      "displayName": "WorkFlowEngine",
      "type": "manual",
      "variables": {
        "incoming": {
          "header": "Onboard Device Return Status",
          "message": "View return status data below",
          "body": "$var.job.ReturnStatus",
          "variables": "",
          "btn_success": "Proceed",
          "btn_failure": ""
        },
        "outgoing": {},
        "error": "",
        "decorators": []
      },
      "view": "/workflow_engine/task/ViewData",
      "deprecated": false,
      "matched": [
        {
          "key": "canvasName",
          "highlightString": "<span class='highlight-string'>View</span><span class='highlight-string'>Data</span>"
        },
        {
          "key": "summary",
          "highlightString": "<span class='highlight-string'>View</span> <span class='highlight-string'>Data</span>"
        },
        {
          "key": "description",
          "highlightString": "Displays a message and runtime <span class='highlight-string'>data</span> to an operator. This can be used to request a decision, or used for acknowledgement only."
        }
      ],
      "groups": [],
      "x": 1.8893376413570275,
      "y": 0.6651917404129793,
      "scheduled": false
    },
    "e1d0": {
      "name": "evaluation",
      "canvasName": "evaluation",
      "summary": "Check if verbose false",
      "description": "Check if verbose false",
      "location": "Application",
      "locationType": null,
      "app": "WorkFlowEngine",
      "type": "operation",
      "displayName": "WorkFlowEngine",
      "variables": {
        "incoming": {
          "all_true_flag": false,
          "evaluation_groups": [
            {
              "all_true_flag": false,
              "evaluations": [
                {
                  "query": "",
                  "operand_1": {
                    "variable": "verbose",
                    "task": "job",
                    "editable": true
                  },
                  "operator": "==",
                  "operand_2": {
                    "variable": false,
                    "task": "static"
                  },
                  "rightQuery": ""
                }
              ]
            }
          ]
        },
        "outgoing": {
          "return_value": null
        }
      },
      "deprecated": false,
      "matched": [
        {
          "key": "canvasName",
          "highlightString": "<span class='highlight-string'>eval</span>uation"
        },
        {
          "key": "summary",
          "highlightString": "Run <span class='highlight-string'>Eval</span>uation Task"
        },
        {
          "key": "description",
          "highlightString": "Run an <span class='highlight-string'>eval</span>uation"
        }
      ],
      "groups": [],
      "x": 0.2407108239095315,
      "y": 1.1327433628318584
    },
    "64c3": {
      "name": "ViewData",
      "canvasName": "ViewData",
      "summary": "View ReturnStatus Data",
      "description": "View ReturnStatus Data",
      "location": "Application",
      "app": "WorkFlowEngine",
      "displayName": "WorkFlowEngine",
      "type": "manual",
      "variables": {
        "incoming": {
          "header": "Return Status",
          "message": "",
          "body": "$var.job.ReturnStatus",
          "variables": "",
          "btn_success": "Proceed",
          "btn_failure": "Retry"
        },
        "outgoing": {},
        "error": "",
        "decorators": []
      },
      "view": "/workflow_engine/task/ViewData",
      "deprecated": false,
      "matched": [
        {
          "key": "canvasName",
          "highlightString": "<span class='highlight-string'>View</span><span class='highlight-string'>Data</span>"
        },
        {
          "key": "summary",
          "highlightString": "<span class='highlight-string'>View</span> <span class='highlight-string'>Data</span>"
        },
        {
          "key": "description",
          "highlightString": "Displays a message and runtime <span class='highlight-string'>data</span> to an operator. This can be used to request a decision, or used for acknowledgement only."
        }
      ],
      "groups": [],
      "x": 0.23990306946688206,
      "y": 1.275811209439528,
      "scheduled": false
    },
    "4b3c": {
      "name": "evaluation",
      "canvasName": "evaluation",
      "summary": "Check if verbose false",
      "description": "Check if verbose false",
      "location": "Application",
      "locationType": null,
      "app": "WorkFlowEngine",
      "type": "operation",
      "displayName": "WorkFlowEngine",
      "variables": {
        "incoming": {
          "all_true_flag": false,
          "evaluation_groups": [
            {
              "all_true_flag": false,
              "evaluations": [
                {
                  "query": "",
                  "operand_1": {
                    "variable": "verbose",
                    "task": "job",
                    "editable": true
                  },
                  "operator": "==",
                  "operand_2": {
                    "variable": false,
                    "task": "static"
                  },
                  "rightQuery": ""
                }
              ]
            }
          ]
        },
        "outgoing": {
          "return_value": null
        }
      },
      "deprecated": false,
      "matched": [
        {
          "key": "canvasName",
          "highlightString": "<span class='highlight-string'>eval</span>uation"
        },
        {
          "key": "summary",
          "highlightString": "Run <span class='highlight-string'>Eval</span>uation Task"
        },
        {
          "key": "description",
          "highlightString": "Run an <span class='highlight-string'>eval</span>uation"
        }
      ],
      "groups": [],
      "x": 0.0630048465266559,
      "y": 1.6430678466076696
    },
    "b79e": {
      "name": "ViewData",
      "canvasName": "ViewData",
      "summary": "View ReturnStatus Data",
      "description": "View ReturnStatus Data",
      "location": "Application",
      "app": "WorkFlowEngine",
      "displayName": "WorkFlowEngine",
      "type": "manual",
      "variables": {
        "incoming": {
          "header": "Return Status",
          "message": "",
          "body": "$var.job.ReturnStatus",
          "variables": "",
          "btn_success": "Proceed",
          "btn_failure": "Retry"
        },
        "outgoing": {},
        "error": "",
        "decorators": []
      },
      "view": "/workflow_engine/task/ViewData",
      "deprecated": false,
      "matched": [
        {
          "key": "canvasName",
          "highlightString": "<span class='highlight-string'>View</span><span class='highlight-string'>Data</span>"
        },
        {
          "key": "summary",
          "highlightString": "<span class='highlight-string'>View</span> <span class='highlight-string'>Data</span>"
        },
        {
          "key": "description",
          "highlightString": "Displays a message and runtime <span class='highlight-string'>data</span> to an operator. This can be used to request a decision, or used for acknowledgement only."
        }
      ],
      "groups": [],
      "x": 0.05735056542810985,
      "y": 1.803834808259587,
      "scheduled": false
    }
  },
  "transitions": {
    "1809": {
      "44d4": {
        "type": "standard",
        "state": "success"
      }
    },
    "8407": {
      "b386": {
        "type": "standard",
        "state": "success"
      }
    },
    "workflow_start": {
      "2dd6": {
        "type": "standard",
        "state": "success"
      }
    },
    "workflow_end": {},
    "16c8": {
      "e3ae": {
        "type": "standard",
        "state": "success"
      }
    },
    "bd1a": {},
    "58b": {},
    "2b8a": {},
    "e4af": {
      "1809": {
        "type": "standard",
        "state": "success"
      },
      "928a": {
        "type": "standard",
        "state": "failure"
      }
    },
    "928a": {
      "f563": {
        "type": "standard",
        "state": "success"
      }
    },
    "5d75": {},
    "f563": {
      "fbe3": {
        "type": "standard",
        "state": "success"
      }
    },
    "c745": {},
    "2dd6": {
      "5cd4": {
        "type": "standard",
        "state": "success"
      }
    },
    "5cd4": {
      "faef": {
        "type": "standard",
        "state": "failure"
      },
      "ad9e": {
        "type": "standard",
        "state": "success"
      }
    },
    "e274": {
      "50a4": {
        "type": "standard",
        "state": "success"
      }
    },
    "faef": {
      "5de3": {
        "type": "standard",
        "state": "success"
      }
    },
    "ad9e": {
      "8407": {
        "type": "standard",
        "state": "failure"
      },
      "e4af": {
        "type": "standard",
        "state": "success"
      }
    },
    "50a4": {
      "42d9": {
        "type": "standard",
        "state": "success"
      }
    },
    "ad96": {
      "16c8": {
        "type": "standard",
        "state": "success"
      }
    },
    "e59c": {
      "16c8": {
        "type": "standard",
        "state": "success"
      }
    },
    "44d4": {
      "e59c": {
        "type": "standard",
        "state": "success"
      }
    },
    "fbe3": {
      "ad96": {
        "type": "standard",
        "state": "success"
      }
    },
    "e3ae": {
      "42d9": {
        "type": "standard",
        "state": "success"
      }
    },
    "b386": {
      "e1d0": {
        "type": "standard",
        "state": "success"
      }
    },
    "5ce": {},
    "5de3": {
      "4b3c": {
        "type": "standard",
        "state": "success"
      }
    },
    "42d9": {
      "workflow_end": {
        "type": "standard",
        "state": "success"
      },
      "d9b5": {
        "type": "standard",
        "state": "failure"
      }
    },
    "d9b5": {
      "workflow_end": {
        "type": "standard",
        "state": "success"
      }
    },
    "e1d0": {
      "64c3": {
        "type": "standard",
        "state": "failure"
      },
      "50a4": {
        "type": "standard",
        "state": "success"
      }
    },
    "64c3": {
      "50a4": {
        "type": "standard",
        "state": "success"
      },
      "2dd6": {
        "type": "revert",
        "state": "failure"
      }
    },
    "4b3c": {
      "b79e": {
        "type": "standard",
        "state": "failure"
      },
      "e274": {
        "type": "standard",
        "state": "success"
      }
    },
    "b79e": {
      "e274": {
        "type": "standard",
        "state": "success"
      },
      "2dd6": {
        "type": "revert",
        "state": "failure"
      }
    }
  },
  "font_size": 12,
  "last_updated": "2023-01-23T22:12:02.673Z",
  "last_updated_by": {
    "provenance": "local_aaa",
    "username": "admin@pronghorn",
    "firstname": "admin",
    "inactive": false
  },
  "lastUpdatedVersion": "5.44.8-2021.2.60.0",
  "inputSchema": {
    "type": "object",
    "properties": {
      "device": {
        "$id": "device",
        "type": "object",
        "properties": {
          "device_name": {
            "type": "string",
            "examples": [
              "testing-mani-333"
            ]
          },
          "inventory_type": {
            "type": "string",
            "examples": [
              "ansible_device"
            ]
          },
          "iag_adapter_instance": {
            "type": "string",
            "examples": [
              "DSUP IAG-2021%2E2"
            ]
          },
          "onboarding": {
            "type": "object",
            "required": []
          }
        },
        "required": []
      },
      "verbose": {
        "$id": "verbose",
        "type": "boolean",
        "examples": [
          true,
          false
        ]
      }
    },
    "required": [
      "device",
      "verbose"
    ]
  },
  "outputSchema": {
    "type": "object",
    "properties": {
      "device": {
        "$id": "device",
        "type": "object",
        "properties": {
          "device_name": {
            "type": "string",
            "examples": [
              "testing-mani-333"
            ]
          },
          "inventory_type": {
            "type": "string",
            "examples": [
              "ansible_device"
            ]
          },
          "iag_adapter_instance": {
            "type": "string",
            "examples": [
              "DSUP IAG-2021%2E2"
            ]
          },
          "onboarding": {
            "type": "object",
            "required": []
          }
        },
        "required": []
      },
      "verbose": {
        "$id": "verbose",
        "type": "boolean",
        "examples": [
          true,
          false
        ]
      },
      "_id": {
        "type": "string",
        "pattern": "^[0-9a-f]{24}$"
      },
      "initiator": {
        "type": "string"
      },
      "add_device_results": {
        "title": "return_data",
        "type": [
          "string",
          "number",
          "object",
          "integer",
          "array",
          "boolean",
          "null"
        ],
        "examples": [
          "value"
        ]
      },
      "ReturnStatus": {
        "title": "return_data",
        "type": [
          "string",
          "number",
          "object",
          "integer",
          "array",
          "boolean",
          "null"
        ],
        "examples": [
          "value"
        ]
      }
    }
  },
  "created": "2022-12-21T20:46:43.717Z",
  "created_by": {
    "provenance": "local_aaa",
    "username": "admin@pronghorn",
    "firstname": "admin",
    "inactive": false
  },
  "createdVersion": "5.44.8-2021.2.60.0",
  "preAutomationTime": 0,
  "sla": 0,
  "canvasVersion": 1,
  "decorators": [
    {
      "type": "encryption",
      "pointer": "/variables/device"
    }
  ],
  "tags": [],
  "groups": [],
  "migrationVersion": 1
}