{
  "_id": "63a5d6b8283de90111a042ea",
  "name": "IAGDO: Results Inventory Query and Pass Through",
  "description": "IAGDO: Results Inventory Query and Pass Through",
  "incoming": [
    {
      "$id": "result",
      "type": "object",
      "properties": {},
      "required": []
    }
  ],
  "outgoing": [
    {
      "$id": "addDeviceResults",
      "type": "object",
      "properties": {
        "addDeviceResponse": {
          "type": [
            "object",
            "array",
            "string",
            "null"
          ]
        },
        "status": {
          "type": "string"
        }
      },
      "required": []
    }
  ],
  "steps": [
    {
      "id": 1,
      "type": "method",
      "library": "WorkFlowEngine",
      "method": "query",
      "args": [
        false,
        "createInventoryDeviceResponse",
        null
      ],
      "view": {
        "row": 1,
        "col": 1
      }
    },
    {
      "id": 2,
      "type": "assign",
      "from": {
        "location": "incoming",
        "name": "result",
        "ptr": ""
      },
      "to": {
        "location": "method",
        "name": 1,
        "ptr": "/args/2/value"
      }
    },
    {
      "id": 4,
      "type": "method",
      "library": "WorkFlowEngine",
      "method": "query",
      "args": [
        false,
        "status",
        null
      ],
      "view": {
        "row": 2,
        "col": 1
      }
    },
    {
      "id": 5,
      "type": "assign",
      "from": {
        "location": "incoming",
        "name": "result",
        "ptr": ""
      },
      "to": {
        "location": "method",
        "name": 4,
        "ptr": "/args/2/value"
      }
    },
    {
      "id": 6,
      "type": "assign",
      "from": {
        "location": "method",
        "name": 4,
        "ptr": "/return"
      },
      "to": {
        "location": "outgoing",
        "name": "addDeviceResults",
        "ptr": "/status"
      }
    },
    {
      "id": 7,
      "type": "assign",
      "from": {
        "location": "method",
        "name": 1,
        "ptr": "/return"
      },
      "to": {
        "location": "outgoing",
        "name": "addDeviceResults",
        "ptr": "/addDeviceResponse"
      }
    }
  ],
  "functions": [],
  "comments": [],
  "view": {
    "col": 1,
    "row": 5
  },
  "created": "2022-12-23T16:26:32.753Z",
  "createdBy": {
    "_id": "63a35d4a3aa34aa0b0006e7a",
    "provenance": "local_aaa",
    "username": "admin@pronghorn"
  },
  "lastUpdated": "2023-01-23T22:10:44.362Z",
  "lastUpdatedBy": {
    "_id": "63a35d4a3aa34aa0b0006e7a",
    "provenance": "local_aaa",
    "username": "admin@pronghorn"
  },
  "version": "3.20.4-2021.2.10",
  "tags": []
}