{
  "_id": "63a38616283de90111a042e1",
  "name": "IAGDO: IAG Create Inventory Device ",
  "description": "IAGDO: IAG Create Inventory Device ",
  "incoming": [
    {
      "$id": "device",
      "type": "object",
      "properties": {
        "device_name": {
          "type": "string",
          "examples": [
            "test-device-1"
          ]
        },
        "inventory_type": {
          "type": "string",
          "examples": [
            "http_requests"
          ]
        },
        "iag_adapter_instance": {
          "type": "string",
          "examples": [
            "IAG-2021%2E2"
          ]
        },
        "onboarding": {
          "type": "object",
          "required": []
        }
      },
      "required": []
    }
  ],
  "outgoing": [
    {
      "$id": "deviceName",
      "type": "string"
    },
    {
      "$id": "iagAdapterId",
      "type": "string"
    },
    {
      "$id": "iagDeviceVars",
      "type": "object",
      "properties": {},
      "required": []
    },
    {
      "$id": "inventoryType",
      "type": "string"
    }
  ],
  "steps": [
    {
      "id": 28,
      "type": "assign",
      "from": {
        "location": "incoming",
        "name": "device",
        "ptr": "/onboarding"
      },
      "to": {
        "location": "outgoing",
        "name": "iagDeviceVars",
        "ptr": ""
      }
    },
    {
      "id": 29,
      "type": "assign",
      "from": {
        "location": "incoming",
        "name": "device",
        "ptr": "/iag_adapter_instance"
      },
      "to": {
        "location": "outgoing",
        "name": "iagAdapterId",
        "ptr": ""
      }
    },
    {
      "id": 30,
      "type": "assign",
      "from": {
        "location": "incoming",
        "name": "device",
        "ptr": "/inventory_type"
      },
      "to": {
        "location": "outgoing",
        "name": "inventoryType",
        "ptr": ""
      }
    },
    {
      "id": 31,
      "type": "assign",
      "from": {
        "location": "incoming",
        "name": "device",
        "ptr": "/device_name"
      },
      "to": {
        "location": "outgoing",
        "name": "deviceName",
        "ptr": ""
      }
    }
  ],
  "functions": [],
  "comments": [],
  "view": {
    "col": 1,
    "row": 5
  },
  "created": "2022-12-21T22:17:58.781Z",
  "createdBy": {
    "_id": "63a35d4a3aa34aa0b0006e7a",
    "provenance": "local_aaa",
    "username": "admin@pronghorn"
  },
  "lastUpdated": "2023-01-13T17:31:53.254Z",
  "lastUpdatedBy": {
    "_id": "63a35d4a3aa34aa0b0006e7a",
    "provenance": "local_aaa",
    "username": "admin@pronghorn"
  },
  "version": "3.20.4-2021.2.10",
  "tags": []
}