{
  "_id": "63a2250537f0350103037967",
  "name": "IAGGDD: Create Response Output HTTP Request",
  "description": "Constructs response for Get Device Details workflow",
  "incoming": [
    {
      "$id": "deviceDetails",
      "type": [
        "array",
        "object",
        "null",
        "string"
      ]
    },
    {
      "$id": "errorResponse",
      "type": [
        "array",
        "object",
        "null",
        "string"
      ]
    },
    {
      "$id": "status",
      "type": "string"
    },
    {
      "$id": "deviceName",
      "type": "string"
    },
    {
      "$id": "inventoryType",
      "type": "string"
    },
    {
      "$id": "errors",
      "type": "array"
    }
  ],
  "outgoing": [
    {
      "$id": "ReturnStatus",
      "type": "object",
      "properties": {
        "response": {
          "type": "object",
          "properties": {
            "device_details": {
              "type": "object",
              "properties": {},
              "required": []
            }
          },
          "required": []
        },
        "device": {
          "type": "string",
          "examples": [
            "soraTest"
          ]
        },
        "inventory_type": {
          "type": "string",
          "examples": [
            "http_requests"
          ]
        },
        "message": {
          "type": "string",
          "examples": [
            "Updated device"
          ]
        },
        "status": {
          "type": "string",
          "examples": [
            "SUCCESS"
          ]
        },
        "errors": {
          "type": "array",
          "items": {
            "type": "object",
            "properties": {},
            "required": []
          }
        }
      },
      "required": []
    }
  ],
  "steps": [
    {
      "id": 1,
      "type": "method",
      "library": "Logical",
      "method": "nullish",
      "args": [
        null,
        false
      ],
      "view": {
        "row": 1,
        "col": 1
      }
    },
    {
      "id": 2,
      "type": "assign",
      "from": {
        "location": "incoming",
        "name": "deviceDetails",
        "ptr": ""
      },
      "to": {
        "location": "method",
        "name": 1,
        "ptr": "/args/0/value"
      }
    },
    {
      "id": 3,
      "type": "method",
      "library": "Logical",
      "method": "nullish",
      "args": [
        null,
        "No Error Details Found"
      ],
      "view": {
        "row": 2,
        "col": 3
      }
    },
    {
      "id": 5,
      "type": "method",
      "library": "Conditional",
      "method": "ternary",
      "args": [
        null,
        null,
        null
      ],
      "view": {
        "row": 1,
        "col": 5
      }
    },
    {
      "id": 12,
      "type": "assign",
      "from": {
        "location": "incoming",
        "name": "status",
        "ptr": ""
      },
      "to": {
        "location": "outgoing",
        "name": "ReturnStatus",
        "ptr": "/status"
      }
    },
    {
      "id": 13,
      "type": "assign",
      "from": {
        "location": "incoming",
        "name": "deviceName",
        "ptr": ""
      },
      "to": {
        "location": "outgoing",
        "name": "ReturnStatus",
        "ptr": "/device"
      }
    },
    {
      "id": 15,
      "type": "method",
      "library": "Object",
      "method": "deleteProperty",
      "args": [
        null,
        "response.variables.auth"
      ],
      "view": {
        "row": 1,
        "col": 2
      }
    },
    {
      "id": 16,
      "type": "assign",
      "from": {
        "location": "method",
        "name": 1,
        "ptr": "/return"
      },
      "to": {
        "location": "method",
        "name": 15,
        "ptr": "/args/0/value"
      }
    },
    {
      "id": 22,
      "type": "assign",
      "from": {
        "location": "method",
        "name": 1,
        "ptr": "/return"
      },
      "to": {
        "location": "method",
        "name": 5,
        "ptr": "/args/0/value"
      }
    },
    {
      "id": 24,
      "type": "function",
      "function": "createErrorObject",
      "args": [
        "",
        "Unable to get device"
      ],
      "view": {
        "row": 4,
        "col": 1
      }
    },
    {
      "id": 26,
      "type": "method",
      "library": "Array",
      "method": "push",
      "args": [
        null,
        null
      ],
      "view": {
        "row": 4,
        "col": 2
      }
    },
    {
      "id": 27,
      "type": "method",
      "library": "Conditional",
      "method": "ternary",
      "args": [
        null,
        null,
        null
      ],
      "view": {
        "row": 4,
        "col": 3
      }
    },
    {
      "id": 29,
      "type": "assign",
      "from": {
        "location": "incoming",
        "name": "errors",
        "ptr": ""
      },
      "to": {
        "location": "method",
        "name": 26,
        "ptr": "/args/0/value"
      }
    },
    {
      "id": 35,
      "type": "method",
      "library": "Equality",
      "method": "equality",
      "args": [
        null,
        "FAILED"
      ],
      "view": {
        "row": 3,
        "col": 2
      }
    },
    {
      "id": 36,
      "type": "assign",
      "from": {
        "location": "method",
        "name": 35,
        "ptr": "/return"
      },
      "to": {
        "location": "method",
        "name": 27,
        "ptr": "/args/0/value"
      }
    },
    {
      "id": 37,
      "type": "assign",
      "from": {
        "location": "incoming",
        "name": "status",
        "ptr": ""
      },
      "to": {
        "location": "method",
        "name": 35,
        "ptr": "/args/0/value"
      }
    },
    {
      "id": 40,
      "type": "assign",
      "from": {
        "location": "function",
        "name": 24,
        "ptr": "/return/errorObject"
      },
      "to": {
        "location": "method",
        "name": 26,
        "ptr": "/args/1/value"
      }
    },
    {
      "id": 41,
      "type": "assign",
      "from": {
        "location": "method",
        "name": 26,
        "ptr": "/return"
      },
      "to": {
        "location": "method",
        "name": 27,
        "ptr": "/args/1/value"
      }
    },
    {
      "id": 42,
      "type": "assign",
      "from": {
        "location": "incoming",
        "name": "errors",
        "ptr": ""
      },
      "to": {
        "location": "method",
        "name": 27,
        "ptr": "/args/2/value"
      }
    },
    {
      "id": 43,
      "type": "assign",
      "from": {
        "location": "method",
        "name": 27,
        "ptr": "/return"
      },
      "to": {
        "location": "outgoing",
        "name": "ReturnStatus",
        "ptr": "/errors"
      }
    },
    {
      "id": 44,
      "type": "assign",
      "from": {
        "location": "method",
        "name": 15,
        "ptr": "/return"
      },
      "to": {
        "location": "method",
        "name": 5,
        "ptr": "/args/1/value"
      }
    },
    {
      "id": 45,
      "type": "method",
      "library": "Object",
      "method": "deleteProperty",
      "args": [
        null,
        "IAPerror.raw_response.reqHdr.Authorization"
      ],
      "view": {
        "row": 2,
        "col": 1
      }
    },
    {
      "id": 46,
      "type": "assign",
      "from": {
        "location": "incoming",
        "name": "errorResponse",
        "ptr": ""
      },
      "to": {
        "location": "method",
        "name": 45,
        "ptr": "/args/0/value"
      }
    },
    {
      "id": 47,
      "type": "assign",
      "from": {
        "location": "method",
        "name": 45,
        "ptr": "/return"
      },
      "to": {
        "location": "function",
        "name": 24,
        "ptr": "/args/0/value"
      }
    },
    {
      "id": 48,
      "type": "assign",
      "from": {
        "location": "method",
        "name": 45,
        "ptr": "/return"
      },
      "to": {
        "location": "method",
        "name": 3,
        "ptr": "/args/0/value"
      }
    },
    {
      "id": 49,
      "type": "assign",
      "from": {
        "location": "method",
        "name": 3,
        "ptr": "/return"
      },
      "to": {
        "location": "method",
        "name": 5,
        "ptr": "/args/2/value"
      }
    },
    {
      "id": 50,
      "type": "assign",
      "from": {
        "location": "method",
        "name": 5,
        "ptr": "/return"
      },
      "to": {
        "location": "outgoing",
        "name": "ReturnStatus",
        "ptr": "/response/device_details"
      }
    },
    {
      "id": 51,
      "type": "assign",
      "from": {
        "location": "incoming",
        "name": "inventoryType",
        "ptr": ""
      },
      "to": {
        "location": "outgoing",
        "name": "ReturnStatus",
        "ptr": "/inventory_type"
      }
    },
    {
      "id": 52,
      "type": "method",
      "library": "Conditional",
      "method": "ternary",
      "args": [
        null,
        null,
        null
      ],
      "view": {
        "row": 3,
        "col": 5
      }
    },
    {
      "id": 53,
      "type": "assign",
      "from": {
        "location": "method",
        "name": 52,
        "ptr": "/return"
      },
      "to": {
        "location": "outgoing",
        "name": "ReturnStatus",
        "ptr": "/message"
      }
    },
    {
      "id": 54,
      "type": "declaration",
      "library": "String",
      "method": "new String",
      "args": [
        "Unable to get device details"
      ],
      "view": {
        "row": 4,
        "col": 4
      }
    },
    {
      "id": 55,
      "type": "declaration",
      "library": "String",
      "method": "new String",
      "args": [
        "Device details found"
      ],
      "view": {
        "row": 5,
        "col": 4
      }
    },
    {
      "id": 56,
      "type": "assign",
      "from": {
        "location": "declaration",
        "name": 55,
        "ptr": "/return"
      },
      "to": {
        "location": "method",
        "name": 52,
        "ptr": "/args/2/value"
      }
    },
    {
      "id": 57,
      "type": "assign",
      "from": {
        "location": "declaration",
        "name": 54,
        "ptr": "/return"
      },
      "to": {
        "location": "method",
        "name": 52,
        "ptr": "/args/1/value"
      }
    },
    {
      "id": 58,
      "type": "assign",
      "from": {
        "location": "method",
        "name": 35,
        "ptr": "/return"
      },
      "to": {
        "location": "method",
        "name": 52,
        "ptr": "/args/0/value"
      }
    }
  ],
  "functions": [
    {
      "incoming": [
        {
          "$id": "errorResponse",
          "type": [
            "array",
            "object",
            "null",
            "string"
          ]
        },
        {
          "$id": "message",
          "type": "string"
        }
      ],
      "outgoing": [
        {
          "$id": "errorObject",
          "type": "object",
          "properties": {
            "error_details": {
              "type": [
                "array",
                "object",
                "null",
                "string"
              ],
              "properties": {},
              "required": []
            },
            "message": {
              "type": "string"
            }
          },
          "required": []
        }
      ],
      "functions": [],
      "name": "createErrorObject",
      "steps": [
        {
          "id": 1,
          "type": "assign",
          "from": {
            "location": "incoming",
            "name": "errorResponse",
            "ptr": ""
          },
          "to": {
            "location": "outgoing",
            "name": "errorObject",
            "ptr": "/error_details"
          }
        },
        {
          "id": 2,
          "type": "assign",
          "from": {
            "location": "incoming",
            "name": "message",
            "ptr": ""
          },
          "to": {
            "location": "outgoing",
            "name": "errorObject",
            "ptr": "/message"
          }
        }
      ],
      "view": {
        "col": 2,
        "row": 3
      },
      "id": "createErrorObject",
      "comments": []
    }
  ],
  "comments": [],
  "view": {
    "col": 5,
    "row": 6
  },
  "created": "2022-12-22T15:22:15.337Z",
  "createdBy": {
    "_id": "63a35d4a3aa34aa0b0006e7a",
    "provenance": "local_aaa",
    "username": "admin@pronghorn"
  },
  "lastUpdated": "2023-01-23T21:57:53.889Z",
  "lastUpdatedBy": {
    "_id": "63a35d4a3aa34aa0b0006e7a",
    "provenance": "local_aaa",
    "username": "admin@pronghorn"
  },
  "version": "3.20.4-2021.2.10",
  "tags": []
}