{
  "_id": "63e2b65500259d00ff39c170",
  "name": "IAGDO: Onboard With Form Rename Payload",
  "description": "Updates property names to be snake case instead of camel case",
  "incoming": [
    {
      "$id": "formData",
      "type": "object",
      "properties": {
        "deviceName": {
          "type": "string",
          "examples": [
            "device_name"
          ]
        },
        "inventoryType": {
          "type": "string",
          "examples": [
            "ansible"
          ]
        },
        "iagAdapterInstance": {
          "type": "string",
          "examples": [
            "IAG"
          ]
        }
      }
    }
  ],
  "outgoing": [
    {
      "$id": "device",
      "type": "object",
      "properties": {
        "device_name": {
          "type": "string",
          "examples": [
            "Ansible_Test_Device"
          ]
        },
        "inventory_type": {
          "type": "string",
          "examples": [
            "ansible"
          ]
        },
        "iag_adapter_instance": {
          "type": "string",
          "examples": [
            "IAG-2021%2E2"
          ]
        }
      },
      "required": []
    },
    {
      "$id": "ansible",
      "type": [
        "array",
        "boolean",
        "integer",
        "null",
        "number",
        "object",
        "string"
      ],
      "properties": {}
    },
    {
      "$id": "httpRequest",
      "type": [
        "array",
        "boolean",
        "integer",
        "null",
        "number",
        "object",
        "string"
      ],
      "properties": {}
    },
    {
      "$id": "was_httpRequest_empty",
      "type": "boolean",
      "examples": [
        true,
        false
      ]
    },
    {
      "$id": "options",
      "type": "object"
    }
  ],
  "steps": [
    {
      "id": 1,
      "type": "method",
      "library": "WorkFlowEngine",
      "method": "query",
      "args": [
        true,
        "ansible",
        null
      ],
      "view": {
        "row": 1,
        "col": 1
      }
    },
    {
      "id": 2,
      "type": "method",
      "library": "WorkFlowEngine",
      "method": "query",
      "args": [
        true,
        "httpRequests",
        null
      ],
      "view": {
        "row": 2,
        "col": 1
      }
    },
    {
      "id": 3,
      "type": "method",
      "library": "Object",
      "method": "getProperty",
      "args": [
        null,
        "options"
      ],
      "view": {
        "row": 3,
        "col": 1
      }
    },
    {
      "id": 4,
      "type": "assign",
      "from": {
        "location": "incoming",
        "name": "formData",
        "ptr": ""
      },
      "to": {
        "location": "method",
        "name": 1,
        "ptr": "/args/2/value"
      }
    },
    {
      "id": 5,
      "type": "assign",
      "from": {
        "location": "incoming",
        "name": "formData",
        "ptr": ""
      },
      "to": {
        "location": "method",
        "name": 2,
        "ptr": "/args/2/value"
      }
    },
    {
      "id": 6,
      "type": "assign",
      "from": {
        "location": "incoming",
        "name": "formData",
        "ptr": ""
      },
      "to": {
        "location": "method",
        "name": 3,
        "ptr": "/args/0/value"
      }
    },
    {
      "id": 7,
      "type": "assign",
      "from": {
        "location": "incoming",
        "name": "formData",
        "ptr": "/deviceName"
      },
      "to": {
        "location": "outgoing",
        "name": "device",
        "ptr": "/device_name"
      }
    },
    {
      "id": 8,
      "type": "assign",
      "from": {
        "location": "incoming",
        "name": "formData",
        "ptr": "/inventoryType"
      },
      "to": {
        "location": "outgoing",
        "name": "device",
        "ptr": "/inventory_type"
      }
    },
    {
      "id": 9,
      "type": "assign",
      "from": {
        "location": "incoming",
        "name": "formData",
        "ptr": "/iagAdapterInstance"
      },
      "to": {
        "location": "outgoing",
        "name": "device",
        "ptr": "/iag_adapter_instance"
      }
    },
    {
      "id": 10,
      "type": "method",
      "library": "Logical",
      "method": "nullish",
      "args": [
        null,
        {
          "verbose": false
        }
      ],
      "view": {
        "row": 3,
        "col": 2
      }
    },
    {
      "id": 11,
      "type": "assign",
      "from": {
        "location": "method",
        "name": 3,
        "ptr": "/return"
      },
      "to": {
        "location": "method",
        "name": 10,
        "ptr": "/args/0/value"
      }
    },
    {
      "id": 12,
      "type": "assign",
      "from": {
        "location": "method",
        "name": 10,
        "ptr": "/return"
      },
      "to": {
        "location": "outgoing",
        "name": "options",
        "ptr": ""
      }
    },
    {
      "id": 13,
      "type": "function",
      "function": "Check If Input is Null",
      "args": [
        "",
        ""
      ],
      "view": {
        "row": 1,
        "col": 2
      }
    },
    {
      "id": 14,
      "type": "function",
      "function": "Check If Input is Null",
      "args": [
        "",
        ""
      ],
      "view": {
        "row": 2,
        "col": 2
      }
    },
    {
      "id": 15,
      "type": "assign",
      "from": {
        "location": "method",
        "name": 1,
        "ptr": "/return"
      },
      "to": {
        "location": "function",
        "name": 13,
        "ptr": "/args/0/value"
      }
    },
    {
      "id": 16,
      "type": "assign",
      "from": {
        "location": "method",
        "name": 2,
        "ptr": "/return"
      },
      "to": {
        "location": "function",
        "name": 14,
        "ptr": "/args/0/value"
      }
    },
    {
      "id": 17,
      "type": "assign",
      "from": {
        "location": "incoming",
        "name": "formData",
        "ptr": ""
      },
      "to": {
        "location": "function",
        "name": 13,
        "ptr": "/args/1/value"
      }
    },
    {
      "id": 18,
      "type": "assign",
      "from": {
        "location": "incoming",
        "name": "formData",
        "ptr": ""
      },
      "to": {
        "location": "function",
        "name": 14,
        "ptr": "/args/1/value"
      }
    },
    {
      "id": 21,
      "type": "assign",
      "from": {
        "location": "function",
        "name": 14,
        "ptr": "/return/result"
      },
      "to": {
        "location": "outgoing",
        "name": "was_httpRequest_empty",
        "ptr": ""
      }
    },
    {
      "id": 22,
      "type": "function",
      "function": "Rename deviceType, becomeMethod, becomePass",
      "args": [
        ""
      ],
      "view": {
        "row": 1,
        "col": 3
      }
    },
    {
      "id": 23,
      "type": "assign",
      "from": {
        "location": "function",
        "name": 13,
        "ptr": "/return/output"
      },
      "to": {
        "location": "function",
        "name": 22,
        "ptr": "/args/0/value"
      }
    },
    {
      "id": 24,
      "type": "assign",
      "from": {
        "location": "function",
        "name": 22,
        "ptr": "/return/ansible"
      },
      "to": {
        "location": "outgoing",
        "name": "ansible",
        "ptr": ""
      }
    },
    {
      "id": 25,
      "type": "function",
      "function": "Rename baseUrl to base_url",
      "args": [
        ""
      ],
      "view": {
        "row": 2,
        "col": 3
      }
    },
    {
      "id": 26,
      "type": "assign",
      "from": {
        "location": "function",
        "name": 14,
        "ptr": "/return/output"
      },
      "to": {
        "location": "function",
        "name": 25,
        "ptr": "/args/0/value"
      }
    },
    {
      "id": 27,
      "type": "assign",
      "from": {
        "location": "function",
        "name": 25,
        "ptr": "/return/httpRequest"
      },
      "to": {
        "location": "outgoing",
        "name": "httpRequest",
        "ptr": ""
      }
    }
  ],
  "functions": [
    {
      "incoming": [
        {
          "$id": "input",
          "type": "object",
          "properties": {},
          "required": []
        },
        {
          "$id": "formData",
          "type": "object",
          "properties": {},
          "required": []
        }
      ],
      "outgoing": [
        {
          "$id": "output",
          "type": [
            "string",
            "boolean",
            "integer",
            "object",
            "array",
            "null"
          ],
          "properties": {},
          "required": []
        },
        {
          "$id": "result",
          "type": "boolean",
          "examples": [
            true,
            false
          ]
        }
      ],
      "functions": [],
      "name": "Check If Input is Null",
      "steps": [
        {
          "id": 1,
          "type": "method",
          "library": "Equality",
          "method": "identity",
          "args": [
            null,
            null
          ],
          "view": {
            "row": 1,
            "col": 1
          }
        },
        {
          "id": 2,
          "type": "assign",
          "from": {
            "location": "incoming",
            "name": "input",
            "ptr": ""
          },
          "to": {
            "location": "method",
            "name": 1,
            "ptr": "/args/0/value"
          }
        },
        {
          "id": 3,
          "type": "assign",
          "from": {
            "location": "incoming",
            "name": "formData",
            "ptr": ""
          },
          "to": {
            "location": "method",
            "name": 1,
            "ptr": "/args/1/value"
          }
        },
        {
          "id": 4,
          "type": "method",
          "library": "Conditional",
          "method": "ternary",
          "args": [
            null,
            null,
            null
          ],
          "view": {
            "row": 1,
            "col": 2
          }
        },
        {
          "id": 5,
          "type": "declaration",
          "library": "Object",
          "method": "new Object",
          "args": [
            null
          ],
          "view": {
            "row": 2,
            "col": 1
          }
        },
        {
          "id": 6,
          "type": "assign",
          "from": {
            "location": "declaration",
            "name": 5,
            "ptr": "/return"
          },
          "to": {
            "location": "method",
            "name": 4,
            "ptr": "/args/1/value"
          }
        },
        {
          "id": 7,
          "type": "assign",
          "from": {
            "location": "incoming",
            "name": "input",
            "ptr": ""
          },
          "to": {
            "location": "method",
            "name": 4,
            "ptr": "/args/2/value"
          }
        },
        {
          "id": 8,
          "type": "assign",
          "from": {
            "location": "method",
            "name": 1,
            "ptr": "/return"
          },
          "to": {
            "location": "method",
            "name": 4,
            "ptr": "/args/0/value"
          }
        },
        {
          "id": 9,
          "type": "assign",
          "from": {
            "location": "method",
            "name": 4,
            "ptr": "/return"
          },
          "to": {
            "location": "outgoing",
            "name": "output",
            "ptr": ""
          }
        },
        {
          "id": 10,
          "type": "assign",
          "from": {
            "location": "method",
            "name": 1,
            "ptr": "/return"
          },
          "to": {
            "location": "outgoing",
            "name": "result",
            "ptr": ""
          }
        }
      ],
      "view": {
        "col": 2,
        "row": 3
      },
      "id": "Check If Input is Null",
      "comments": []
    },
    {
      "incoming": [
        {
          "$id": "ansible",
          "type": "object",
          "properties": {},
          "required": []
        }
      ],
      "outgoing": [
        {
          "$id": "ansible",
          "type": "object",
          "properties": {},
          "required": []
        }
      ],
      "functions": [],
      "name": "Rename deviceType, becomeMethod, becomePass",
      "steps": [
        {
          "id": 1,
          "type": "method",
          "library": "Object",
          "method": "getProperty",
          "args": [
            null,
            "deviceType"
          ],
          "view": {
            "row": 1,
            "col": 1
          }
        },
        {
          "id": 2,
          "type": "method",
          "library": "Object",
          "method": "getProperty",
          "args": [
            null,
            "becomeMethod"
          ],
          "view": {
            "row": 2,
            "col": 1
          }
        },
        {
          "id": 3,
          "type": "method",
          "library": "Object",
          "method": "getProperty",
          "args": [
            null,
            "becomePass"
          ],
          "view": {
            "row": 3,
            "col": 1
          }
        },
        {
          "id": 4,
          "type": "assign",
          "from": {
            "location": "incoming",
            "name": "ansible",
            "ptr": ""
          },
          "to": {
            "location": "method",
            "name": 1,
            "ptr": "/args/0/value"
          }
        },
        {
          "id": 5,
          "type": "assign",
          "from": {
            "location": "incoming",
            "name": "ansible",
            "ptr": ""
          },
          "to": {
            "location": "method",
            "name": 2,
            "ptr": "/args/0/value"
          }
        },
        {
          "id": 6,
          "type": "assign",
          "from": {
            "location": "incoming",
            "name": "ansible",
            "ptr": ""
          },
          "to": {
            "location": "method",
            "name": 3,
            "ptr": "/args/0/value"
          }
        },
        {
          "id": 7,
          "type": "method",
          "library": "Object",
          "method": "setProperty",
          "args": [
            null,
            "device-type",
            null
          ],
          "view": {
            "row": 1,
            "col": 2
          }
        },
        {
          "id": 8,
          "type": "method",
          "library": "Object",
          "method": "setProperty",
          "args": [
            null,
            "become_method",
            null
          ],
          "view": {
            "row": 2,
            "col": 2
          }
        },
        {
          "id": 9,
          "type": "method",
          "library": "Object",
          "method": "setProperty",
          "args": [
            null,
            "become_pass",
            null
          ],
          "view": {
            "row": 3,
            "col": 2
          }
        },
        {
          "id": 10,
          "type": "assign",
          "from": {
            "location": "incoming",
            "name": "ansible",
            "ptr": ""
          },
          "to": {
            "location": "method",
            "name": 7,
            "ptr": "/args/0/value"
          }
        },
        {
          "id": 11,
          "type": "assign",
          "from": {
            "location": "method",
            "name": 7,
            "ptr": "/return"
          },
          "to": {
            "location": "method",
            "name": 8,
            "ptr": "/args/0/value"
          }
        },
        {
          "id": 12,
          "type": "assign",
          "from": {
            "location": "method",
            "name": 8,
            "ptr": "/return"
          },
          "to": {
            "location": "method",
            "name": 9,
            "ptr": "/args/0/value"
          }
        },
        {
          "id": 13,
          "type": "assign",
          "from": {
            "location": "method",
            "name": 3,
            "ptr": "/return"
          },
          "to": {
            "location": "method",
            "name": 9,
            "ptr": "/args/2/value"
          }
        },
        {
          "id": 14,
          "type": "assign",
          "from": {
            "location": "method",
            "name": 2,
            "ptr": "/return"
          },
          "to": {
            "location": "method",
            "name": 8,
            "ptr": "/args/2/value"
          }
        },
        {
          "id": 15,
          "type": "assign",
          "from": {
            "location": "method",
            "name": 1,
            "ptr": "/return"
          },
          "to": {
            "location": "method",
            "name": 7,
            "ptr": "/args/2/value"
          }
        },
        {
          "id": 16,
          "type": "method",
          "library": "Object",
          "method": "deleteProperty",
          "args": [
            null,
            "deviceType"
          ],
          "view": {
            "row": 1,
            "col": 3
          }
        },
        {
          "id": 17,
          "type": "method",
          "library": "Object",
          "method": "deleteProperty",
          "args": [
            null,
            "becomeMethod"
          ],
          "view": {
            "row": 2,
            "col": 3
          }
        },
        {
          "id": 18,
          "type": "method",
          "library": "Object",
          "method": "deleteProperty",
          "args": [
            null,
            "becomePass"
          ],
          "view": {
            "row": 3,
            "col": 3
          }
        },
        {
          "id": 19,
          "type": "assign",
          "from": {
            "location": "method",
            "name": 9,
            "ptr": "/return"
          },
          "to": {
            "location": "method",
            "name": 16,
            "ptr": "/args/0/value"
          }
        },
        {
          "id": 20,
          "type": "assign",
          "from": {
            "location": "method",
            "name": 16,
            "ptr": "/return"
          },
          "to": {
            "location": "method",
            "name": 17,
            "ptr": "/args/0/value"
          }
        },
        {
          "id": 21,
          "type": "assign",
          "from": {
            "location": "method",
            "name": 17,
            "ptr": "/return"
          },
          "to": {
            "location": "method",
            "name": 18,
            "ptr": "/args/0/value"
          }
        },
        {
          "id": 22,
          "type": "assign",
          "from": {
            "location": "method",
            "name": 18,
            "ptr": "/return"
          },
          "to": {
            "location": "outgoing",
            "name": "ansible",
            "ptr": ""
          }
        }
      ],
      "view": {
        "col": 3,
        "row": 4
      },
      "id": "Rename deviceType, becomeMethod, becomePass",
      "comments": []
    },
    {
      "incoming": [
        {
          "$id": "httpRequest",
          "type": [
            "array",
            "boolean",
            "integer",
            "null",
            "number",
            "object",
            "string"
          ],
          "properties": {}
        }
      ],
      "outgoing": [
        {
          "$id": "httpRequest",
          "type": [
            "array",
            "boolean",
            "integer",
            "null",
            "number",
            "object",
            "string"
          ],
          "properties": {}
        }
      ],
      "functions": [],
      "name": "Rename baseUrl to base_url",
      "steps": [
        {
          "id": 1,
          "type": "method",
          "library": "WorkFlowEngine",
          "method": "query",
          "args": [
            true,
            "baseUrl",
            null
          ],
          "view": {
            "row": 2,
            "col": 1
          }
        },
        {
          "id": 2,
          "type": "assign",
          "from": {
            "location": "incoming",
            "name": "httpRequest",
            "ptr": ""
          },
          "to": {
            "location": "method",
            "name": 1,
            "ptr": "/args/2/value"
          }
        },
        {
          "id": 3,
          "type": "method",
          "library": "Object",
          "method": "setProperty",
          "args": [
            null,
            "base_url",
            null
          ],
          "view": {
            "row": 1,
            "col": 2
          }
        },
        {
          "id": 4,
          "type": "assign",
          "from": {
            "location": "incoming",
            "name": "httpRequest",
            "ptr": ""
          },
          "to": {
            "location": "method",
            "name": 3,
            "ptr": "/args/0/value"
          }
        },
        {
          "id": 5,
          "type": "assign",
          "from": {
            "location": "method",
            "name": 1,
            "ptr": "/return"
          },
          "to": {
            "location": "method",
            "name": 3,
            "ptr": "/args/2/value"
          }
        },
        {
          "id": 6,
          "type": "method",
          "library": "Object",
          "method": "deleteProperty",
          "args": [
            null,
            "baseUrl"
          ],
          "view": {
            "row": 1,
            "col": 3
          }
        },
        {
          "id": 7,
          "type": "assign",
          "from": {
            "location": "method",
            "name": 3,
            "ptr": "/return"
          },
          "to": {
            "location": "method",
            "name": 6,
            "ptr": "/args/0/value"
          }
        },
        {
          "id": 8,
          "type": "assign",
          "from": {
            "location": "method",
            "name": 6,
            "ptr": "/return"
          },
          "to": {
            "location": "outgoing",
            "name": "httpRequest",
            "ptr": ""
          }
        }
      ],
      "view": {
        "col": 3,
        "row": 3
      },
      "id": "Rename baseUrl to base_url",
      "comments": []
    }
  ],
  "comments": [],
  "view": {
    "col": 3,
    "row": 5
  },
  "created": "2023-02-07T20:36:37.466Z",
  "createdBy": {
    "_id": "63a35d4a3aa34aa0b0006e7a",
    "provenance": "local_aaa",
    "username": "admin@pronghorn"
  },
  "lastUpdated": "2023-02-08T16:37:20.072Z",
  "lastUpdatedBy": {
    "_id": "63a35d4a3aa34aa0b0006e7a",
    "provenance": "local_aaa",
    "username": "admin@pronghorn"
  },
  "version": "3.20.4-2021.2.10",
  "tags": []
}