{
  "metadata": {
    "name": "@itentialopensource/group-records-by-property",
    "version": "0.0.8",
    "description": "[Deprecated] JST that groups objects in an array based on a common property provided by the user",
    "license": "Apache-2.0",
    "repository": {
      "type": "gitlab",
      "hostname": "gitlab.com",
      "path": "itentialopensource/pre-built-automations"
    },
    "keywords": [
      "Itential",
      "IAP",
      "artifacts",
      "group",
      "groupby",
      "property",
      "jst",
      "transformation",
      "reduce",
      "search",
      "combine"
    ],
    "author": "Itential Artifacts",
    "IAPDependencies": {},
    "gitlabId": 20259178
  },
  "manifest": {
    "bundleName": "Group Records By Property",
    "fingerprint": "5f23addd8f0c6db27e997e70",
    "createdEpoch": "1596173789798",
    "artifacts": [
      {
        "id": "5f23ad4eeeb859a5db39951d",
        "name": "groupRecordsByProperty",
        "type": "transformation",
        "location": "/bundles/transformations/groupRecordsByProperty.json",
        "properties": {
          "entryPoint": false
        }
      }
    ]
  },
  "bundles": [
    {
      "type": "transformation",
      "data": {
        "_id": "5f23ad4eeeb859a5db39951d",
        "name": "groupRecordsByProperty",
        "incoming": [
          {
            "$id": "array",
            "type": "array",
            "items": {
              "type": "object"
            }
          },
          {
            "$id": "groupByProperty",
            "type": "string",
            "examples": [
              "name"
            ]
          }
        ],
        "outgoing": [
          {
            "$id": "output",
            "type": "object",
            "properties": {},
            "required": []
          }
        ],
        "steps": [
          {
            "id": 2,
            "type": "assign",
            "from": {
              "location": "incoming",
              "name": "array",
              "ptr": ""
            },
            "to": {
              "location": "method",
              "name": 1,
              "ptr": "/args/0/value"
            }
          },
          {
            "id": 3,
            "type": "assign",
            "from": {
              "location": "incoming",
              "name": "groupByProperty",
              "ptr": ""
            },
            "to": {
              "location": "method",
              "name": 1,
              "ptr": "/args/3/value"
            }
          },
          {
            "id": 5,
            "type": "assign",
            "from": {
              "location": "incoming",
              "name": "array",
              "ptr": ""
            },
            "to": {
              "location": "function",
              "name": 4,
              "ptr": "/args/0/value"
            }
          },
          {
            "id": 6,
            "type": "assign",
            "from": {
              "location": "incoming",
              "name": "groupByProperty",
              "ptr": ""
            },
            "to": {
              "location": "function",
              "name": 4,
              "ptr": "/args/1/value"
            }
          },
          {
            "id": 4,
            "type": "function",
            "function": "getHeaders.jst",
            "args": [
              null,
              null
            ],
            "view": {
              "row": 2,
              "col": 1
            },
            "summary": "create object with the group by property values as keys and empty arrays as values"
          },
          {
            "id": 7,
            "type": "assign",
            "from": {
              "location": "function",
              "name": 4,
              "ptr": "/return/headers"
            },
            "to": {
              "location": "method",
              "name": 1,
              "ptr": "/args/2/value"
            }
          },
          {
            "id": 1,
            "type": "method",
            "library": "Array",
            "method": "reduce",
            "args": [
              null,
              "ƒ_reduce_1",
              null,
              null
            ],
            "view": {
              "row": 1,
              "col": 2
            },
            "summary": "push each item to respective array in the object"
          },
          {
            "id": 8,
            "type": "assign",
            "from": {
              "location": "method",
              "name": 1,
              "ptr": "/return"
            },
            "to": {
              "location": "outgoing",
              "name": "output",
              "ptr": ""
            }
          }
        ],
        "functions": [
          {
            "incoming": [
              {
                "$id": "array",
                "type": "array",
                "items": {
                  "type": [
                    "array",
                    "boolean",
                    "number",
                    "integer",
                    "string",
                    "object",
                    "null"
                  ]
                }
              },
              {
                "$id": "groupByProperty",
                "type": "string",
                "examples": [
                  "name"
                ]
              }
            ],
            "outgoing": [
              {
                "$id": "headers",
                "type": "object",
                "properties": {},
                "required": []
              }
            ],
            "functions": [
              {
                "incoming": [
                  {
                    "type": [
                      "array",
                      "boolean",
                      "number",
                      "integer",
                      "string",
                      "object",
                      "null"
                    ],
                    "$id": "accumulator"
                  },
                  {
                    "type": [
                      "array",
                      "boolean",
                      "number",
                      "integer",
                      "string",
                      "object",
                      "null"
                    ],
                    "$id": "currentValue"
                  },
                  {
                    "title": "index",
                    "type": "number",
                    "$id": "index"
                  },
                  {
                    "$id": "array",
                    "type": "array",
                    "items": {
                      "type": [
                        "array",
                        "boolean",
                        "number",
                        "integer",
                        "string",
                        "object",
                        "null"
                      ]
                    }
                  },
                  {
                    "$id": "thisArg",
                    "type": "object",
                    "properties": {
                      "groupByProperty": {
                        "$id": "groupByProperty",
                        "type": "string",
                        "examples": [
                          "name"
                        ]
                      }
                    },
                    "isContext": true
                  }
                ],
                "outgoing": [
                  {
                    "title": "accumulator",
                    "type": [
                      "array",
                      "boolean",
                      "number",
                      "integer",
                      "string",
                      "object",
                      "null"
                    ],
                    "$id": "accumulator"
                  }
                ],
                "functions": [],
                "name": "reducer",
                "steps": [
                  {
                    "id": 2,
                    "type": "declaration",
                    "library": "Array",
                    "method": "new Array",
                    "args": [],
                    "view": {
                      "row": 2,
                      "col": 1
                    },
                    "polymorphIndex": 0,
                    "summary": "set empty array for every property"
                  },
                  {
                    "id": 5,
                    "type": "assign",
                    "from": {
                      "location": "incoming",
                      "name": "currentValue",
                      "ptr": ""
                    },
                    "to": {
                      "location": "method",
                      "name": 4,
                      "ptr": "/args/0/value"
                    }
                  },
                  {
                    "id": 6,
                    "type": "assign",
                    "from": {
                      "location": "incoming",
                      "name": "thisArg",
                      "ptr": "/groupByProperty"
                    },
                    "to": {
                      "location": "method",
                      "name": 4,
                      "ptr": "/args/1/value"
                    }
                  },
                  {
                    "id": 8,
                    "type": "assign",
                    "from": {
                      "location": "incoming",
                      "name": "accumulator",
                      "ptr": ""
                    },
                    "to": {
                      "location": "method",
                      "name": 1,
                      "ptr": "/args/0/value"
                    }
                  },
                  {
                    "id": 3,
                    "type": "assign",
                    "from": {
                      "location": "declaration",
                      "name": 2,
                      "ptr": "/return"
                    },
                    "to": {
                      "location": "method",
                      "name": 1,
                      "ptr": "/args/2/value"
                    }
                  },
                  {
                    "id": 4,
                    "type": "method",
                    "library": "Object",
                    "method": "getProperty",
                    "args": [
                      null,
                      null
                    ],
                    "view": {
                      "row": 3,
                      "col": 1
                    },
                    "summary": "find all variations of the property"
                  },
                  {
                    "id": 7,
                    "type": "assign",
                    "from": {
                      "location": "method",
                      "name": 4,
                      "ptr": "/return"
                    },
                    "to": {
                      "location": "method",
                      "name": 1,
                      "ptr": "/args/1/value"
                    }
                  },
                  {
                    "id": 1,
                    "type": "method",
                    "library": "Object",
                    "method": "setProperty",
                    "args": [
                      null,
                      null,
                      null
                    ],
                    "view": {
                      "row": 1,
                      "col": 2
                    },
                    "summary": "add the key value pair to the accumulator"
                  },
                  {
                    "id": 9,
                    "type": "assign",
                    "from": {
                      "location": "method",
                      "name": 1,
                      "ptr": "/return"
                    },
                    "to": {
                      "location": "outgoing",
                      "name": "accumulator",
                      "ptr": ""
                    }
                  }
                ],
                "view": {
                  "col": 2,
                  "row": 5
                },
                "id": "ƒ_reduce_1"
              }
            ],
            "name": "getHeaders",
            "steps": [
              {
                "id": 2,
                "type": "declaration",
                "library": "Object",
                "method": "new Object",
                "args": [
                  "{}"
                ],
                "view": {
                  "row": 2,
                  "col": 1
                },
                "summary": "initialize accumulator"
              },
              {
                "id": 4,
                "type": "assign",
                "from": {
                  "location": "incoming",
                  "name": "groupByProperty",
                  "ptr": ""
                },
                "to": {
                  "location": "method",
                  "name": 1,
                  "ptr": "/args/3/value"
                }
              },
              {
                "id": 5,
                "type": "assign",
                "from": {
                  "location": "incoming",
                  "name": "array",
                  "ptr": ""
                },
                "to": {
                  "location": "method",
                  "name": 1,
                  "ptr": "/args/0/value"
                }
              },
              {
                "id": 3,
                "type": "assign",
                "from": {
                  "location": "declaration",
                  "name": 2,
                  "ptr": "/return"
                },
                "to": {
                  "location": "method",
                  "name": 1,
                  "ptr": "/args/2/value"
                }
              },
              {
                "id": 1,
                "type": "method",
                "library": "Array",
                "method": "reduce",
                "args": [
                  null,
                  "ƒ_reduce_1",
                  null,
                  null
                ],
                "view": {
                  "row": 1,
                  "col": 2
                },
                "summary": "make the object"
              },
              {
                "id": 6,
                "type": "assign",
                "from": {
                  "location": "method",
                  "name": 1,
                  "ptr": "/return"
                },
                "to": {
                  "location": "outgoing",
                  "name": "headers",
                  "ptr": ""
                }
              }
            ],
            "view": {
              "col": 2,
              "row": 5
            },
            "id": "getHeaders.jst"
          },
          {
            "incoming": [
              {
                "type": [
                  "array",
                  "boolean",
                  "number",
                  "integer",
                  "string",
                  "object",
                  "null"
                ],
                "$id": "accumulator"
              },
              {
                "type": "object",
                "$id": "currentValue"
              },
              {
                "title": "index",
                "type": "number",
                "$id": "index"
              },
              {
                "$id": "array",
                "type": "array",
                "items": {
                  "type": "object"
                }
              },
              {
                "$id": "thisArg",
                "type": "object",
                "properties": {
                  "groupByProperty": {
                    "$id": "groupByProperty",
                    "type": "string",
                    "examples": [
                      "name"
                    ]
                  }
                },
                "isContext": true
              }
            ],
            "outgoing": [
              {
                "title": "accumulator",
                "type": [
                  "array",
                  "boolean",
                  "number",
                  "integer",
                  "string",
                  "object",
                  "null"
                ],
                "$id": "accumulator"
              }
            ],
            "functions": [],
            "name": "setProperties",
            "steps": [
              {
                "id": 2,
                "type": "assign",
                "from": {
                  "location": "incoming",
                  "name": "accumulator",
                  "ptr": ""
                },
                "to": {
                  "location": "method",
                  "name": 1,
                  "ptr": "/args/0/value"
                }
              },
              {
                "id": 4,
                "type": "assign",
                "from": {
                  "location": "incoming",
                  "name": "currentValue",
                  "ptr": ""
                },
                "to": {
                  "location": "method",
                  "name": 3,
                  "ptr": "/args/0/value"
                }
              },
              {
                "id": 5,
                "type": "assign",
                "from": {
                  "location": "incoming",
                  "name": "thisArg",
                  "ptr": "/groupByProperty"
                },
                "to": {
                  "location": "method",
                  "name": 3,
                  "ptr": "/args/1/value"
                }
              },
              {
                "id": 9,
                "type": "assign",
                "from": {
                  "location": "incoming",
                  "name": "currentValue",
                  "ptr": ""
                },
                "to": {
                  "location": "method",
                  "name": 7,
                  "ptr": "/args/1/value"
                }
              },
              {
                "id": 11,
                "type": "assign",
                "from": {
                  "location": "incoming",
                  "name": "accumulator",
                  "ptr": ""
                },
                "to": {
                  "location": "method",
                  "name": 10,
                  "ptr": "/args/0/value"
                }
              },
              {
                "id": 3,
                "type": "method",
                "library": "Object",
                "method": "getProperty",
                "args": [
                  null,
                  null
                ],
                "view": {
                  "row": 2,
                  "col": 1
                },
                "summary": "get the property that the data is grouped on"
              },
              {
                "id": 6,
                "type": "assign",
                "from": {
                  "location": "method",
                  "name": 3,
                  "ptr": "/return"
                },
                "to": {
                  "location": "method",
                  "name": 1,
                  "ptr": "/args/1/value"
                }
              },
              {
                "id": 12,
                "type": "assign",
                "from": {
                  "location": "method",
                  "name": 3,
                  "ptr": "/return"
                },
                "to": {
                  "location": "method",
                  "name": 10,
                  "ptr": "/args/1/value"
                }
              },
              {
                "id": 1,
                "type": "method",
                "library": "Object",
                "method": "getProperty",
                "args": [
                  null,
                  null
                ],
                "view": {
                  "row": 1,
                  "col": 1
                },
                "summary": "get the array for the header"
              },
              {
                "id": 8,
                "type": "assign",
                "from": {
                  "location": "method",
                  "name": 1,
                  "ptr": "/return"
                },
                "to": {
                  "location": "method",
                  "name": 7,
                  "ptr": "/args/0/value"
                }
              },
              {
                "id": 7,
                "type": "method",
                "library": "Array",
                "method": "push",
                "args": [
                  null,
                  null
                ],
                "view": {
                  "row": 1,
                  "col": 2
                },
                "summary": "push current value to its array"
              },
              {
                "id": 13,
                "type": "assign",
                "from": {
                  "location": "method",
                  "name": 7,
                  "ptr": "/return"
                },
                "to": {
                  "location": "method",
                  "name": 10,
                  "ptr": "/args/2/value"
                }
              },
              {
                "id": 10,
                "type": "method",
                "library": "Object",
                "method": "setProperty",
                "args": [
                  null,
                  null,
                  null
                ],
                "view": {
                  "row": 1,
                  "col": 3
                },
                "summary": "send back the accumulator"
              },
              {
                "id": 14,
                "type": "assign",
                "from": {
                  "location": "method",
                  "name": 10,
                  "ptr": "/return"
                },
                "to": {
                  "location": "outgoing",
                  "name": "accumulator",
                  "ptr": ""
                }
              }
            ],
            "view": {
              "col": 3,
              "row": 4
            },
            "id": "ƒ_reduce_1"
          }
        ],
        "view": {
          "col": 2,
          "row": 4
        },
        "created": "2020-07-31T05:34:06.300Z",
        "createdBy": {
          "_id": "5f15b98282a7926d925ab7ad",
          "provenance": "Local AAA",
          "username": "admin@pronghorn"
        },
        "lastUpdated": "2020-07-31T05:34:06.300Z",
        "lastUpdatedBy": {
          "_id": "5f15b98282a7926d925ab7ad",
          "provenance": "Local AAA",
          "username": "admin@pronghorn"
        }
      }
    }
  ],
  "readme": "<!-- This is a comment in md (Markdown) format, it will not be visible to the end user -->\n## _Deprecation Notice_\nThis Pre-Built has been deprecated as of 01-15-2024 and will be end of life on 01-15-2025. The capabilities of this Pre-Built have been replaced by the [IAP - Data Manipulation](https://gitlab.com/itentialopensource/pre-built-automations/iap-data-manipulation)\n\n# Group Records By Property\n\n## Table of Contents\n\n*  [Overview](#overview)\n*  [Installation Prerequisites](#installation-prerequisites)\n*  [How to Install](#how-to-install)\n*  [How to Run](#how-to-run)\n*  [Attributes](#attributes)\n*  [Examples](#examples)\n*  [Additional Information](#additional-information)\n\n## Overview\n\nThis JST allows IAP users to pass in an array of objects and group the objects based on a common property provided by the user. The result will be an object with keys of different values for the common property in the data and the corresponding values being arrays that contain the corresponding matching records.\n\n## Installation Prerequisites\nUsers must satisfy the following prerequisites:\n* Itential Automation Platform : `^2022.1`\n\n## How to Install\n\nTo install the pre-built:\n* Verify you are running a supported version of the Itential Automation Platform (IAP) as listed above in the [Prerequisites](#installation-prerequisites) section.\n* The pre-built can be installed from within `App-Admin_Essential`. Simply search for the name of your desired pre-built and click the install button.\n\n\n## How to Run\n\nUse the following to run the pre-built:\n1. Once the JST is installed as outlined in the [How to Install](#how-to-install) section above, navigate to the section in your workflow where you would like to group an array of objects by a common property and add a  `JSON Transformation` task.\n\n2. Inside the `Transformation` task, search for and select `groupRecordsByProperty` (the name of the internal JST).\n\n3. After selecting the task, the transformation dialog will display.\n\n4. The inputs to the JST would be the array of objects and the common property based on which records have been grouped.\n\n5. Save your input and the task is ready to run inside of IAP.\n\n## Attributes  \n\nAttributes for the pre-built are outlined in the following tables.\n\n**Input**\n<table border='1' style='border-collapse:collapse'>\n<thead>\n<tr>\n<th>Attribute</th>\n<th>Description</th>\n<th>Type</th>\n</tr>\n</thead>\n<tbody>\n<tr>\n<td><code>array</code></td>\n<td>The input data array.</td>\n<td><code>array[objects]</code></td>\n</tr>\n<tr>\n<td><code>groupByProperty</code></td>\n<td>The common property in the objects based on the grouping of records.</td>\n<td><code>string</code></td>\n</tr>\n</tbody>\n</table>\n\n\n**Output**\n<table border='1' style='border-collapse:collapse'>\n<thead>\n<tr>\n<th>Attribute</th>\n<th>Description</th>\n<th>Type</th>\n</tr>\n</thead>\n<tbody>\n<tr>\n<td><code>output</code></td>\n<td>The grouped data object with keys of different values for the common property in the data, and the values being arrays of corresponding matching records.</td>\n<td><code>object</code></td>\n</tr>\n</tbody>\n</table>\n\n## Examples\nThe following examples describe how the pre-built will work for different inputs.\n\n### Example 1 \n***Input***\n```\n{\n  \"array\": [\n    {\n      \"fruit\": \"apple\",\n      \"price\": \"42.2\",\n      \"type\": \"fruit\"\n    },\n    {\n      \"fruit\": \"banana\",\n      \"price\": \"10.1\",\n      \"type\": \"fruit\"\n    },\n    {\n      \"fruit\": \"potato\",\n      \"price\": \"20\",\n      \"type\": \"vegetable\"\n    }\n  ],\n  \"groupByProperty\": \"type\"\n}\n  ```\n\n***Output***\n```\n{\n  \"fruit\": [\n    {\n      \"fruit\": \"apple\",\n      \"price\": \"42.2\",\n      \"type\": \"fruit\"\n    },\n    {\n      \"fruit\": \"banana\",\n      \"price\": \"10.1\",\n      \"type\": \"fruit\"\n    }\n  ],\n  \"vegetable\": [\n    {\n      \"fruit\": \"potato\",\n      \"price\": \"20\",\n      \"type\": \"vegetable\"\n    }\n  ]\n}\n  ```\n    \n### Example 2 \n***Input*** \n```\n{\n  \"array\": [\n    {\n      \"number\": 43,\n      \"president\": \"George W. Bush\",\n      \"took_office\": \"2001-01-20\",\n      \"left_office\": \"2009-01-20\",\n      \"party\": \"Republican\"\n    },\n    {\n      \"number\": 44,\n      \"president\": \"Barack Obama\",\n      \"took_office\": \"2009-01-20\",\n      \"left_office\": \"2017-01-20\",\n      \"party\": \"Democratic\"\n    },\n    {\n      \"number\": 45,\n      \"president\": \"Donald J. Trump\",\n      \"took_office\": \"2017-01-20\",\n      \"left_office\": null,\n      \"party\": \"Republican\"\n    }\n  ],\n  \"groupByProperty\": \"party\"\n}\n  ```\n\n***Output***\n```\n{\n  \"Republican\": [\n    {\n      \"number\": 43,\n      \"president\": \"George W. Bush\",\n      \"took_office\": \"2001-01-20\",\n      \"left_office\": \"2009-01-20\",\n      \"party\": \"Republican\"\n    },\n    {\n      \"number\": 45,\n      \"president\": \"Donald J. Trump\",\n      \"took_office\": \"2017-01-20\",\n      \"left_office\": null,\n      \"party\": \"Republican\"\n    }\n  ],\n  \"Democratic\": [\n    {\n      \"number\": 44,\n      \"president\": \"Barack Obama\",\n      \"took_office\": \"2009-01-20\",\n      \"left_office\": \"2017-01-20\",\n      \"party\": \"Democratic\"\n    }\n  ]\n}\n  ```\n  \n## Additional Information\nPlease use your Itential Customer Success account if you need support when using this Pre-Built Transformation.\n"
}