{
  "_id": "61b27a4a3c220d01ae7f125e",
  "name": "Forward Networks Intent Checks and Verification",
  "description": "",
  "componentName": "Forward Networks Intent Checks and Verification",
  "componentType": "workflows",
  "gbac": {
    "write": [],
    "read": []
  },
  "created": "2021-12-09T21:51:06.109Z",
  "createdBy": "kay.wolfe@itential.com",
  "lastUpdated": "2021-12-09T21:51:06.109Z",
  "lastUpdatedBy": "kay.wolfe@itential.com",
  "triggers": [
    {
      "_id": "61b27a4a3c220d01ae7f125f",
      "created": "2021-12-09T21:51:06.436Z",
      "createdBy": "kay.wolfe@itential.com",
      "lastUpdated": "2021-12-09T21:51:06.436Z",
      "lastUpdatedBy": "kay.wolfe@itential.com",
      "name": "Manual Trigger (migrated from Forward Networks Intent Checks and Verification)",
      "type": "manual",
      "enabled": true,
      "actionType": "automations",
      "actionId": "61b27a4a3c220d01ae7f125e",
      "formId": "Forward Networks Intent Checks and Verification",
      "formData": {},
      "migrationVersion": 1
    }
  ]
}