{
  "metadata": {
    "name": "@itentialopensource/forward-networks-create-network-collection",
    "version": "0.0.13",
    "description": "Forward Networks Network Collection Creation",
    "license": "Apache-2.0",
    "repository": {
      "type": "gitlab",
      "hostname": "gitlab.com",
      "path": "itentialopensource/pre-built-automations"
    },
    "keywords": [
      "Itential",
      "IAP",
      "artifacts"
    ],
    "author": "Itential Artifacts",
    "IAPDependencies": {
      "@itential/app-operations_manager": "",
      "@itential/app-json_forms": "",
      "@itential/app-workflow_engine": "",
      "@itentialopensource/adapter-forwardnetworks": "^0.1.0"
    },
    "gitlabId": 26361057
  },
  "manifest": {
    "bundleName": "Forward Networks Create Network Collection",
    "fingerprint": "608fdef01a214000e79149fc",
    "createdEpoch": "1620041456797",
    "artifacts": [
      {
        "id": "Forward Networks Create Network Collection",
        "name": "Forward Networks Create Network Collection",
        "type": "automation",
        "location": "/bundles/automations/Forward Networks Create Network Collection.json",
        "properties": {
          "entryPoint": false
        }
      },
      {
        "id": "Forward Networks Network Collection",
        "name": "Forward Networks Network Collection",
        "type": "workflow",
        "location": "/bundles/workflows/Forward Networks Network Collection.json",
        "properties": {
          "entryPoint": false
        }
      },
      {
        "id": "Forward Networks Take Network Collection",
        "name": "Forward Networks Take Network Collection",
        "type": "workflow",
        "location": "/bundles/workflows/Forward Networks Take Network Collection.json",
        "properties": {
          "entryPoint": false
        }
      },
      {
        "id": "Forward Networks Network Collection",
        "name": "Forward Networks Network Collection",
        "type": "json-forms",
        "location": "/bundles/json_forms/Forward Networks Network Collection.json",
        "properties": {
          "entryPoint": false
        }
      },
      {
        "id": "608fddf81fd66b018fce2410",
        "name": "networkCollection",
        "type": "transformation",
        "location": "/bundles/transformations/networkCollection.json",
        "properties": {
          "entryPoint": false
        }
      }
    ]
  },
  "bundles": [
    {
      "type": "automation",
      "data": {
        "_id": "61b3895a3c220d01ae7f1263",
        "name": "Forward Networks Create Network Collection",
        "description": "",
        "componentName": "Forward Networks Network Collection",
        "componentType": "workflows",
        "gbac": {
          "write": [],
          "read": []
        },
        "created": "2021-12-10T17:07:38.835Z",
        "createdBy": "kay.wolfe@itential.com",
        "lastUpdated": "2021-12-10T17:08:30.217Z",
        "lastUpdatedBy": "kay.wolfe@itential.com",
        "triggers": [
          {
            "_id": "61b3895b3c220d01ae7f1264",
            "created": "2021-12-10T17:07:39.187Z",
            "createdBy": "kay.wolfe@itential.com",
            "lastUpdated": "2021-12-10T17:07:39.187Z",
            "lastUpdatedBy": "kay.wolfe@itential.com",
            "name": "Manual Trigger (migrated from Forward Networks Create Network Collection)",
            "type": "manual",
            "enabled": true,
            "actionType": "automations",
            "actionId": "61b3895a3c220d01ae7f1263",
            "formId": "Forward Networks Network Collection",
            "formData": {
              "networkId": "000.000.000.000"
            },
            "migrationVersion": 1
          }
        ]
      }
    },
    {
      "type": "workflow",
      "data": {
        "name": "Forward Networks Network Collection",
        "type": "automation",
        "tasks": {
          "7675": {
            "name": "transformation",
            "canvasName": "transformation",
            "summary": "networkCollection",
            "description": "Perform a JSON Transformation using the JST library.",
            "location": "Application",
            "locationType": null,
            "app": "WorkFlowEngine",
            "type": "operation",
            "displayName": "WorkFlowEngine",
            "variables": {
              "incoming": {
                "tr_id": "608fddf81fd66b018fce2410",
                "variableMap": {
                  "formData": "$var.job.formData"
                },
                "options": {
                  "extractOutput": true,
                  "validateIncoming": false,
                  "revertToDefaultValue": true
                }
              },
              "outgoing": {
                "networkId": null
              }
            },
            "deprecated": false,
            "matched": [
              {
                "key": "description",
                "highlightString": "Perform a JSON Transformation using the <span class='highlight-string'>JST</span> library."
              }
            ],
            "groups": [],
            "x": -0.0988235294117647,
            "y": 0.5355064027939465,
            "task_name": "networkCollection"
          },
          "workflow_start": {
            "name": "workflow_start",
            "groups": [],
            "x": -0.24313725490196078,
            "y": 0.529685681024447
          },
          "workflow_end": {
            "name": "workflow_end",
            "groups": [],
            "x": 0.29333333333333333,
            "y": 0.5227008149010477
          },
          "6a20": {
            "name": "childJob",
            "canvasName": "childJob",
            "summary": "Network Snapshot",
            "description": "Take a new network snapshot",
            "location": "Application",
            "locationType": null,
            "app": "WorkFlowEngine",
            "type": "operation",
            "displayName": "WorkFlowEngine",
            "variables": {
              "incoming": {
                "task": "",
                "workflow": "Forward Networks Take Network Collection",
                "variables": {
                  "networkId": {
                    "variable": "",
                    "task": "7675",
                    "value": "networkId"
                  }
                },
                "data_array": "",
                "transformation": "",
                "loopType": ""
              },
              "outgoing": {
                "job_details": null
              }
            },
            "deprecated": false,
            "matched": [
              {
                "key": "canvasName",
                "highlightString": "<span class='highlight-string'>childJob</span>"
              }
            ],
            "groups": [],
            "actor": "job",
            "x": 0.1349019607843137,
            "y": 0.5349127182044888
          }
        },
        "transitions": {
          "7675": {
            "6a20": {
              "type": "standard",
              "state": "success"
            }
          },
          "workflow_start": {
            "7675": {
              "type": "standard",
              "state": "success"
            }
          },
          "workflow_end": {},
          "6a20": {
            "workflow_end": {
              "type": "standard",
              "state": "success"
            }
          }
        },
        "font_size": 12,
        "last_updated": "2021-05-03T11:29:18.934Z",
        "last_updated_by": {
          "provenance": "Itential-Okta",
          "username": "ankit.bhansali@itential.com",
          "firstname": "Ankit",
          "inactive": false
        },
        "lastUpdatedVersion": "5.39.8",
        "created": "2021-04-30T20:55:47.055Z",
        "created_by": {
          "provenance": "Itential-Okta",
          "username": "ankit.bhansali@itential.com",
          "firstname": "Ankit",
          "inactive": false
        },
        "createdVersion": "5.39.7",
        "inputSchema": {
          "type": "object",
          "properties": {
            "formData": {
              "$id": "formData",
              "type": "object",
              "properties": {
                "networkId": {
                  "type": "string",
                  "examples": [
                    "12313"
                  ]
                }
              },
              "required": []
            }
          },
          "required": [
            "formData"
          ]
        },
        "outputSchema": {
          "type": "object",
          "properties": {
            "formData": {
              "$id": "formData",
              "type": "object",
              "properties": {
                "networkId": {
                  "type": "string",
                  "examples": [
                    "12313"
                  ]
                }
              },
              "required": []
            },
            "_id": {
              "type": "string",
              "pattern": "^[0-9a-f]{24}$"
            },
            "initiator": {
              "type": "string"
            }
          }
        },
        "canvasVersion": 1,
        "tags": [],
        "groups": []
      }
    },
    {
      "type": "workflow",
      "data": {
        "name": "Forward Networks Take Network Collection",
        "type": "automation",
        "tasks": {
          "65": {
            "name": "listNetworkSnapshotsUsingGET",
            "canvasName": "listNetworkSnapshotsUsingGET",
            "summary": "Get Snapshots list",
            "description": "The snapshot processing is over if the latest snapshot id is the same as the snapshot id of the network collection just taken\nFor more details see the Forward APIs docs  https://fwd.app/api-doc#network-snapshots",
            "location": "Adapter",
            "locationType": "ForwardNetworks",
            "app": "ForwardNetworks",
            "type": "automatic",
            "displayName": "ForwardNetworks",
            "variables": {
              "incoming": {
                "networkId": "$var.job.networkId",
                "adapter_id": "ForwardNetworks"
              },
              "outgoing": {
                "result": null
              },
              "error": ""
            },
            "deprecated": false,
            "matched": [
              {
                "key": "canvasName",
                "highlightString": "<span class='highlight-string'>list</span>NetworkSnapshotsUsingGET"
              },
              {
                "key": "summary",
                "highlightString": "<span class='highlight-string'>List</span>s all Snapshots"
              },
              {
                "key": "description",
                "highlightString": "<span class='highlight-string'>List</span>s all Snapshots"
              }
            ],
            "groups": [],
            "actor": "Pronghorn",
            "x": 0.8332034294621979,
            "y": 0.42293464858199753,
            "scheduled": false
          },
          "923": {
            "name": "collectUsingPOST",
            "canvasName": "collectUsingPOST",
            "summary": "Triggers a network collection",
            "description": "Triggers a network collection. By default, it triggers a FULL collection. To trigger a PARTIAL collection, provide the list of devices to collect from in the request body.\nFor more details see the Forward APIs docs https://fwd.app/api-doc#network-collection",
            "location": "Adapter",
            "locationType": "ForwardNetworks",
            "app": "ForwardNetworks",
            "type": "automatic",
            "displayName": "ForwardNetworks",
            "variables": {
              "incoming": {
                "networkId": "$var.job.networkId",
                "request": "",
                "adapter_id": "ForwardNetworks"
              },
              "outgoing": {
                "result": null
              },
              "error": ""
            },
            "deprecated": false,
            "matched": [
              {
                "key": "canvasName",
                "highlightString": "<span class='highlight-string'>coll</span>ectUsingPOST"
              },
              {
                "key": "summary",
                "highlightString": "Triggers a network <span class='highlight-string'>coll</span>ection"
              },
              {
                "key": "description",
                "highlightString": "Triggers a network <span class='highlight-string'>coll</span>ection"
              }
            ],
            "groups": [],
            "actor": "Pronghorn",
            "x": 0.39145299145299145,
            "y": 0.43352601156069365,
            "scheduled": false
          },
          "4852": {
            "name": "evaluation",
            "canvasName": "evaluation",
            "summary": "Check if network collection is over",
            "description": "The network collection is over when the collector busyStatus transitions from COLLECTING to IDLE.\nIntermediate status like TESTING and COLLECTION_QUEUED are considered as well.\nFor more details see the Forward APIs docs  https://fwd.app/api-doc#network-collection",
            "location": "Application",
            "locationType": null,
            "app": "WorkFlowEngine",
            "type": "operation",
            "displayName": "WorkFlowEngine",
            "variables": {
              "incoming": {
                "all_true_flag": true,
                "evaluation_groups": [
                  {
                    "all_true_flag": false,
                    "evaluations": [
                      {
                        "query": "",
                        "operand_1": {
                          "variable": "return_data",
                          "task": "1b3a"
                        },
                        "operator": "==",
                        "operand_2": {
                          "variable": "COLLECTING",
                          "task": "static"
                        }
                      },
                      {
                        "query": "",
                        "operand_1": {
                          "variable": "return_data",
                          "task": "1b3a"
                        },
                        "operator": "==",
                        "operand_2": {
                          "variable": "TESTING",
                          "task": "static"
                        }
                      },
                      {
                        "query": "",
                        "operand_1": {
                          "variable": "return_data",
                          "task": "1b3a"
                        },
                        "operator": "==",
                        "operand_2": {
                          "variable": "COLLECTION_QUEUED",
                          "task": "static"
                        }
                      }
                    ]
                  }
                ]
              },
              "outgoing": {
                "return_value": null
              }
            },
            "deprecated": false,
            "matched": [
              {
                "key": "canvasName",
                "highlightString": "<span class='highlight-string'>eval</span>uation"
              },
              {
                "key": "summary",
                "highlightString": "Run <span class='highlight-string'>Eval</span>uation Task"
              },
              {
                "key": "description",
                "highlightString": "Run an <span class='highlight-string'>eval</span>uation"
              }
            ],
            "groups": [],
            "x": 0.7071823204419889,
            "y": -0.05765407554671968
          },
          "8781": {
            "name": "evaluation",
            "canvasName": "evaluation",
            "summary": "Check if snapshot processing is over",
            "description": "The snapshot processing is over if the latest snapshot id is the same as the snapshot id of the network collection just taken",
            "location": "Application",
            "locationType": null,
            "app": "WorkFlowEngine",
            "type": "operation",
            "displayName": "WorkFlowEngine",
            "variables": {
              "incoming": {
                "all_true_flag": true,
                "evaluation_groups": [
                  {
                    "all_true_flag": true,
                    "evaluations": [
                      {
                        "query": "",
                        "operand_1": {
                          "variable": "return_data",
                          "task": "65be"
                        },
                        "operator": "==",
                        "operand_2": {
                          "variable": "return_data",
                          "task": "fcfb"
                        }
                      }
                    ]
                  }
                ]
              },
              "outgoing": {
                "return_value": null
              }
            },
            "deprecated": false,
            "matched": [
              {
                "key": "canvasName",
                "highlightString": "<span class='highlight-string'>eval</span>uation"
              },
              {
                "key": "summary",
                "highlightString": "Run <span class='highlight-string'>Eval</span>uation Task"
              },
              {
                "key": "description",
                "highlightString": "Run an <span class='highlight-string'>eval</span>uation"
              }
            ],
            "groups": [],
            "x": 1.2067307692307692,
            "y": 0.07613636363636364
          },
          "workflow_start": {
            "name": "workflow_start",
            "groups": [],
            "x": 0.24700854700854702,
            "y": 0.43352601156069365
          },
          "workflow_end": {
            "name": "workflow_end",
            "groups": [],
            "x": 1.3165064102564104,
            "y": -0.05454545454545454
          },
          "daf7": {
            "name": "getCollectorStateUsingGET",
            "canvasName": "getCollectorStateUsingGET",
            "summary": "Gets collector status",
            "description": "Gets the status of the network’s collector.\nThe network collection is over when the collector busyStatus transitions from COLLECTING to IDLE.\nFor more details see the Forward APIs docs https://fwd.app/api-doc#network-collection",
            "location": "Adapter",
            "locationType": "ForwardNetworks",
            "app": "ForwardNetworks",
            "type": "automatic",
            "displayName": "ForwardNetworks",
            "variables": {
              "incoming": {
                "networkId": "$var.job.networkId",
                "adapter_id": "ForwardNetworks"
              },
              "outgoing": {
                "result": null
              },
              "error": ""
            },
            "deprecated": false,
            "matched": [
              {
                "key": "canvasName",
                "highlightString": "get<span class='highlight-string'>Collector</span>StateUsingGET"
              },
              {
                "key": "summary",
                "highlightString": "Gets the status of a network’s <span class='highlight-string'>collector</span>"
              },
              {
                "key": "description",
                "highlightString": "Gets the status of a network’s <span class='highlight-string'>collector</span>"
              }
            ],
            "groups": [],
            "actor": "Pronghorn",
            "x": 0.6066298342541436,
            "y": 0.4274353876739563,
            "scheduled": false
          },
          "1b3a": {
            "name": "query",
            "canvasName": "query",
            "summary": "Query Collector Status",
            "description": "Query Collector busyStatus response",
            "location": "Application",
            "locationType": null,
            "app": "WorkFlowEngine",
            "type": "operation",
            "displayName": "WorkFlowEngine",
            "variables": {
              "incoming": {
                "pass_on_null": false,
                "query": "response.busyStatus",
                "obj": "$var.daf7.result"
              },
              "outgoing": {
                "return_data": null
              },
              "error": ""
            },
            "deprecated": false,
            "matched": [
              {
                "key": "canvasName",
                "highlightString": "<span class='highlight-string'>query</span>"
              },
              {
                "key": "summary",
                "highlightString": "<span class='highlight-string'>Query</span> Data Using 'json-query' Format"
              },
              {
                "key": "description",
                "highlightString": "<span class='highlight-string'>Query</span> data using a dot/bracket notation string and a matching key/value pair."
              }
            ],
            "groups": [],
            "x": 0.5510428100987925,
            "y": -0.0625,
            "scheduled": false
          },
          "22ed": {
            "name": "delay",
            "canvasName": "delay",
            "summary": "Wait for collection",
            "description": "Wait before checking the collector status again",
            "location": "Application",
            "locationType": null,
            "app": "WorkFlowEngine",
            "type": "operation",
            "displayName": "WorkFlowEngine",
            "variables": {
              "incoming": {
                "time": 1
              },
              "outgoing": {
                "time_in_milliseconds": null
              },
              "error": ""
            },
            "deprecated": false,
            "matched": [
              {
                "key": "canvasName",
                "highlightString": "<span class='highlight-string'>delay</span>"
              },
              {
                "key": "summary",
                "highlightString": "<span class='highlight-string'>Delay</span> a Job"
              },
              {
                "key": "description",
                "highlightString": "<span class='highlight-string'>Delay</span> a Job for a duration by Job ID and number of seconds."
              }
            ],
            "groups": [],
            "x": 0.6684961580680571,
            "y": 0.16145833333333334,
            "scheduled": false
          },
          "dd99": {
            "name": "getLatestProcessedSnapshotUsingGET",
            "canvasName": "getLatestProcessedSnapshotUsingGET",
            "summary": "Get latest processed Snapshot",
            "description": "Returns the latest processed Snapshot (the most recent one that's currently prepared for path searches and new checks\nFor more details see the Forward APIs docs https://fwd.app/api-doc#network-snapshots\nTriggers processing of the latest Snapshot if it's not already underway and the network has no processed Snapshots.",
            "location": "Adapter",
            "locationType": "ForwardNetworks",
            "app": "ForwardNetworks",
            "type": "automatic",
            "displayName": "ForwardNetworks",
            "variables": {
              "incoming": {
                "networkId": "$var.job.networkId",
                "adapter_id": "ForwardNetworks"
              },
              "outgoing": {
                "result": null
              },
              "error": ""
            },
            "deprecated": false,
            "matched": [
              {
                "key": "canvasName",
                "highlightString": "get<span class='highlight-string'>LatestProcessed</span>SnapshotUsingGET"
              }
            ],
            "groups": [],
            "actor": "Pronghorn",
            "x": 1.1367521367521367,
            "y": 0.4277456647398844,
            "scheduled": false
          },
          "65be": {
            "name": "query",
            "canvasName": "query",
            "summary": "Query latest processed snapshot id",
            "description": "Query latest processed snapshot id",
            "location": "Application",
            "locationType": null,
            "app": "WorkFlowEngine",
            "type": "operation",
            "displayName": "WorkFlowEngine",
            "variables": {
              "incoming": {
                "pass_on_null": false,
                "query": "response.id",
                "obj": "$var.dd99.result"
              },
              "outgoing": {
                "return_data": "$var.job.id"
              },
              "error": ""
            },
            "deprecated": false,
            "matched": [
              {
                "key": "canvasName",
                "highlightString": "q<span class='highlight-string'>uery</span>"
              },
              {
                "key": "summary",
                "highlightString": "Q<span class='highlight-string'>uery</span> Data Using 'json-query' Format"
              },
              {
                "key": "description",
                "highlightString": "Q<span class='highlight-string'>uery</span> data using a dot/bracket notation string and a matching key/value pair."
              }
            ],
            "groups": [],
            "x": 1.047275641025641,
            "y": 0.08068181818181819,
            "scheduled": false
          },
          "24fb": {
            "name": "delay",
            "canvasName": "delay",
            "summary": "Wait for processing",
            "description": "Wait before checking the processing status again.",
            "location": "Application",
            "locationType": null,
            "app": "WorkFlowEngine",
            "type": "operation",
            "displayName": "WorkFlowEngine",
            "variables": {
              "incoming": {
                "time": 1
              },
              "outgoing": {
                "time_in_milliseconds": null
              },
              "error": ""
            },
            "deprecated": false,
            "matched": [
              {
                "key": "canvasName",
                "highlightString": "<span class='highlight-string'>delay</span>"
              },
              {
                "key": "summary",
                "highlightString": "<span class='highlight-string'>Delay</span> a Job"
              },
              {
                "key": "description",
                "highlightString": "<span class='highlight-string'>Delay</span> a Job for a duration by Job ID and number of seconds."
              }
            ],
            "groups": [],
            "x": 1.1594551282051282,
            "y": 0.19772727272727272,
            "scheduled": false
          },
          "674c": {
            "name": "evaluation",
            "canvasName": "evaluation",
            "summary": "Check if network collection is over",
            "description": "The network collection is over when the collector busyStatus transitions from COLLECTING to IDLE",
            "location": "Application",
            "locationType": null,
            "app": "WorkFlowEngine",
            "type": "operation",
            "displayName": "WorkFlowEngine",
            "variables": {
              "incoming": {
                "all_true_flag": true,
                "evaluation_groups": [
                  {
                    "all_true_flag": true,
                    "evaluations": [
                      {
                        "query": "",
                        "operand_1": {
                          "variable": "return_data",
                          "task": "1b3a"
                        },
                        "operator": "==",
                        "operand_2": {
                          "variable": "IDLE",
                          "task": "static"
                        }
                      }
                    ]
                  }
                ]
              },
              "outgoing": {
                "return_value": null
              }
            },
            "deprecated": false,
            "matched": [
              {
                "key": "canvasName",
                "highlightString": "<span class='highlight-string'>eval</span>uation"
              },
              {
                "key": "summary",
                "highlightString": "Run <span class='highlight-string'>Eval</span>uation Task"
              },
              {
                "key": "description",
                "highlightString": "Run an <span class='highlight-string'>eval</span>uation"
              }
            ],
            "groups": [],
            "x": 0.8325320512820513,
            "y": -0.06477272727272727
          },
          "fcfb": {
            "name": "query",
            "canvasName": "query",
            "summary": "Query Latest Snapshot Id",
            "description": "Query Latest Snapshot Id. It's the first in the list",
            "location": "Application",
            "locationType": null,
            "app": "WorkFlowEngine",
            "type": "operation",
            "displayName": "WorkFlowEngine",
            "variables": {
              "incoming": {
                "pass_on_null": false,
                "query": "response.snapshots[0].id",
                "obj": "$var.65.result"
              },
              "outgoing": {
                "return_data": null
              },
              "error": ""
            },
            "deprecated": false,
            "matched": [
              {
                "key": "canvasName",
                "highlightString": "<span class='highlight-string'>query</span>"
              },
              {
                "key": "summary",
                "highlightString": "<span class='highlight-string'>Query</span> Data Using 'json-query' Format"
              },
              {
                "key": "description",
                "highlightString": "<span class='highlight-string'>Query</span> data using a dot/bracket notation string and a matching key/value pair."
              }
            ],
            "groups": [],
            "x": 0.9675213675213675,
            "y": 0.42485549132947975,
            "scheduled": false
          },
          "a581": {
            "name": "ViewData",
            "canvasName": "ViewData",
            "summary": "Notify about Collector Error",
            "description": "Displays a message and runtime data to an operator. This can be used to request a decision, or used for acknowledgement only.",
            "location": "Application",
            "app": "WorkFlowEngine",
            "displayName": "Tools",
            "type": "manual",
            "variables": {
              "incoming": {
                "header": "Notify about Collector Error ",
                "message": "Send a Slack message to notify a Collector error",
                "body": "{\"channelName\":\"itential\",\"message\":\"`IAP Job Automation Status`\\n Forward Networks Collector Issue\"}",
                "variables": "",
                "btn_success": "Accept",
                "btn_failure": ""
              },
              "outgoing": {},
              "error": "",
              "decorators": []
            },
            "view": "/workflow_engine/task/ViewData",
            "deprecated": false,
            "matched": [
              {
                "key": "canvasName",
                "highlightString": "<span class='highlight-string'>ViewData</span>"
              }
            ],
            "groups": [],
            "x": 1.0580392156862746,
            "y": -0.0640279394644936,
            "scheduled": false
          }
        },
        "transitions": {
          "65": {
            "fcfb": {
              "type": "standard",
              "state": "success"
            }
          },
          "923": {
            "daf7": {
              "type": "standard",
              "state": "success"
            }
          },
          "4852": {
            "22ed": {
              "type": "standard",
              "state": "success"
            },
            "674c": {
              "type": "standard",
              "state": "failure"
            }
          },
          "8781": {
            "workflow_end": {
              "type": "standard",
              "state": "success"
            },
            "24fb": {
              "type": "standard",
              "state": "failure"
            }
          },
          "workflow_start": {
            "923": {
              "type": "standard",
              "state": "success"
            }
          },
          "workflow_end": {},
          "979e": {},
          "b86": {},
          "daf7": {
            "1b3a": {
              "type": "standard",
              "state": "success"
            }
          },
          "1b3a": {
            "4852": {
              "type": "standard",
              "state": "success"
            }
          },
          "22ed": {
            "daf7": {
              "type": "revert",
              "state": "success"
            }
          },
          "dd99": {
            "65be": {
              "type": "standard",
              "state": "success"
            }
          },
          "65be": {
            "8781": {
              "type": "standard",
              "state": "success"
            }
          },
          "50d9": {},
          "24fb": {
            "dd99": {
              "type": "revert",
              "state": "success"
            }
          },
          "674c": {
            "65": {
              "type": "standard",
              "state": "success"
            },
            "a581": {
              "type": "standard",
              "state": "failure"
            }
          },
          "7d95": {},
          "fcfb": {
            "dd99": {
              "type": "standard",
              "state": "success"
            }
          },
          "6c8d": {},
          "a581": {
            "workflow_end": {
              "type": "standard",
              "state": "success"
            }
          }
        },
        "font_size": 12,
        "last_updated": "2021-05-03T19:25:18.662Z",
        "last_updated_by": {
          "provenance": "Itential-Okta",
          "username": "ankit.bhansali@itential.com",
          "firstname": "Ankit",
          "inactive": false
        },
        "lastUpdatedVersion": "5.39.8",
        "created": "2021-01-27T21:54:55.618Z",
        "created_by": {
          "provenance": "Local AAA",
          "username": "Fabrizio.Maccioni",
          "firstname": null,
          "inactive": true,
          "email": "fabriziomaccioni@forwardnwetworks.com"
        },
        "createdVersion": "5.10.4-2020.1.34.0",
        "inputSchema": {
          "type": "object",
          "properties": {
            "networkId": {
              "type": [
                "array",
                "boolean",
                "null",
                "number",
                "object",
                "string"
              ]
            }
          },
          "required": [
            "networkId"
          ]
        },
        "outputSchema": {
          "type": "object",
          "properties": {
            "networkId": {
              "type": [
                "array",
                "boolean",
                "null",
                "number",
                "object",
                "string"
              ]
            },
            "_id": {
              "type": "string",
              "pattern": "^[0-9a-f]{24}$"
            },
            "initiator": {
              "type": "string"
            },
            "id": {
              "type": [
                "string",
                "number",
                "object",
                "integer",
                "array",
                "boolean",
                "null"
              ],
              "examples": [
                "value"
              ]
            }
          }
        },
        "canvasVersion": 1,
        "tags": [],
        "groups": []
      }
    },
    {
      "type": "json-forms",
      "data": {
        "id": "608fde301fb9d4018118408f",
        "created": "2021-05-03T11:27:44.785Z",
        "createdBy": "ankit.bhansali@itential.com",
        "lastUpdated": "2021-05-03T11:28:06.846Z",
        "lastUpdatedBy": "ankit.bhansali@itential.com",
        "name": "Forward Networks Network Collection",
        "description": null,
        "struct": {
          "nodeId": "7db03081-1c39-4e14-b1c0-3fd4a62e633d",
          "type": "array",
          "items": [
            {
              "nodeId": "e74c0e45-9dd0-4b07-8710-8c806a1414eb",
              "type": "string",
              "title": "Network ID",
              "description": "",
              "placeholder": "Enter network id from the forward network's application",
              "required": true
            }
          ]
        },
        "schema": {
          "title": "Network Collection",
          "description": "",
          "type": "object",
          "required": [
            "networkId"
          ],
          "properties": {
            "networkId": {
              "type": "string",
              "title": "Network ID",
              "description": ""
            }
          }
        },
        "uiSchema": {
          "networkId": {
            "ui:placeholder": "Enter network id from the forward network's application"
          }
        },
        "bindingSchema": {},
        "validationSchema": {},
        "version": "2020.1"
      }
    },
    {
      "type": "transformation",
      "data": {
        "_id": "608fddf81fd66b018fce2410",
        "name": "networkCollection",
        "description": "",
        "incoming": [
          {
            "$id": "formData",
            "type": "object",
            "properties": {
              "networkId": {
                "type": "string",
                "examples": [
                  "12313"
                ]
              }
            },
            "required": []
          }
        ],
        "outgoing": [
          {
            "$id": "networkId",
            "type": "string",
            "examples": [
              "12313"
            ]
          }
        ],
        "steps": [
          {
            "id": 1,
            "type": "assign",
            "from": {
              "location": "incoming",
              "name": "formData",
              "ptr": "/networkId"
            },
            "to": {
              "location": "outgoing",
              "name": "networkId",
              "ptr": ""
            }
          }
        ],
        "functions": [],
        "comments": [],
        "view": {
          "col": 3,
          "row": 5
        },
        "created": "2021-05-03T11:26:48.525Z",
        "createdBy": {
          "_id": "608c3cb631d4a7506b46004d",
          "provenance": "Itential-Okta",
          "username": "ankit.bhansali@itential.com"
        },
        "lastUpdated": "2021-05-03T11:27:25.371Z",
        "lastUpdatedBy": {
          "_id": "608c3cb631d4a7506b46004d",
          "provenance": "Itential-Okta",
          "username": "ankit.bhansali@itential.com"
        },
        "version": ""
      }
    }
  ],
  "readme": "<!-- This is a comment in md (Markdown) format, it will not be visible to the end user -->\n\n<!-- Update the below line with your Pre-Built name -->\n# Forward Networks Create Network Collection\n\n## Table of Contents\n\n* [Overview](#overview)\n  * [Operations Manager and JSON-Form](#operations-manager-and-json-form)\n* [Requirements](#requirements)\n* [How to Install](#how-to-install)\n* [How to Run](#how-to-run)\n  * [Input Variables](#input-variables)\n* [Additional Information](#additional-information)\n\n## Overview\n\nThe Forward Networks Create Network Collection pre-built can be used to do service verfication before a deployment. The pre-built consists of transformations and childjobs that makes the pre-built modular in design and generic to verify any type of service using [Forward Enterprise](https://forwardnetworks.com).\n\nThe main parent flow which is shown in the overview contains functionality for:\n1. Forward Networks Create Network Collection\n2. JST : JSON Schema Transformation\n<table><tr><td>\n  <img src=\"https://gitlab.com/itentialopensource/pre-built-automations/forward-networks-create-network-collection/-/raw/master/images/forward_networks_create_network_collection_autocatalog.png\" alt=\"workflow\" width=\"800px\">\n</td></tr></table>\n<table><tr><td>\n  <img src=\"https://gitlab.com/itentialopensource/pre-built-automations/forward-networks-create-network-collection/-/raw/master/images/forward_networks_create_network_collection_automation.png\" alt=\"workflow\" width=\"800px\">\n</td></tr></table>\n\n_Estimated Run Time_: 1min\n\n## Installation Prerequisites\n\nUsers must satisfy the following pre-requisites:\n\n* Itential Automation Platform\n  * `^2021.2`\n  * [Forward Networks Adapter](https://gitlab.com/itentialopensource/adapters/telemetry-analytics/adapter-forwardnetworks)\n\n## Requirements\n\nThis Pre-Built requires the following:\n\n* [Forward Networks Adapter](https://gitlab.com/itentialopensource/adapters/telemetry-analytics/adapter-forwardnetworks) configured with a Forward Enterprise instance.\n\n## How to Install\n\nTo install the Pre-Built:\n\n* Verify you are running a supported version of the Itential Automation Platform (IAP) as listed above in the [Requirements](#requirements) section in order to install the Pre-Built. \n* The Pre-Built can be installed from within App-Admin_Essential. Simply search for the name of your desired Pre-Built and click the install button (as shown below).\n\n\n## How to Run\n\nUse the following to run the Pre-Built:\n\n* Run the Operations Manager item `Forward Networks Create Network Collection` or call [Forward Networks Create Network Collection](https://gitlab.com/itentialopensource/pre-built-automations/forward-networks-create-network-collection/-/raw/master/bundles/workflows/Forward%20Networks%20Create%20FNetwork%20Collection.json) from your workflow as a child job.\n\n### Input Variables\n_Example_\n\n```json\n{\n  \"networkId\": \"Unique Identifier Associated with Network within Forward Enterprise\"\n}\n```\n"
}