{
  "id": "6033f67402544f25308283f1",
  "created": "2021-02-22T18:22:44.047Z",
  "createdBy": "abhansali",
  "lastUpdated": "2021-02-22T18:29:31.883Z",
  "lastUpdatedBy": "abhansali",
  "name": "F5 VIP Creation",
  "description": null,
  "struct": {
    "type": "object",
    "description": "",
    "items": [
      {
        "nodeId": "d46a15f7-d34a-421d-b7cf-ab371795ace0",
        "type": "string",
        "title": "Device",
        "description": "",
        "placeholder": "",
        "required": true,
        "enum": [],
        "binding": true,
        "rel": "collection",
        "targetPointer": "/enum",
        "method": "POST",
        "base": "/",
        "href": "configuration_manager/devices",
        "body": {
          "options": {
            "filter": {
              "name": ""
            },
            "start": 0,
            "limit": 1000,
            "sort": [
              {
                "name": 1
              }
            ],
            "order": "ascending"
          }
        },
        "sourcePointer": "/list",
        "sourceKeyPointer": "/name"
      },
      {
        "nodeId": "5ca08e92-5070-460b-80c4-5d0d9a88e692",
        "type": "string",
        "title": "Name",
        "description": "Name of the vip",
        "placeholder": "",
        "required": true
      },
      {
        "nodeId": "1f192d7a-bb5a-4371-9137-039d3b343129",
        "type": "string",
        "title": "Pool Name",
        "description": "",
        "placeholder": "Enter PoolName",
        "required": true
      },
      {
        "nodeId": "949b508c-3b2d-4fac-96a1-1036eec9f7af",
        "type": "string",
        "title": "Destination",
        "description": "Enter destination",
        "placeholder": "",
        "required": true
      },
      {
        "nodeId": "4112b94e-c985-4a45-bdb4-8d836573cbb4",
        "type": "string",
        "title": "Port",
        "description": "Enter Port",
        "placeholder": "",
        "required": true
      },
      {
        "nodeId": "7810fdc9-1358-4e24-af29-87923eafd5f5",
        "type": "string",
        "title": "State",
        "description": "When C(present), guarantees that the pool exists with the provided attributes. When C(absent), removes the pool from the system.",
        "placeholder": "",
        "required": false,
        "enum": [
          {
            "id": "ca3465e1-f621-4225-8cfb-fb0754d36d59",
            "value": "present"
          },
          {
            "id": "c09883d0-e2fc-4a6d-a589-db911cc4887d",
            "value": "absent"
          }
        ],
        "binding": false,
        "rel": "collection",
        "targetPointer": "/enum"
      }
    ]
  },
  "schema": {
    "title": "F5 VIP Creation",
    "description": "",
    "type": "object",
    "required": [
      "device",
      "name",
      "poolName",
      "destination",
      "port"
    ],
    "properties": {
      "device": {
        "type": "string",
        "title": "Device",
        "description": "",
        "enum": []
      },
      "name": {
        "type": "string",
        "title": "Name",
        "description": "Name of the vip"
      },
      "poolName": {
        "type": "string",
        "title": "Pool Name",
        "description": ""
      },
      "destination": {
        "type": "string",
        "title": "Destination",
        "description": "Enter destination"
      },
      "port": {
        "type": "string",
        "title": "Port",
        "description": "Enter Port"
      },
      "state": {
        "type": "string",
        "title": "State",
        "description": "When C(present), guarantees that the pool exists with the provided attributes. When C(absent), removes the pool from the system.",
        "enum": [
          "present",
          "absent"
        ]
      }
    }
  },
  "uiSchema": {
    "poolName": {
      "ui:placeholder": "Enter PoolName"
    }
  },
  "bindingSchema": {
    "properties": {
      "device": {
        "binding:method": "POST",
        "binding:link": {
          "$ref": "/links",
          "rel": "collection"
        },
        "binding:body": {
          "options": {
            "filter": {
              "name": ""
            },
            "start": 0,
            "limit": 1000,
            "sort": [
              {
                "name": 1
              }
            ],
            "order": "ascending"
          }
        },
        "binding:source": {
          "propertyPointer": "/list",
          "keyPointer": "/name"
        },
        "binding:target": {
          "propertyPointer": "/enum"
        },
        "binding:hyperSchema": {
          "type": "object",
          "base": "/",
          "links": [
            {
              "rel": "collection",
              "href": "configuration_manager/devices",
              "targetMediaType": "application/json",
              "targetSchema": {
                "$ref": "#"
              }
            }
          ]
        }
      }
    }
  },
  "validationSchema": {},
  "version": "2020.1"
}