{
  "name": "F5 VIP Management",
  "tasks": {
    "1688": {
      "name": "newVariable",
      "canvasName": "newVariable",
      "summary": "Create a Job Variable",
      "description": "Create a new Job variable by Job ID and assign it a value.",
      "location": "Application",
      "locationType": null,
      "app": "WorkFlowEngine",
      "type": "operation",
      "displayName": "WorkFlowEngine",
      "variables": {
        "incoming": {
          "name": "automationStatus",
          "value": "$var.ff3b.automationStatus"
        },
        "outgoing": {
          "value": null
        }
      },
      "deprecated": false,
      "matched": [
        {
          "key": "canvasName",
          "highlightString": "<span class='highlight-string'>newVar</span>iable"
        }
      ],
      "groups": [],
      "x": 0.011444921316165951,
      "y": 0.39641943734015345
    },
    "4987": {
      "name": "transformation",
      "canvasName": "transformation",
      "summary": "JSON Transformation",
      "description": "Perform a JSON Transformation using the JST library.",
      "location": "Application",
      "locationType": null,
      "app": "WorkFlowEngine",
      "type": "operation",
      "displayName": "WorkFlowEngine",
      "variables": {
        "incoming": {
          "tr_id": "5ff35e589bc9347a490356a7",
          "variableMap": {
            "status": "success",
            "taskData": "$var.f50b.stdout"
          },
          "options": {
            "extractOutput": true
          }
        },
        "outgoing": {
          "automationStatus": null
        }
      },
      "deprecated": false,
      "matched": [
        {
          "key": "description",
          "highlightString": "Perform a JSON Transformation using the <span class='highlight-string'>JST</span> library."
        }
      ],
      "groups": [],
      "x": -0.06294706723891273,
      "y": 0.6828644501278772
    },
    "workflow_start": {
      "name": "workflow_start",
      "groups": [],
      "x": -0.39869281045751637,
      "y": 0.6683937823834197
    },
    "workflow_end": {
      "name": "workflow_end",
      "groups": [],
      "x": 0.0944206008583691,
      "y": 0.6892583120204604
    },
    "458e": {
      "name": "transformation",
      "canvasName": "transformation",
      "summary": "JSON Transformation",
      "description": "Perform a JSON Transformation using the JST library.",
      "location": "Application",
      "locationType": null,
      "app": "WorkFlowEngine",
      "type": "operation",
      "displayName": "WorkFlowEngine",
      "variables": {
        "incoming": {
          "tr_id": "5fe9f91c9bc9347a490356a2",
          "variableMap": {
            "formData": "$var.job.formData"
          },
          "options": {
            "extractOutput": false
          }
        },
        "outgoing": {
          "device": null,
          "name": null,
          "destination": null,
          "poolName": null,
          "state": null,
          "port": null
        }
      },
      "deprecated": false,
      "matched": [
        {
          "key": "description",
          "highlightString": "Perform a JSON Transformation using the <span class='highlight-string'>JST</span> library."
        }
      ],
      "groups": [],
      "x": -0.3354792560801145,
      "y": 0.6675191815856778
    },
    "18c8": {
      "name": "evaluation",
      "canvasName": "evaluation",
      "summary": "Run Evaluation Task",
      "description": "Run an evaluation",
      "location": "Application",
      "locationType": null,
      "app": "WorkFlowEngine",
      "type": "operation",
      "displayName": "WorkFlowEngine",
      "variables": {
        "incoming": {
          "all_true_flag": true,
          "evaluation_groups": [
            {
              "all_true_flag": true,
              "evaluations": [
                {
                  "query": ".completed[0].icode",
                  "operand_1": {
                    "variable": "stdout",
                    "task": "bd42"
                  },
                  "operator": "==",
                  "operand_2": {
                    "variable": "AD.200",
                    "task": "static"
                  }
                },
                {
                  "query": ".completed[0].response.status[0]",
                  "operand_1": {
                    "variable": "stdout",
                    "task": "bd42"
                  },
                  "operator": "==",
                  "operand_2": {
                    "variable": "SUCCESS",
                    "task": "static"
                  }
                }
              ]
            }
          ]
        },
        "outgoing": {
          "return_value": null
        }
      },
      "deprecated": false,
      "matched": [
        {
          "key": "canvasName",
          "highlightString": "<span class='highlight-string'>eval</span>uation"
        },
        {
          "key": "summary",
          "highlightString": "Run <span class='highlight-string'>Eval</span>uation Task"
        },
        {
          "key": "description",
          "highlightString": "Run an <span class='highlight-string'>eval</span>uation"
        }
      ],
      "groups": [],
      "x": -0.12160228898426323,
      "y": 0.6739130434782609
    },
    "7cb3": {
      "name": "newVariable",
      "canvasName": "newVariable",
      "summary": "Create a Job Variable",
      "description": "Create a new Job variable by Job ID and assign it a value.",
      "location": "Application",
      "locationType": null,
      "app": "WorkFlowEngine",
      "type": "operation",
      "displayName": "WorkFlowEngine",
      "variables": {
        "incoming": {
          "name": "errorMessage",
          "value": "$var.bd42.stdout"
        },
        "outgoing": {
          "value": null
        }
      },
      "deprecated": false,
      "matched": [
        {
          "key": "canvasName",
          "highlightString": "<span class='highlight-string'>newVa</span>riable"
        }
      ],
      "groups": [],
      "x": -0.11874105865522175,
      "y": 0.5421994884910486
    },
    "ff3b": {
      "name": "transformation",
      "canvasName": "transformation",
      "summary": "JSON Transformation",
      "description": "Perform a JSON Transformation using the JST library.",
      "location": "Application",
      "locationType": null,
      "app": "WorkFlowEngine",
      "type": "operation",
      "displayName": "WorkFlowEngine",
      "variables": {
        "incoming": {
          "tr_id": "5ff35e589bc9347a490356a7",
          "variableMap": {
            "status": "error",
            "taskData": "$var.job.errorMessage"
          },
          "options": {
            "extractOutput": true
          }
        },
        "outgoing": {
          "automationStatus": null
        }
      },
      "deprecated": false,
      "matched": [
        {
          "key": "description",
          "highlightString": "Perform a JSON Transformation using the <span class='highlight-string'>JST</span> library."
        }
      ],
      "groups": [],
      "x": -0.12446351931330472,
      "y": 0.3900255754475703
    },
    "cb09": {
      "name": "newVariable",
      "canvasName": "newVariable",
      "summary": "Create a Job Variable",
      "description": "Create a new Job variable by Job ID and assign it a value.",
      "location": "Application",
      "locationType": null,
      "app": "WorkFlowEngine",
      "type": "operation",
      "displayName": "WorkFlowEngine",
      "variables": {
        "incoming": {
          "name": "automationStatus",
          "value": "$var.4987.automationStatus"
        },
        "outgoing": {
          "value": null
        }
      },
      "deprecated": false,
      "matched": [
        {
          "key": "canvasName",
          "highlightString": "<span class='highlight-string'>newVar</span>iable"
        }
      ],
      "groups": [],
      "x": 0.017167381974248927,
      "y": 0.6828644501278772
    },
    "bd42": {
      "name": "bigip_virtual_server",
      "canvasName": "bigip_virtual_server",
      "summary": "Ansible Module bigip_virtual_server",
      "description": "Manage LTM virtual servers on a BIG-IP",
      "location": "Application",
      "locationType": null,
      "app": "AGManager",
      "type": "automatic",
      "displayName": "AG Manager",
      "variables": {
        "incoming": {
          "_hosts": "$var.458e.device",
          "_groups": "",
          "state": "present",
          "type": "standard",
          "name": "$var.458e.name",
          "destination": "$var.458e.destination",
          "source": "",
          "port": "$var.458e.port",
          "profiles": "",
          "irules": "",
          "enabled_vlans": "",
          "disabled_vlans": "",
          "pool": "$var.458e.poolName",
          "policies": "",
          "snat": "",
          "default_persistence_profile": "",
          "description": "",
          "fallback_persistence_profile": "",
          "partition": "Common",
          "metadata": "",
          "insert_metadata": true,
          "address_translation": "",
          "port_translation": "",
          "source_port": "preserve",
          "mirror": "",
          "mask": "",
          "ip_protocol": "ah",
          "firewall_enforced_policy": "",
          "firewall_staged_policy": "",
          "security_log_profiles": "",
          "security_nat_policy": "",
          "ip_intelligence_policy": "",
          "rate_limit": "",
          "rate_limit_dst_mask": "",
          "rate_limit_src_mask": "",
          "rate_limit_mode": "object",
          "clone_pools": "",
          "provider": ""
        },
        "outgoing": {
          "stdout": null
        },
        "error": "",
        "decorators": []
      },
      "deprecated": false,
      "matched": [
        {
          "key": "canvasName",
          "highlightString": "<span class='highlight-string'>bigip_virtual</span>_server"
        },
        {
          "key": "summary",
          "highlightString": "Ansible Module <span class='highlight-string'>bigip_virtual</span>_server"
        }
      ],
      "groups": [],
      "actor": "Pronghorn",
      "x": -0.21977484092021538,
      "y": 0.6595238095238095,
      "scheduled": false
    }
  },
  "transitions": {
    "1688": {
      "workflow_end": {
        "type": "standard",
        "state": "success"
      }
    },
    "4971": {},
    "4987": {
      "cb09": {
        "type": "standard",
        "state": "success"
      }
    },
    "workflow_start": {
      "458e": {
        "type": "standard",
        "state": "success"
      }
    },
    "workflow_end": {},
    "d30a": {},
    "458e": {
      "bd42": {
        "type": "standard",
        "state": "success"
      }
    },
    "18c8": {
      "4987": {
        "type": "standard",
        "state": "success"
      },
      "7cb3": {
        "type": "standard",
        "state": "failure"
      }
    },
    "7cb3": {
      "ff3b": {
        "type": "standard",
        "state": "success"
      }
    },
    "ff3b": {
      "1688": {
        "type": "standard",
        "state": "success"
      }
    },
    "cb09": {
      "workflow_end": {
        "type": "standard",
        "state": "success"
      }
    },
    "bd42": {
      "18c8": {
        "type": "standard",
        "state": "success"
      },
      "ff3b": {
        "type": "standard",
        "state": "error"
      }
    }
  },
  "font_size": 12,
  "created": "2021-02-22T16:58:18.910Z",
  "created_by": {
    "provenance": "LDAP Server",
    "username": "abhansali",
    "firstname": "Ankit",
    "inactive": true
  },
  "createdVersion": "5.10.4-2020.1.22.0",
  "last_updated": "2021-07-09T21:10:22.408Z",
  "last_updated_by": {
    "provenance": "aaa",
    "username": "chase.lee@itential.com",
    "firstname": "Chase",
    "inactive": false,
    "email": ""
  },
  "lastUpdatedVersion": "5.40.5-2021.1.8.0",
  "type": "automation",
  "description": null,
  "inputSchema": {
    "type": "object",
    "properties": {
      "formData": {
        "$id": "formData",
        "type": "object",
        "properties": {
          "device": {
            "type": "string",
            "examples": [
              "CE-BER-0"
            ]
          },
          "name": {
            "type": "string",
            "examples": [
              "AAA"
            ]
          },
          "destination": {
            "type": "string",
            "examples": [
              "AAA"
            ]
          },
          "poolName": {
            "type": "string",
            "examples": [
              "AAA"
            ]
          },
          "state": {
            "type": "string",
            "examples": [
              "present"
            ]
          },
          "port": {
            "type": "string",
            "examples": [
              "2222"
            ]
          }
        },
        "required": []
      }
    },
    "required": [
      "formData"
    ]
  },
  "outputSchema": {
    "type": "object",
    "properties": {
      "formData": {
        "$id": "formData",
        "type": "object",
        "properties": {
          "device": {
            "type": "string",
            "examples": [
              "CE-BER-0"
            ]
          },
          "name": {
            "type": "string",
            "examples": [
              "AAA"
            ]
          },
          "destination": {
            "type": "string",
            "examples": [
              "AAA"
            ]
          },
          "poolName": {
            "type": "string",
            "examples": [
              "AAA"
            ]
          },
          "state": {
            "type": "string",
            "examples": [
              "present"
            ]
          },
          "port": {
            "type": "string",
            "examples": [
              "2222"
            ]
          }
        },
        "required": []
      },
      "_id": {
        "type": "string",
        "pattern": "^[0-9a-f]{24}$"
      },
      "initiator": {
        "type": "string"
      },
      "automationStatus": {
        "type": [
          "array",
          "boolean",
          "null",
          "number",
          "object",
          "string"
        ]
      },
      "errorMessage": {
        "type": [
          "array",
          "boolean",
          "null",
          "number",
          "object",
          "string"
        ]
      }
    }
  },
  "tags": [],
  "groups": []
}
