{
  "_id": "5fe9df5e255fc96a1dd6c4de",
  "name": "f5PoolCreation",
  "description": "",
  "incoming": [
    {
      "$id": "formData",
      "type": "object",
      "properties": {
        "device": {
          "type": "string",
          "examples": [
            "F5-ATL"
          ]
        },
        "name": {
          "type": "string",
          "examples": [
            "itential_se_demo_pool"
          ]
        },
        "description": {
          "type": "string",
          "examples": [
            "Creating a new pool"
          ]
        },
        "loadBalancerMethodType": {
          "type": "string",
          "examples": [
            "round-robin"
          ]
        },
        "state": {
          "type": "string",
          "examples": [
            "present"
          ]
        }
      },
      "required": []
    }
  ],
  "outgoing": [
    {
      "$id": "device",
      "type": "string",
      "examples": [
        "device"
      ]
    },
    {
      "$id": "description",
      "type": "string",
      "examples": [
        "description"
      ]
    },
    {
      "$id": "poolName",
      "type": "string",
      "examples": [
        "poolName"
      ]
    },
    {
      "$id": "state",
      "type": "string",
      "examples": [
        "state"
      ]
    },
    {
      "$id": "lbMethodType",
      "type": "string",
      "examples": [
        "lbMethodType"
      ]
    }
  ],
  "steps": [
    {
      "id": 1,
      "type": "assign",
      "from": {
        "location": "incoming",
        "name": "formData",
        "ptr": "/device"
      },
      "to": {
        "location": "outgoing",
        "name": "device",
        "ptr": ""
      }
    },
    {
      "id": 2,
      "type": "assign",
      "from": {
        "location": "incoming",
        "name": "formData",
        "ptr": "/name"
      },
      "to": {
        "location": "outgoing",
        "name": "poolName",
        "ptr": ""
      }
    },
    {
      "id": 3,
      "type": "assign",
      "from": {
        "location": "incoming",
        "name": "formData",
        "ptr": "/description"
      },
      "to": {
        "location": "outgoing",
        "name": "description",
        "ptr": ""
      }
    },
    {
      "id": 4,
      "type": "assign",
      "from": {
        "location": "incoming",
        "name": "formData",
        "ptr": "/loadBalancerMethodType"
      },
      "to": {
        "location": "outgoing",
        "name": "lbMethodType",
        "ptr": ""
      }
    },
    {
      "id": 5,
      "type": "assign",
      "from": {
        "location": "incoming",
        "name": "formData",
        "ptr": "/state"
      },
      "to": {
        "location": "outgoing",
        "name": "state",
        "ptr": ""
      }
    }
  ],
  "functions": [],
  "view": {
    "col": 4,
    "row": 5
  },
  "created": "2020-12-28T13:36:30.429Z",
  "createdBy": {
    "_id": "5fd0f140d662ab4e4881f056",
    "provenance": "LDAP Server",
    "username": "abhansali"
  },
  "lastUpdated": "2020-12-28T13:36:30.429Z",
  "lastUpdatedBy": {
    "_id": "5fd0f140d662ab4e4881f056",
    "provenance": "LDAP Server",
    "username": "abhansali"
  }
}